%
M48
M72
T01C0.0236
T02C0.0276
T03C0.0320
T04C0.0394
T05C0.0400
T06C0.1000
%
T01
X4301Y4001
X5751Y5651
X6051Y6151
X6851Y6701
X7851Y6201
X8351Y5951
X9151Y6051
X10451Y8351
X11251Y8301
X13701Y10651
X13801Y11251
X16101Y9201
X16251Y8351
X16001Y7851
X15451Y6601
X15851Y6051
X16451Y5901
X18651Y8151
X15701Y15301
X16251Y15851
X16451Y16551
X15251Y17851
X13851Y16251
X14351Y16001
X13001Y16051
X11501Y13651
X10951Y13801
X10201Y12651
X10201Y12001
X10201Y11451
X10151Y10901
X8451Y11451
X8401Y10901
X8101Y13351
X7801Y14001
X6201Y14251
X5901Y13801
X6051Y13051
X3751Y14101
X4451Y20751
X18001Y16901
T02
X19601Y19301
X20601Y19301
X19401Y2601
X19401Y1601
X2601Y2801
X1601Y2801
T03
X5101Y5101
X5101Y6101
X5101Y7101
X5101Y8101
X5101Y9101
X5101Y10101
X5101Y11101
X5101Y12101
X5101Y13101
X5101Y14101
X5101Y17101
X6101Y17101
X7101Y17101
X8101Y17101
X9101Y17101
X10101Y17101
X11101Y17101
X12101Y17101
X13101Y17101
X14101Y17101
X17101Y17101
X17101Y16101
X17101Y15101
X17101Y14101
X17101Y13101
X17101Y12101
X17101Y11101
X17101Y10101
X17101Y9101
X17101Y8101
X17101Y5101
X16101Y5101
X15101Y5101
X14101Y5101
X13101Y5101
X12101Y5101
X11101Y5101
X10101Y5101
X9101Y5101
X8101Y5101
T04
X5101Y19601
T05
X6101Y19601
X6101Y20601
X7101Y20601
X8101Y20601
X8101Y19601
X7101Y19601
X7101Y18601
X8101Y18601
X9101Y18601
X10101Y18601
X10101Y19601
X10101Y20601
X9101Y20601
X9101Y19601
X11101Y19601
X11101Y20601
X12101Y20601
X12101Y19601
X13101Y19601
X13101Y20601
X14601Y20601
X14601Y19601
X14601Y18601
X13101Y18601
X12101Y18601
X11101Y18601
X6101Y18601
X2601Y19101
X2601Y20101
X1601Y20101
X1601Y19101
X1601Y18101
X2601Y18101
X2601Y17101
X1601Y17101
X1601Y16101
X2601Y16101
X2601Y13101
X2601Y12101
X1601Y12101
X1601Y13101
X3601Y13101
X3601Y12101
X3601Y11101
X3601Y10101
X3601Y9101
X3601Y8101
X3601Y7101
X3601Y6101
X2601Y6101
X1601Y6101
X1601Y7101
X1601Y8101
X2601Y8101
X2601Y7101
X2601Y9101
X2601Y10101
X2601Y11101
X1601Y11101
X1601Y10101
X1601Y9101
X1601Y4601
X2601Y4601
X3601Y4601
X4101Y2601
X5101Y2601
X9101Y2601
X9101Y3601
X10101Y3601
X10101Y2601
X10101Y1601
X9101Y1601
X11101Y1601
X11101Y2601
X11101Y3601
X12101Y3601
X12101Y2601
X12101Y1601
X13101Y1601
X13101Y2601
X13101Y3601
X14101Y3601
X14101Y2601
X14101Y1601
X15101Y1601
X15101Y2601
X15101Y3601
X16101Y3601
X16101Y2601
X16101Y1601
X17601Y1601
X17601Y2601
X17601Y3601
X19601Y4101
X19601Y5101
X19601Y9101
X19601Y10101
X19601Y11101
X20601Y11101
X20601Y10101
X20601Y9101
X18601Y9101
X18601Y10101
X18601Y11101
X18601Y12101
X18601Y13101
X18601Y14101
X18601Y15101
X18601Y16101
X19601Y16101
X20601Y16101
X20601Y15101
X20601Y14101
X19601Y14101
X19601Y15101
X19601Y13101
X20601Y13101
X20601Y12101
X19601Y12101
X19601Y17601
X20601Y17601
X18601Y17601
X18101Y19601
X17101Y19601
T06
X1101Y1101
X21101Y1101
X21101Y21101
M30
