G75*
G70*
%OFA0B0*%
%FSLAX24Y24*%
%IPPOS*%
%LPD*%
%AMOC8*
5,1,8,0,0,1.08239X$1,22.5*
%
%ADD10C,0.0748*%
%ADD11R,0.0740X0.0740*%
%ADD12C,0.0740*%
%ADD13R,0.0800X0.0800*%
%ADD14C,0.0800*%
%ADD15OC8,0.0520*%
%ADD16C,0.0650*%
%ADD17R,0.0650X0.0650*%
%ADD18C,0.1400*%
%ADD19C,0.0160*%
%ADD20C,0.0396*%
D10*
X018690Y004124D03*
X018690Y005124D03*
X018690Y006124D03*
X018690Y007124D03*
X018690Y008124D03*
X018690Y009124D03*
X018690Y010124D03*
X018690Y011124D03*
X020690Y010624D03*
X020690Y009624D03*
X020690Y008624D03*
X020690Y007624D03*
X020690Y006624D03*
X020690Y005624D03*
X020690Y004624D03*
D11*
X001131Y008101D03*
D12*
X001131Y007101D03*
X001131Y006101D03*
X001131Y005101D03*
X001131Y004101D03*
X001131Y003101D03*
X003131Y003101D03*
X003131Y004101D03*
X003131Y005601D03*
X003131Y006601D03*
X004631Y007851D03*
X004131Y008601D03*
X005131Y008601D03*
X006131Y006601D03*
X006131Y005601D03*
X006131Y004101D03*
X006131Y003101D03*
X004631Y001851D03*
X004131Y001101D03*
X005131Y001101D03*
X009131Y002601D03*
X009131Y003601D03*
X009131Y005101D03*
X012131Y005101D03*
X013631Y005101D03*
X016631Y005101D03*
X016631Y003601D03*
X016631Y002601D03*
X016631Y009601D03*
X016631Y011101D03*
X016631Y012101D03*
X013631Y009601D03*
X012131Y009601D03*
X009131Y009601D03*
X009131Y011101D03*
X009131Y012101D03*
D13*
X012131Y012601D03*
X001631Y010101D03*
X013631Y002101D03*
D14*
X012253Y002101D03*
X001631Y011479D03*
X013509Y012601D03*
D15*
X015131Y012601D03*
X015131Y013601D03*
X015131Y011601D03*
X015131Y010601D03*
X010631Y010601D03*
X010631Y011601D03*
X010631Y012601D03*
X010631Y013601D03*
X010631Y004101D03*
X010631Y003101D03*
X010631Y002101D03*
X010631Y001101D03*
X015131Y001101D03*
X015131Y002101D03*
X015131Y003101D03*
X015131Y004101D03*
D16*
X005631Y010601D03*
D17*
X005631Y012601D03*
D18*
X001131Y013601D03*
X001131Y001101D03*
X021631Y001101D03*
X021631Y013601D03*
D19*
X000611Y002068D02*
X000611Y000581D01*
X004793Y000581D01*
X004785Y000584D01*
X004614Y000755D01*
X004521Y000979D01*
X004521Y001222D01*
X004529Y001241D01*
X004510Y001241D01*
X004285Y001334D01*
X004114Y001505D01*
X004021Y001729D01*
X004021Y001888D01*
X003812Y001679D01*
X003695Y001631D01*
X003567Y001631D01*
X002017Y001631D01*
X001900Y001679D01*
X001810Y001769D01*
X001648Y001931D01*
X000945Y001931D01*
X000817Y001931D01*
X000700Y001979D01*
X000611Y002068D01*
X000611Y002003D02*
X000676Y002003D01*
X000611Y001845D02*
X001734Y001845D01*
X001893Y001686D02*
X000611Y001686D01*
X000611Y001528D02*
X004105Y001528D01*
X004039Y001686D02*
X003819Y001686D01*
X003978Y001845D02*
X004021Y001845D01*
X003631Y001951D02*
X004331Y002651D01*
X005231Y002651D01*
X005581Y002301D01*
X006581Y002301D01*
X006881Y002601D01*
X006881Y003651D01*
X007201Y003351D02*
X007252Y003403D01*
X007319Y003564D01*
X007319Y003738D01*
X007252Y003899D01*
X007129Y004022D01*
X006968Y004089D01*
X006794Y004089D01*
X006741Y004067D01*
X006741Y004222D01*
X006648Y004446D01*
X006477Y004618D01*
X006252Y004711D01*
X006010Y004711D01*
X005785Y004618D01*
X005614Y004446D01*
X005521Y004222D01*
X005521Y003979D01*
X005614Y003755D01*
X005768Y003601D01*
X005614Y003446D01*
X005521Y003222D01*
X005521Y002979D01*
X005614Y002755D01*
X005748Y002621D01*
X005714Y002621D01*
X005412Y002922D01*
X005295Y002971D01*
X005167Y002971D01*
X004454Y002971D01*
X004802Y003319D01*
X004851Y003437D01*
X004851Y003564D01*
X004851Y006168D01*
X005603Y006920D01*
X005521Y006722D01*
X005521Y006479D01*
X005614Y006255D01*
X005768Y006101D01*
X005614Y005946D01*
X005521Y005722D01*
X005521Y005479D01*
X005614Y005255D01*
X005785Y005084D01*
X006010Y004991D01*
X006252Y004991D01*
X006477Y005084D01*
X006648Y005255D01*
X006741Y005479D01*
X006741Y005722D01*
X006648Y005946D01*
X006494Y006101D01*
X006648Y006255D01*
X006741Y006479D01*
X006741Y006722D01*
X006648Y006946D01*
X006477Y007118D01*
X006252Y007211D01*
X006010Y007211D01*
X005811Y007129D01*
X005964Y007281D01*
X006631Y007281D01*
X006683Y007229D01*
X006844Y007163D01*
X007018Y007163D01*
X007179Y007229D01*
X007302Y007353D01*
X007369Y007514D01*
X007369Y007688D01*
X007302Y007849D01*
X007179Y007972D01*
X007018Y008039D01*
X006844Y008039D01*
X006683Y007972D01*
X006631Y007921D01*
X005767Y007921D01*
X005650Y007872D01*
X005560Y007782D01*
X004350Y006572D01*
X004350Y006572D01*
X004260Y006482D01*
X004211Y006364D01*
X004211Y003633D01*
X004201Y003623D01*
X004201Y006364D01*
X004152Y006482D01*
X004062Y006572D01*
X003762Y006872D01*
X003662Y006914D01*
X003648Y006946D01*
X003477Y007118D01*
X003252Y007211D01*
X003010Y007211D01*
X002785Y007118D01*
X002614Y006946D01*
X002521Y006722D01*
X002521Y006479D01*
X002614Y006255D01*
X002768Y006101D01*
X002614Y005946D01*
X002521Y005722D01*
X002521Y005693D01*
X001694Y004866D01*
X001741Y004979D01*
X001741Y005222D01*
X001648Y005446D01*
X001494Y005601D01*
X001648Y005755D01*
X001741Y005979D01*
X001741Y006222D01*
X001648Y006446D01*
X001494Y006601D01*
X002521Y006601D01*
X002536Y006443D02*
X001650Y006443D01*
X001715Y006284D02*
X002602Y006284D01*
X002744Y006125D02*
X001741Y006125D01*
X001736Y005967D02*
X002634Y005967D01*
X002557Y005808D02*
X001670Y005808D01*
X001543Y005650D02*
X002478Y005650D01*
X002319Y005491D02*
X001603Y005491D01*
X001695Y005333D02*
X002160Y005333D01*
X002002Y005174D02*
X001741Y005174D01*
X001741Y005016D02*
X001843Y005016D01*
X001381Y004101D02*
X002881Y005601D01*
X003131Y005601D01*
X003881Y006301D02*
X003881Y003501D01*
X003531Y003151D01*
X003181Y003151D01*
X003131Y003101D01*
X004201Y003747D02*
X004211Y003747D01*
X004201Y003906D02*
X004211Y003906D01*
X004201Y004064D02*
X004211Y004064D01*
X004201Y004223D02*
X004211Y004223D01*
X004201Y004381D02*
X004211Y004381D01*
X004201Y004540D02*
X004211Y004540D01*
X004201Y004699D02*
X004211Y004699D01*
X004201Y004857D02*
X004211Y004857D01*
X004201Y005016D02*
X004211Y005016D01*
X004201Y005174D02*
X004211Y005174D01*
X004201Y005333D02*
X004211Y005333D01*
X004201Y005491D02*
X004211Y005491D01*
X004201Y005650D02*
X004211Y005650D01*
X004201Y005808D02*
X004211Y005808D01*
X004201Y005967D02*
X004211Y005967D01*
X004201Y006125D02*
X004211Y006125D01*
X004201Y006284D02*
X004211Y006284D01*
X004243Y006443D02*
X004169Y006443D01*
X004033Y006601D02*
X004379Y006601D01*
X004537Y006760D02*
X003875Y006760D01*
X003581Y006601D02*
X003881Y006301D01*
X003581Y006601D02*
X003131Y006601D01*
X002537Y006760D02*
X001650Y006760D01*
X001648Y006755D02*
X001741Y006979D01*
X001741Y007222D01*
X001648Y007446D01*
X001477Y007618D01*
X001252Y007711D01*
X001010Y007711D01*
X000785Y007618D01*
X000614Y007446D01*
X000611Y007439D01*
X000611Y014117D01*
X022121Y014117D01*
X022121Y000581D01*
X005469Y000581D01*
X005477Y000584D01*
X005648Y000755D01*
X005741Y000979D01*
X005741Y001222D01*
X005648Y001446D01*
X005477Y001618D01*
X005252Y001711D01*
X005233Y001711D01*
X005241Y001729D01*
X005241Y001972D01*
X005148Y002196D01*
X005014Y002331D01*
X005098Y002331D01*
X005400Y002029D01*
X005517Y001981D01*
X005645Y001981D01*
X006645Y001981D01*
X006762Y002029D01*
X006852Y002119D01*
X007152Y002419D01*
X007201Y002537D01*
X007201Y002664D01*
X007201Y003351D01*
X007201Y003272D02*
X008607Y003272D01*
X008614Y003255D02*
X008768Y003101D01*
X008614Y002946D01*
X008521Y002722D01*
X008521Y002479D01*
X007177Y002479D01*
X007201Y002637D02*
X008521Y002637D01*
X008521Y002479D02*
X008614Y002255D01*
X008785Y002084D01*
X009010Y001991D01*
X009252Y001991D01*
X009477Y002084D01*
X009648Y002255D01*
X009741Y002479D01*
X010302Y002479D01*
X010424Y002601D02*
X010131Y002308D01*
X010131Y001894D01*
X010424Y001601D01*
X010838Y001601D01*
X011131Y001894D01*
X011131Y002308D01*
X010838Y002601D01*
X011131Y002894D01*
X011131Y003308D01*
X010838Y003601D01*
X010424Y003601D01*
X010131Y003308D01*
X010131Y002894D01*
X010424Y002601D01*
X010838Y002601D01*
X010424Y002601D01*
X010387Y002637D02*
X009741Y002637D01*
X009741Y002722D02*
X009741Y002479D01*
X009675Y002320D02*
X010144Y002320D01*
X010131Y002162D02*
X009555Y002162D01*
X009283Y002003D02*
X010131Y002003D01*
X010180Y001845D02*
X005241Y001845D01*
X005228Y002003D02*
X005463Y002003D01*
X005267Y002162D02*
X005162Y002162D01*
X005109Y002320D02*
X005024Y002320D01*
X005697Y002637D02*
X005732Y002637D01*
X005597Y002796D02*
X005538Y002796D01*
X005531Y002955D02*
X005334Y002955D01*
X005521Y003113D02*
X004596Y003113D01*
X004754Y003272D02*
X005542Y003272D01*
X005607Y003430D02*
X004848Y003430D01*
X004851Y003589D02*
X005756Y003589D01*
X005622Y003747D02*
X004851Y003747D01*
X004851Y003906D02*
X005551Y003906D01*
X005521Y004064D02*
X004851Y004064D01*
X004851Y004223D02*
X005521Y004223D01*
X005587Y004381D02*
X004851Y004381D01*
X004851Y004540D02*
X005708Y004540D01*
X005980Y004699D02*
X004851Y004699D01*
X004851Y004857D02*
X008572Y004857D01*
X008614Y004755D02*
X008521Y004979D01*
X008521Y005222D01*
X008614Y005446D01*
X008785Y005618D01*
X009010Y005711D01*
X009252Y005711D01*
X009477Y005618D01*
X009648Y005446D01*
X009741Y005222D01*
X009741Y004979D01*
X009648Y004755D01*
X009477Y004584D01*
X009451Y004573D01*
X009451Y004128D01*
X009477Y004118D01*
X009648Y003946D01*
X009741Y003722D01*
X009741Y003479D01*
X009648Y003255D01*
X009494Y003101D01*
X009648Y002946D01*
X009741Y002722D01*
X009710Y002796D02*
X010229Y002796D01*
X010131Y002955D02*
X009640Y002955D01*
X009506Y003113D02*
X010131Y003113D01*
X010131Y003272D02*
X009655Y003272D01*
X009721Y003430D02*
X010253Y003430D01*
X010412Y003589D02*
X009741Y003589D01*
X009731Y003747D02*
X016031Y003747D01*
X016021Y003722D02*
X016021Y003479D01*
X016114Y003255D01*
X016268Y003101D01*
X016114Y002946D01*
X016021Y002722D01*
X016021Y002479D01*
X015460Y002479D01*
X015338Y002601D02*
X014924Y002601D01*
X015338Y002601D01*
X015631Y002894D01*
X015631Y003308D01*
X015338Y003601D01*
X014924Y003601D01*
X014631Y003308D01*
X014631Y002894D01*
X014924Y002601D01*
X014631Y002308D01*
X014631Y001894D01*
X014924Y001601D01*
X015338Y001601D01*
X015631Y001894D01*
X015631Y002308D01*
X015338Y002601D01*
X015375Y002637D02*
X016021Y002637D01*
X016021Y002479D02*
X016114Y002255D01*
X016285Y002084D01*
X016510Y001991D01*
X016752Y001991D01*
X016977Y002084D01*
X017148Y002255D01*
X017241Y002479D01*
X022121Y002479D01*
X022121Y002637D02*
X017241Y002637D01*
X017241Y002722D02*
X017241Y002479D01*
X017175Y002320D02*
X022121Y002320D01*
X022121Y002162D02*
X017055Y002162D01*
X016783Y002003D02*
X022121Y002003D01*
X022121Y001845D02*
X015582Y001845D01*
X015631Y002003D02*
X016479Y002003D01*
X016207Y002162D02*
X015631Y002162D01*
X015618Y002320D02*
X016087Y002320D01*
X016052Y002796D02*
X015533Y002796D01*
X015631Y002955D02*
X016122Y002955D01*
X016256Y003113D02*
X015631Y003113D01*
X015631Y003272D02*
X016107Y003272D01*
X016041Y003430D02*
X015509Y003430D01*
X015350Y003589D02*
X016021Y003589D01*
X016021Y003722D02*
X016114Y003946D01*
X016285Y004118D01*
X016311Y004128D01*
X016311Y004573D01*
X016285Y004584D01*
X016114Y004755D01*
X016021Y004979D01*
X016021Y005222D01*
X016114Y005446D01*
X016285Y005618D01*
X016510Y005711D01*
X016752Y005711D01*
X016977Y005618D01*
X017148Y005446D01*
X017241Y005222D01*
X017241Y004979D01*
X017148Y004755D01*
X016977Y004584D01*
X016951Y004573D01*
X016951Y004128D01*
X016977Y004118D01*
X017148Y003946D01*
X017241Y003722D01*
X017241Y003479D01*
X017148Y003255D01*
X016994Y003101D01*
X017148Y002946D01*
X017241Y002722D01*
X017210Y002796D02*
X022121Y002796D01*
X022121Y002955D02*
X017140Y002955D01*
X017006Y003113D02*
X022121Y003113D01*
X022121Y003272D02*
X017155Y003272D01*
X017221Y003430D02*
X022121Y003430D01*
X022121Y003589D02*
X019001Y003589D01*
X019038Y003604D02*
X019211Y003777D01*
X019304Y004002D01*
X019304Y004247D01*
X019211Y004472D01*
X019058Y004624D01*
X019211Y004777D01*
X019304Y005002D01*
X019304Y005247D01*
X019211Y005472D01*
X019058Y005624D01*
X019211Y005777D01*
X019304Y006002D01*
X019304Y006247D01*
X019211Y006472D01*
X019058Y006624D01*
X019211Y006777D01*
X019304Y007002D01*
X019304Y007247D01*
X019211Y007472D01*
X019058Y007624D01*
X019211Y007777D01*
X019304Y008002D01*
X019304Y008247D01*
X019211Y008472D01*
X019058Y008624D01*
X019211Y008777D01*
X019304Y009002D01*
X019304Y009247D01*
X019211Y009472D01*
X019058Y009624D01*
X019211Y009777D01*
X019304Y010002D01*
X019304Y010247D01*
X019211Y010472D01*
X019058Y010624D01*
X019211Y010777D01*
X019304Y011002D01*
X019304Y011247D01*
X019211Y011472D01*
X019038Y011645D01*
X018812Y011738D01*
X018568Y011738D01*
X018342Y011645D01*
X018170Y011472D01*
X018076Y011247D01*
X018076Y011002D01*
X018170Y010777D01*
X018322Y010624D01*
X018170Y010472D01*
X018076Y010247D01*
X018076Y010002D01*
X018170Y009777D01*
X018322Y009624D01*
X018170Y009472D01*
X018076Y009247D01*
X018076Y009002D01*
X018170Y008777D01*
X018322Y008624D01*
X018170Y008472D01*
X018076Y008247D01*
X018076Y008002D01*
X018170Y007777D01*
X018322Y007624D01*
X018170Y007472D01*
X018076Y007247D01*
X018076Y007002D01*
X018170Y006777D01*
X018322Y006624D01*
X018170Y006472D01*
X018076Y006247D01*
X018076Y006002D01*
X018170Y005777D01*
X018322Y005624D01*
X018170Y005472D01*
X018076Y005247D01*
X018076Y005002D01*
X018170Y004777D01*
X018322Y004624D01*
X018170Y004472D01*
X018076Y004247D01*
X018076Y004002D01*
X018170Y003777D01*
X018342Y003604D01*
X018568Y003510D01*
X018812Y003510D01*
X019038Y003604D01*
X019181Y003747D02*
X022121Y003747D01*
X022121Y003906D02*
X019264Y003906D01*
X019304Y004064D02*
X020438Y004064D01*
X020342Y004104D02*
X020568Y004010D01*
X020812Y004010D01*
X021038Y004104D01*
X021211Y004277D01*
X021304Y004502D01*
X021304Y004747D01*
X021211Y004972D01*
X021058Y005124D01*
X021211Y005277D01*
X021304Y005502D01*
X021304Y005747D01*
X021211Y005972D01*
X021058Y006124D01*
X021211Y006277D01*
X021304Y006502D01*
X021304Y006747D01*
X021211Y006972D01*
X021038Y007145D01*
X020812Y007238D01*
X020568Y007238D01*
X020342Y007145D01*
X020170Y006972D01*
X020076Y006747D01*
X020076Y006502D01*
X020170Y006277D01*
X020322Y006124D01*
X020170Y005972D01*
X020076Y005747D01*
X020076Y005502D01*
X020170Y005277D01*
X020322Y005124D01*
X020170Y004972D01*
X020076Y004747D01*
X020076Y004502D01*
X020170Y004277D01*
X020342Y004104D01*
X020223Y004223D02*
X019304Y004223D01*
X019248Y004381D02*
X020126Y004381D01*
X020076Y004540D02*
X019143Y004540D01*
X019133Y004699D02*
X020076Y004699D01*
X020122Y004857D02*
X019244Y004857D01*
X019304Y005016D02*
X020213Y005016D01*
X020272Y005174D02*
X019304Y005174D01*
X019268Y005333D02*
X020146Y005333D01*
X020081Y005491D02*
X019192Y005491D01*
X019084Y005650D02*
X020076Y005650D01*
X020102Y005808D02*
X019224Y005808D01*
X019289Y005967D02*
X020167Y005967D01*
X020321Y006125D02*
X019304Y006125D01*
X019289Y006284D02*
X020166Y006284D01*
X020101Y006443D02*
X019223Y006443D01*
X019082Y006601D02*
X020076Y006601D01*
X020081Y006760D02*
X019194Y006760D01*
X019269Y006918D02*
X020147Y006918D01*
X020274Y007077D02*
X019304Y007077D01*
X019304Y007235D02*
X020560Y007235D01*
X020820Y007235D02*
X022121Y007235D01*
X022121Y007077D02*
X021106Y007077D01*
X021233Y006918D02*
X022121Y006918D01*
X022121Y006760D02*
X021299Y006760D01*
X021304Y006601D02*
X022121Y006601D01*
X022121Y006443D02*
X021279Y006443D01*
X021214Y006284D02*
X022121Y006284D01*
X022121Y006125D02*
X021059Y006125D01*
X021213Y005967D02*
X022121Y005967D01*
X022121Y005808D02*
X021278Y005808D01*
X021304Y005650D02*
X022121Y005650D01*
X022121Y005491D02*
X021299Y005491D01*
X021234Y005333D02*
X022121Y005333D01*
X022121Y005174D02*
X021108Y005174D01*
X021167Y005016D02*
X022121Y005016D01*
X022121Y004857D02*
X021258Y004857D01*
X021304Y004699D02*
X022121Y004699D01*
X022121Y004540D02*
X021304Y004540D01*
X021254Y004381D02*
X022121Y004381D01*
X022121Y004223D02*
X021157Y004223D01*
X020943Y004064D02*
X022121Y004064D01*
X022121Y001686D02*
X015424Y001686D01*
X015338Y001601D02*
X014924Y001601D01*
X014631Y001308D01*
X014631Y000894D01*
X014924Y000601D01*
X015338Y000601D01*
X015631Y000894D01*
X015631Y001308D01*
X015338Y001601D01*
X015411Y001528D02*
X022121Y001528D01*
X022121Y001369D02*
X015570Y001369D01*
X015631Y001211D02*
X022121Y001211D01*
X022121Y001052D02*
X015631Y001052D01*
X015631Y000894D02*
X022121Y000894D01*
X022121Y000735D02*
X015472Y000735D01*
X014790Y000735D02*
X010972Y000735D01*
X010838Y000601D02*
X011131Y000894D01*
X011131Y001308D01*
X010838Y001601D01*
X010424Y001601D01*
X010131Y001308D01*
X010131Y000894D01*
X010424Y000601D01*
X010838Y000601D01*
X011131Y000894D02*
X014631Y000894D01*
X014631Y001052D02*
X011131Y001052D01*
X011131Y001211D02*
X014631Y001211D01*
X014692Y001369D02*
X011070Y001369D01*
X010911Y001528D02*
X011964Y001528D01*
X011891Y001558D02*
X012126Y001461D01*
X012380Y001461D01*
X012616Y001558D01*
X012796Y001738D01*
X012893Y001973D01*
X012893Y002228D01*
X012796Y002463D01*
X012616Y002643D01*
X012380Y002741D01*
X012126Y002741D01*
X011891Y002643D01*
X011711Y002463D01*
X011613Y002228D01*
X011613Y001973D01*
X011711Y001738D01*
X011891Y001558D01*
X011763Y001686D02*
X010924Y001686D01*
X011082Y001845D02*
X011666Y001845D01*
X011613Y002003D02*
X011131Y002003D01*
X011131Y002162D02*
X011613Y002162D01*
X011651Y002320D02*
X011118Y002320D01*
X010960Y002479D02*
X011726Y002479D01*
X011885Y002637D02*
X010875Y002637D01*
X011033Y002796D02*
X014729Y002796D01*
X014631Y002955D02*
X011131Y002955D01*
X011131Y003113D02*
X014631Y003113D01*
X014631Y003272D02*
X011131Y003272D01*
X011009Y003430D02*
X014753Y003430D01*
X014912Y003589D02*
X010850Y003589D01*
X009665Y003906D02*
X016097Y003906D01*
X016232Y004064D02*
X009530Y004064D01*
X009451Y004223D02*
X016311Y004223D01*
X016311Y004381D02*
X009451Y004381D01*
X009451Y004540D02*
X016311Y004540D01*
X016171Y004699D02*
X009591Y004699D01*
X009690Y004857D02*
X016072Y004857D01*
X016021Y005016D02*
X009741Y005016D01*
X009741Y005174D02*
X016021Y005174D01*
X016067Y005333D02*
X009695Y005333D01*
X009603Y005491D02*
X016159Y005491D01*
X016363Y005650D02*
X009399Y005650D01*
X008863Y005650D02*
X006741Y005650D01*
X006741Y005491D02*
X008659Y005491D01*
X008567Y005333D02*
X006680Y005333D01*
X006567Y005174D02*
X008521Y005174D01*
X008521Y005016D02*
X006312Y005016D01*
X005950Y005016D02*
X004851Y005016D01*
X004851Y005174D02*
X005695Y005174D01*
X005582Y005333D02*
X004851Y005333D01*
X004851Y005491D02*
X005521Y005491D01*
X005521Y005650D02*
X004851Y005650D01*
X004851Y005808D02*
X005557Y005808D01*
X005634Y005967D02*
X004851Y005967D01*
X004851Y006125D02*
X005744Y006125D01*
X005602Y006284D02*
X004967Y006284D01*
X005125Y006443D02*
X005536Y006443D01*
X005521Y006601D02*
X005284Y006601D01*
X005442Y006760D02*
X005537Y006760D01*
X005601Y006918D02*
X005602Y006918D01*
X005918Y007235D02*
X006677Y007235D01*
X006518Y007077D02*
X018076Y007077D01*
X018076Y007235D02*
X007185Y007235D01*
X007319Y007394D02*
X018137Y007394D01*
X018250Y007552D02*
X007369Y007552D01*
X007360Y007711D02*
X018235Y007711D01*
X018131Y007869D02*
X007282Y007869D01*
X007044Y008028D02*
X018076Y008028D01*
X018076Y008186D02*
X005152Y008186D01*
X005148Y008196D02*
X004977Y008368D01*
X004752Y008461D01*
X004733Y008461D01*
X004741Y008479D01*
X004741Y008722D01*
X004648Y008946D01*
X004477Y009118D01*
X004252Y009211D01*
X004010Y009211D01*
X003785Y009118D01*
X003614Y008946D01*
X003521Y008722D01*
X003521Y008479D01*
X003614Y008255D01*
X003785Y008084D01*
X004010Y007991D01*
X004029Y007991D01*
X004021Y007972D01*
X004021Y007729D01*
X004114Y007505D01*
X004285Y007334D01*
X004510Y007241D01*
X004752Y007241D01*
X004977Y007334D01*
X005148Y007505D01*
X005241Y007729D01*
X005241Y007972D01*
X005148Y008196D01*
X005218Y008028D02*
X006818Y008028D01*
X006931Y007601D02*
X005831Y007601D01*
X004531Y006301D01*
X004531Y003501D01*
X003431Y002401D01*
X002631Y002401D01*
X001931Y003101D01*
X001131Y003101D01*
X000431Y002701D02*
X000431Y005751D01*
X000781Y006101D01*
X001131Y006101D01*
X001494Y006601D02*
X001648Y006755D01*
X001716Y006918D02*
X002602Y006918D01*
X002744Y007077D02*
X001741Y007077D01*
X001736Y007235D02*
X005013Y007235D01*
X005037Y007394D02*
X005171Y007394D01*
X005168Y007552D02*
X005330Y007552D01*
X005233Y007711D02*
X005489Y007711D01*
X005560Y007782D02*
X005560Y007782D01*
X005647Y007869D02*
X005241Y007869D01*
X004999Y008345D02*
X018117Y008345D01*
X018201Y008504D02*
X004741Y008504D01*
X004741Y008662D02*
X018284Y008662D01*
X018151Y008821D02*
X004700Y008821D01*
X005131Y008601D02*
X005631Y009101D01*
X005631Y010601D01*
X008031Y010601D01*
X008281Y010351D01*
X010381Y010351D01*
X010631Y010601D01*
X010424Y011101D02*
X010838Y011101D01*
X011131Y011394D01*
X011131Y011808D01*
X010838Y012101D01*
X011131Y012394D01*
X011131Y012808D01*
X010838Y013101D01*
X011131Y013394D01*
X011131Y013808D01*
X010838Y014101D01*
X010424Y014101D01*
X010131Y013808D01*
X010131Y013394D01*
X010424Y013101D01*
X010838Y013101D01*
X010424Y013101D01*
X010131Y012808D01*
X010131Y012394D01*
X010424Y012101D01*
X010838Y012101D01*
X010424Y012101D01*
X010131Y011808D01*
X010131Y011394D01*
X010424Y011101D01*
X010326Y011199D02*
X009741Y011199D01*
X009741Y011222D02*
X009648Y011446D01*
X009494Y011601D01*
X009648Y011755D01*
X009741Y011979D01*
X009741Y012222D01*
X009648Y012446D01*
X009477Y012618D01*
X009252Y012711D01*
X009010Y012711D01*
X008785Y012618D01*
X008614Y012446D01*
X008521Y012222D01*
X008521Y011979D01*
X008614Y011755D01*
X008768Y011601D01*
X008614Y011446D01*
X008521Y011222D01*
X008521Y010979D01*
X008614Y010755D01*
X008785Y010584D01*
X009010Y010491D01*
X009252Y010491D01*
X009477Y010584D01*
X009648Y010755D01*
X009741Y010979D01*
X009741Y011222D01*
X009685Y011357D02*
X010167Y011357D01*
X010131Y011516D02*
X009579Y011516D01*
X009567Y011674D02*
X010131Y011674D01*
X010156Y011833D02*
X009680Y011833D01*
X009741Y011992D02*
X010315Y011992D01*
X010375Y012150D02*
X009741Y012150D01*
X009705Y012309D02*
X010216Y012309D01*
X010131Y012467D02*
X009627Y012467D01*
X009458Y012626D02*
X010131Y012626D01*
X010131Y012784D02*
X006196Y012784D01*
X006196Y012626D02*
X008804Y012626D01*
X008635Y012467D02*
X006196Y012467D01*
X006196Y012309D02*
X008557Y012309D01*
X008521Y012150D02*
X006164Y012150D01*
X006159Y012140D02*
X006196Y012228D01*
X006196Y012974D01*
X006159Y013062D01*
X006092Y013129D01*
X006004Y013166D01*
X005258Y013166D01*
X005170Y013129D01*
X005103Y013062D01*
X005066Y012974D01*
X005066Y012228D01*
X005103Y012140D01*
X005170Y012072D01*
X005258Y012036D01*
X006004Y012036D01*
X006092Y012072D01*
X006159Y012140D01*
X005098Y012150D02*
X000611Y012150D01*
X000611Y011992D02*
X001239Y011992D01*
X001268Y012021D02*
X001088Y011841D01*
X000991Y011606D01*
X000991Y011351D01*
X001088Y011116D01*
X001268Y010936D01*
X001504Y010839D01*
X001758Y010839D01*
X001994Y010936D01*
X002174Y011116D01*
X002271Y011351D01*
X002271Y011606D01*
X002174Y011841D01*
X001994Y012021D01*
X001758Y012119D01*
X001504Y012119D01*
X001268Y012021D01*
X001085Y011833D02*
X000611Y011833D01*
X000611Y011674D02*
X001019Y011674D01*
X000991Y011516D02*
X000611Y011516D01*
X000611Y011357D02*
X000991Y011357D01*
X001054Y011199D02*
X000611Y011199D01*
X000611Y011040D02*
X001164Y011040D01*
X001400Y010882D02*
X000611Y010882D01*
X000611Y010723D02*
X008646Y010723D01*
X008831Y010565D02*
X000611Y010565D01*
X000611Y010406D02*
X016311Y010406D01*
X016311Y010248D02*
X000611Y010248D01*
X000611Y010089D02*
X008757Y010089D01*
X008785Y010118D02*
X008614Y009946D01*
X008521Y009722D01*
X008521Y009479D01*
X008614Y009255D01*
X008785Y009084D01*
X009010Y008991D01*
X009252Y008991D01*
X009477Y009084D01*
X009648Y009255D01*
X009741Y009479D01*
X009741Y009722D01*
X009648Y009946D01*
X009477Y010118D01*
X009252Y010211D01*
X009010Y010211D01*
X008785Y010118D01*
X008607Y009930D02*
X000611Y009930D01*
X000611Y009772D02*
X008542Y009772D01*
X008521Y009613D02*
X000611Y009613D01*
X000611Y009455D02*
X008531Y009455D01*
X008597Y009296D02*
X000611Y009296D01*
X000611Y009138D02*
X003833Y009138D01*
X003647Y008979D02*
X000611Y008979D01*
X000611Y008821D02*
X003562Y008821D01*
X003521Y008662D02*
X000611Y008662D01*
X000611Y008504D02*
X003521Y008504D01*
X003577Y008345D02*
X000611Y008345D01*
X000611Y008186D02*
X003683Y008186D01*
X003920Y008028D02*
X000611Y008028D01*
X000611Y007869D02*
X004021Y007869D01*
X004029Y007711D02*
X000611Y007711D01*
X000611Y007552D02*
X000720Y007552D01*
X001542Y007552D02*
X004094Y007552D01*
X004225Y007394D02*
X001670Y007394D01*
X001131Y008101D02*
X001131Y009601D01*
X001631Y010101D01*
X001862Y010882D02*
X008561Y010882D01*
X008521Y011040D02*
X002098Y011040D01*
X002208Y011199D02*
X008521Y011199D01*
X008577Y011357D02*
X002271Y011357D01*
X002271Y011516D02*
X008684Y011516D01*
X008695Y011674D02*
X002243Y011674D01*
X002177Y011833D02*
X008582Y011833D01*
X008521Y011992D02*
X002023Y011992D01*
X000611Y012309D02*
X005066Y012309D01*
X005066Y012467D02*
X000611Y012467D01*
X000611Y012626D02*
X005066Y012626D01*
X005066Y012784D02*
X000611Y012784D01*
X000611Y012943D02*
X005066Y012943D01*
X005142Y013101D02*
X000611Y013101D01*
X000611Y013260D02*
X010265Y013260D01*
X010131Y013418D02*
X000611Y013418D01*
X000611Y013577D02*
X010131Y013577D01*
X010131Y013736D02*
X000611Y013736D01*
X000611Y013894D02*
X010217Y013894D01*
X010376Y014053D02*
X000611Y014053D01*
X001131Y013601D02*
X001731Y014201D01*
X015531Y014201D01*
X016131Y013601D01*
X021631Y013601D01*
X021631Y008201D01*
X021081Y007651D01*
X021631Y007101D01*
X021631Y001101D01*
X020981Y000451D01*
X001781Y000451D01*
X001131Y001101D01*
X000611Y001052D02*
X004521Y001052D01*
X004521Y001211D02*
X000611Y001211D01*
X000611Y001369D02*
X004250Y001369D01*
X004557Y000894D02*
X000611Y000894D01*
X000611Y000735D02*
X004634Y000735D01*
X005628Y000735D02*
X010290Y000735D01*
X010131Y000894D02*
X005705Y000894D01*
X005741Y001052D02*
X010131Y001052D01*
X010131Y001211D02*
X005741Y001211D01*
X005680Y001369D02*
X010192Y001369D01*
X010351Y001528D02*
X005567Y001528D01*
X005312Y001686D02*
X010338Y001686D01*
X008979Y002003D02*
X006699Y002003D01*
X006895Y002162D02*
X008707Y002162D01*
X008587Y002320D02*
X007053Y002320D01*
X007201Y002796D02*
X008552Y002796D01*
X008622Y002955D02*
X007201Y002955D01*
X007201Y003113D02*
X008756Y003113D01*
X008614Y003255D02*
X008521Y003479D01*
X008521Y003722D01*
X008614Y003946D01*
X008785Y004118D01*
X008811Y004128D01*
X008811Y004573D01*
X008785Y004584D01*
X008614Y004755D01*
X008671Y004699D02*
X006282Y004699D01*
X006554Y004540D02*
X008811Y004540D01*
X008811Y004381D02*
X006675Y004381D01*
X006741Y004223D02*
X008811Y004223D01*
X008732Y004064D02*
X007027Y004064D01*
X007246Y003906D02*
X008597Y003906D01*
X008531Y003747D02*
X007315Y003747D01*
X007319Y003589D02*
X008521Y003589D01*
X008541Y003430D02*
X007264Y003430D01*
X009131Y003601D02*
X009131Y005101D01*
X006705Y005808D02*
X018156Y005808D01*
X018091Y005967D02*
X006628Y005967D01*
X006518Y006125D02*
X018076Y006125D01*
X018092Y006284D02*
X006660Y006284D01*
X006726Y006443D02*
X018157Y006443D01*
X018298Y006601D02*
X006741Y006601D01*
X006725Y006760D02*
X018186Y006760D01*
X018111Y006918D02*
X006660Y006918D01*
X004854Y007077D02*
X003518Y007077D01*
X003660Y006918D02*
X004696Y006918D01*
X004615Y008979D02*
X018086Y008979D01*
X018076Y009138D02*
X017031Y009138D01*
X016977Y009084D02*
X016752Y008991D01*
X016510Y008991D01*
X016285Y009084D01*
X016114Y009255D01*
X016021Y009479D01*
X016021Y009722D01*
X016114Y009946D01*
X016285Y010118D01*
X016311Y010128D01*
X016311Y010573D01*
X016285Y010584D01*
X016114Y010755D01*
X016021Y010979D01*
X016021Y011222D01*
X016114Y011446D01*
X016268Y011601D01*
X016114Y011755D01*
X016021Y011979D01*
X016021Y012222D01*
X016114Y012446D01*
X016285Y012618D01*
X016510Y012711D01*
X016752Y012711D01*
X016977Y012618D01*
X017148Y012446D01*
X017241Y012222D01*
X017241Y011979D01*
X017148Y011755D01*
X016994Y011601D01*
X017148Y011446D01*
X017241Y011222D01*
X017241Y010979D01*
X017148Y010755D01*
X016977Y010584D01*
X016951Y010573D01*
X016951Y010128D01*
X016977Y010118D01*
X017148Y009946D01*
X017241Y009722D01*
X017241Y009479D01*
X017148Y009255D01*
X016977Y009084D01*
X017165Y009296D02*
X018097Y009296D01*
X018162Y009455D02*
X017231Y009455D01*
X017241Y009613D02*
X018311Y009613D01*
X018174Y009772D02*
X017220Y009772D01*
X017155Y009930D02*
X018106Y009930D01*
X018076Y010089D02*
X017005Y010089D01*
X016951Y010248D02*
X018076Y010248D01*
X018142Y010406D02*
X016951Y010406D01*
X016951Y010565D02*
X018262Y010565D01*
X018223Y010723D02*
X017116Y010723D01*
X017201Y010882D02*
X018126Y010882D01*
X018076Y011040D02*
X017241Y011040D01*
X017241Y011199D02*
X018076Y011199D01*
X018122Y011357D02*
X017185Y011357D01*
X017079Y011516D02*
X018213Y011516D01*
X018414Y011674D02*
X017067Y011674D01*
X017180Y011833D02*
X022121Y011833D01*
X022121Y011674D02*
X018967Y011674D01*
X019167Y011516D02*
X022121Y011516D01*
X022121Y011357D02*
X019258Y011357D01*
X019304Y011199D02*
X020472Y011199D01*
X020568Y011238D02*
X020342Y011145D01*
X020170Y010972D01*
X020076Y010747D01*
X020076Y010502D01*
X020170Y010277D01*
X020322Y010124D01*
X020170Y009972D01*
X020076Y009747D01*
X020076Y009502D01*
X020170Y009277D01*
X020322Y009124D01*
X020170Y008972D01*
X020076Y008747D01*
X020076Y008502D01*
X020170Y008277D01*
X020342Y008104D01*
X020568Y008010D01*
X020812Y008010D01*
X021038Y008104D01*
X021211Y008277D01*
X021304Y008502D01*
X021304Y008747D01*
X021211Y008972D01*
X021058Y009124D01*
X021211Y009277D01*
X021304Y009502D01*
X021304Y009747D01*
X021211Y009972D01*
X021058Y010124D01*
X021211Y010277D01*
X021304Y010502D01*
X021304Y010747D01*
X021211Y010972D01*
X021038Y011145D01*
X020812Y011238D01*
X020568Y011238D01*
X020238Y011040D02*
X019304Y011040D01*
X019254Y010882D02*
X020132Y010882D01*
X020076Y010723D02*
X019157Y010723D01*
X019118Y010565D02*
X020076Y010565D01*
X020116Y010406D02*
X019238Y010406D01*
X019304Y010248D02*
X020199Y010248D01*
X020286Y010089D02*
X019304Y010089D01*
X019274Y009930D02*
X020152Y009930D01*
X020087Y009772D02*
X019206Y009772D01*
X019069Y009613D02*
X020076Y009613D01*
X020096Y009455D02*
X019218Y009455D01*
X019283Y009296D02*
X020161Y009296D01*
X020308Y009138D02*
X019304Y009138D01*
X019294Y008979D02*
X020177Y008979D01*
X020107Y008821D02*
X019229Y008821D01*
X019096Y008662D02*
X020076Y008662D01*
X020076Y008504D02*
X019179Y008504D01*
X019263Y008345D02*
X020141Y008345D01*
X020260Y008186D02*
X019304Y008186D01*
X019304Y008028D02*
X020526Y008028D01*
X020855Y008028D02*
X022121Y008028D01*
X022121Y008186D02*
X021121Y008186D01*
X021239Y008345D02*
X022121Y008345D01*
X022121Y008504D02*
X021304Y008504D01*
X021304Y008662D02*
X022121Y008662D01*
X022121Y008821D02*
X021273Y008821D01*
X021204Y008979D02*
X022121Y008979D01*
X022121Y009138D02*
X021072Y009138D01*
X021219Y009296D02*
X022121Y009296D01*
X022121Y009455D02*
X021284Y009455D01*
X021304Y009613D02*
X022121Y009613D01*
X022121Y009772D02*
X021294Y009772D01*
X021228Y009930D02*
X022121Y009930D01*
X022121Y010089D02*
X021094Y010089D01*
X021182Y010248D02*
X022121Y010248D01*
X022121Y010406D02*
X021264Y010406D01*
X021304Y010565D02*
X022121Y010565D01*
X022121Y010723D02*
X021304Y010723D01*
X021248Y010882D02*
X022121Y010882D01*
X022121Y011040D02*
X021143Y011040D01*
X020908Y011199D02*
X022121Y011199D01*
X022121Y011992D02*
X017241Y011992D01*
X017241Y012150D02*
X022121Y012150D01*
X022121Y012309D02*
X017205Y012309D01*
X017127Y012467D02*
X022121Y012467D01*
X022121Y012626D02*
X016958Y012626D01*
X016304Y012626D02*
X015631Y012626D01*
X015631Y012784D02*
X022121Y012784D01*
X022121Y012943D02*
X015496Y012943D01*
X015631Y012808D02*
X015338Y013101D01*
X015631Y013394D01*
X015631Y013808D01*
X015338Y014101D01*
X014924Y014101D01*
X014631Y013808D01*
X014631Y013394D01*
X014924Y013101D01*
X015338Y013101D01*
X014924Y013101D01*
X014631Y012808D01*
X014631Y012394D01*
X014924Y012101D01*
X015338Y012101D01*
X015631Y012394D01*
X015631Y012808D01*
X015339Y013101D02*
X022121Y013101D01*
X022121Y013260D02*
X015497Y013260D01*
X015631Y013418D02*
X022121Y013418D01*
X022121Y013577D02*
X015631Y013577D01*
X015631Y013736D02*
X022121Y013736D01*
X022121Y013894D02*
X015545Y013894D01*
X015386Y014053D02*
X022121Y014053D01*
X016631Y011101D02*
X016631Y009601D01*
X016021Y009613D02*
X009741Y009613D01*
X009731Y009455D02*
X016031Y009455D01*
X016097Y009296D02*
X009665Y009296D01*
X009531Y009138D02*
X016231Y009138D01*
X016042Y009772D02*
X009720Y009772D01*
X009655Y009930D02*
X016107Y009930D01*
X016257Y010089D02*
X009505Y010089D01*
X009431Y010565D02*
X016311Y010565D01*
X016146Y010723D02*
X009616Y010723D01*
X009701Y010882D02*
X016061Y010882D01*
X016021Y011040D02*
X009741Y011040D01*
X010936Y011199D02*
X014826Y011199D01*
X014924Y011101D02*
X014631Y011394D01*
X014631Y011808D01*
X014924Y012101D01*
X015338Y012101D01*
X015631Y011808D01*
X015631Y011394D01*
X015338Y011101D01*
X014924Y011101D01*
X014667Y011357D02*
X011095Y011357D01*
X011131Y011516D02*
X014631Y011516D01*
X014631Y011674D02*
X011131Y011674D01*
X011106Y011833D02*
X014656Y011833D01*
X014815Y011992D02*
X013710Y011992D01*
X013636Y011961D02*
X013871Y012058D01*
X014051Y012238D01*
X014149Y012473D01*
X014149Y012728D01*
X014051Y012963D01*
X013871Y013143D01*
X013636Y013241D01*
X013382Y013241D01*
X013146Y013143D01*
X012966Y012963D01*
X012869Y012728D01*
X012869Y012473D01*
X012966Y012238D01*
X013146Y012058D01*
X013382Y011961D01*
X013636Y011961D01*
X013963Y012150D02*
X014875Y012150D01*
X014716Y012309D02*
X014081Y012309D01*
X014146Y012467D02*
X014631Y012467D01*
X014631Y012626D02*
X014149Y012626D01*
X014126Y012784D02*
X014631Y012784D01*
X014766Y012943D02*
X014060Y012943D01*
X013913Y013101D02*
X014923Y013101D01*
X014765Y013260D02*
X010997Y013260D01*
X011131Y013418D02*
X014631Y013418D01*
X014631Y013577D02*
X011131Y013577D01*
X011131Y013736D02*
X014631Y013736D01*
X014717Y013894D02*
X011045Y013894D01*
X010886Y014053D02*
X014876Y014053D01*
X013104Y013101D02*
X012749Y013101D01*
X012734Y013137D02*
X012667Y013204D01*
X012579Y013241D01*
X011683Y013241D01*
X011595Y013204D01*
X011528Y013137D01*
X011491Y013049D01*
X011491Y012153D01*
X011528Y012065D01*
X011595Y011997D01*
X011683Y011961D01*
X012579Y011961D01*
X012667Y011997D01*
X012734Y012065D01*
X012771Y012153D01*
X012771Y013049D01*
X012734Y013137D01*
X012771Y012943D02*
X012958Y012943D01*
X012892Y012784D02*
X012771Y012784D01*
X012771Y012626D02*
X012869Y012626D01*
X012872Y012467D02*
X012771Y012467D01*
X012771Y012309D02*
X012937Y012309D01*
X013055Y012150D02*
X012770Y012150D01*
X012653Y011992D02*
X013307Y011992D01*
X011609Y011992D02*
X010947Y011992D01*
X010887Y012150D02*
X011492Y012150D01*
X011491Y012309D02*
X011046Y012309D01*
X011131Y012467D02*
X011491Y012467D01*
X011491Y012626D02*
X011131Y012626D01*
X011131Y012784D02*
X011491Y012784D01*
X011491Y012943D02*
X010996Y012943D01*
X010839Y013101D02*
X011513Y013101D01*
X010423Y013101D02*
X006120Y013101D01*
X006196Y012943D02*
X010266Y012943D01*
X013631Y009601D02*
X014631Y010601D01*
X015131Y010601D01*
X015436Y011199D02*
X016021Y011199D01*
X016077Y011357D02*
X015595Y011357D01*
X015631Y011516D02*
X016184Y011516D01*
X016195Y011674D02*
X015631Y011674D01*
X015606Y011833D02*
X016082Y011833D01*
X016021Y011992D02*
X015447Y011992D01*
X015387Y012150D02*
X016021Y012150D01*
X016057Y012309D02*
X015546Y012309D01*
X015631Y012467D02*
X016135Y012467D01*
X013631Y009601D02*
X013631Y005101D01*
X014631Y004101D01*
X015131Y004101D01*
X016631Y003601D02*
X016631Y005101D01*
X017195Y005333D02*
X018112Y005333D01*
X018076Y005174D02*
X017241Y005174D01*
X017241Y005016D02*
X018076Y005016D01*
X018136Y004857D02*
X017190Y004857D01*
X017091Y004699D02*
X018248Y004699D01*
X018237Y004540D02*
X016951Y004540D01*
X016951Y004381D02*
X018132Y004381D01*
X018076Y004223D02*
X016951Y004223D01*
X017030Y004064D02*
X018076Y004064D01*
X018116Y003906D02*
X017165Y003906D01*
X017231Y003747D02*
X018199Y003747D01*
X018379Y003589D02*
X017241Y003589D01*
X014887Y002637D02*
X014234Y002637D01*
X014167Y002704D01*
X014079Y002741D01*
X013183Y002741D01*
X013095Y002704D01*
X013028Y002637D01*
X012991Y002549D01*
X012991Y001653D01*
X013028Y001565D01*
X013095Y001497D01*
X013183Y001461D01*
X014079Y001461D01*
X014167Y001497D01*
X014234Y001565D01*
X014271Y001653D01*
X014271Y002549D01*
X014234Y002637D01*
X014271Y002479D02*
X014802Y002479D01*
X014644Y002320D02*
X014271Y002320D01*
X014271Y002162D02*
X014631Y002162D01*
X014631Y002003D02*
X014271Y002003D01*
X014271Y001845D02*
X014680Y001845D01*
X014838Y001686D02*
X014271Y001686D01*
X014197Y001528D02*
X014851Y001528D01*
X013065Y001528D02*
X012542Y001528D01*
X012744Y001686D02*
X012991Y001686D01*
X012991Y001845D02*
X012840Y001845D01*
X012893Y002003D02*
X012991Y002003D01*
X012991Y002162D02*
X012893Y002162D01*
X012855Y002320D02*
X012991Y002320D01*
X012991Y002479D02*
X012780Y002479D01*
X012621Y002637D02*
X013028Y002637D01*
X017103Y005491D02*
X018189Y005491D01*
X018296Y005650D02*
X016899Y005650D01*
X019243Y007394D02*
X022121Y007394D01*
X022121Y007552D02*
X019130Y007552D01*
X019145Y007711D02*
X022121Y007711D01*
X022121Y007869D02*
X019249Y007869D01*
X020690Y007624D02*
X020716Y007651D01*
X021081Y007651D01*
X008731Y009138D02*
X004429Y009138D01*
X001381Y004101D02*
X001131Y004101D01*
X000431Y002701D02*
X000881Y002251D01*
X001781Y002251D01*
X002081Y001951D01*
X003631Y001951D01*
D20*
X006881Y003651D03*
X006931Y007601D03*
M02*
