G75*
G70*
%OFA0B0*%
%FSLAX24Y24*%
%IPPOS*%
%LPD*%
%AMOC8*
5,1,8,0,0,1.08239X$1,22.5*
%
%ADD10C,0.0000*%
%ADD11C,0.0748*%
%ADD12R,0.0740X0.0740*%
%ADD13C,0.0740*%
%ADD14R,0.0800X0.0800*%
%ADD15C,0.0800*%
%ADD16OC8,0.0520*%
%ADD17C,0.0650*%
%ADD18R,0.0650X0.0650*%
%ADD19C,0.1400*%
%ADD20C,0.0160*%
%ADD21C,0.0090*%
%ADD22C,0.0396*%
%ADD23C,0.0700*%
%ADD24C,0.0400*%
D10*
X000131Y000101D02*
X000131Y014597D01*
X022601Y014597D01*
X022601Y000101D01*
X000131Y000101D01*
D11*
X018690Y004124D03*
X018690Y005124D03*
X018690Y006124D03*
X018690Y007124D03*
X018690Y008124D03*
X018690Y009124D03*
X018690Y010124D03*
X018690Y011124D03*
X020690Y010624D03*
X020690Y009624D03*
X020690Y008624D03*
X020690Y007624D03*
X020690Y006624D03*
X020690Y005624D03*
X020690Y004624D03*
D12*
X001131Y008101D03*
D13*
X001131Y007101D03*
X001131Y006101D03*
X001131Y005101D03*
X001131Y004101D03*
X001131Y003101D03*
X003131Y003101D03*
X003131Y004101D03*
X003131Y005601D03*
X003131Y006601D03*
X004631Y007851D03*
X004131Y008601D03*
X005131Y008601D03*
X006131Y006601D03*
X006131Y005601D03*
X006131Y004101D03*
X006131Y003101D03*
X004631Y001851D03*
X004131Y001101D03*
X005131Y001101D03*
X009131Y002601D03*
X009131Y003601D03*
X009131Y005101D03*
X012131Y005101D03*
X013631Y005101D03*
X016631Y005101D03*
X016631Y003601D03*
X016631Y002601D03*
X016631Y009601D03*
X016631Y011101D03*
X016631Y012101D03*
X013631Y009601D03*
X012131Y009601D03*
X009131Y009601D03*
X009131Y011101D03*
X009131Y012101D03*
D14*
X012131Y012601D03*
X001631Y010101D03*
X013631Y002101D03*
D15*
X012253Y002101D03*
X001631Y011479D03*
X013509Y012601D03*
D16*
X015131Y012601D03*
X015131Y013601D03*
X015131Y011601D03*
X015131Y010601D03*
X010631Y010601D03*
X010631Y011601D03*
X010631Y012601D03*
X010631Y013601D03*
X010631Y004101D03*
X010631Y003101D03*
X010631Y002101D03*
X010631Y001101D03*
X015131Y001101D03*
X015131Y002101D03*
X015131Y003101D03*
X015131Y004101D03*
D17*
X005631Y010601D03*
D18*
X005631Y012601D03*
D19*
X001131Y013601D03*
X001131Y001101D03*
X021631Y001101D03*
X021631Y013601D03*
D20*
X022121Y013577D02*
X020289Y013577D01*
X020131Y013736D02*
X022121Y013736D01*
X022121Y013894D02*
X019972Y013894D01*
X019931Y013935D02*
X019765Y014101D01*
X019727Y014117D01*
X022121Y014117D01*
X022121Y012045D01*
X021665Y012501D01*
X021448Y012591D01*
X021275Y012591D01*
X019931Y013935D01*
X019814Y014053D02*
X022121Y014053D01*
X022121Y013418D02*
X020448Y013418D01*
X020606Y013260D02*
X022121Y013260D01*
X022121Y013101D02*
X020765Y013101D01*
X020923Y012943D02*
X022121Y012943D01*
X022121Y012784D02*
X021082Y012784D01*
X021240Y012626D02*
X022121Y012626D01*
X022121Y012467D02*
X021699Y012467D01*
X021858Y012309D02*
X022121Y012309D01*
X022121Y012150D02*
X022016Y012150D01*
X018690Y009124D02*
X017305Y009124D01*
X017031Y008851D01*
X008231Y008851D01*
X007281Y009801D01*
X003731Y009801D01*
X002831Y008901D01*
X000681Y008901D01*
X000431Y008651D01*
X000431Y004551D01*
X000881Y004101D01*
X001131Y004101D01*
X001640Y003747D02*
X002477Y003747D01*
X002517Y003731D02*
X002638Y003731D01*
X002768Y003601D01*
X002614Y003446D01*
X002521Y003222D01*
X002521Y002979D01*
X002614Y002755D01*
X002785Y002584D01*
X003010Y002491D01*
X003252Y002491D01*
X003477Y002584D01*
X003648Y002755D01*
X003741Y002979D01*
X003741Y003222D01*
X003648Y003446D01*
X003494Y003601D01*
X003648Y003755D01*
X003741Y003979D01*
X003741Y004222D01*
X003730Y004248D01*
X003864Y004381D01*
X005587Y004381D01*
X005521Y004222D01*
X005521Y004193D01*
X005250Y003922D01*
X005160Y003832D01*
X005111Y003714D01*
X005111Y002783D01*
X004778Y002450D01*
X004752Y002461D01*
X004510Y002461D01*
X004285Y002368D01*
X004114Y002196D01*
X004021Y001972D01*
X004021Y001729D01*
X004114Y001505D01*
X004285Y001334D01*
X004510Y001241D01*
X004529Y001241D01*
X004521Y001222D01*
X004521Y000979D01*
X004614Y000755D01*
X004785Y000584D01*
X004793Y000581D01*
X000611Y000581D01*
X000611Y002762D01*
X000614Y002755D01*
X000785Y002584D01*
X001010Y002491D01*
X001252Y002491D01*
X001477Y002584D01*
X001648Y002755D01*
X001741Y002979D01*
X001741Y003222D01*
X001648Y003446D01*
X001494Y003601D01*
X001648Y003755D01*
X001741Y003979D01*
X001741Y004222D01*
X001648Y004446D01*
X001494Y004601D01*
X001536Y004643D01*
X002310Y003870D01*
X002310Y003869D01*
X002400Y003779D01*
X002517Y003731D01*
X002756Y003589D02*
X001506Y003589D01*
X001655Y003430D02*
X002607Y003430D01*
X002542Y003272D02*
X001720Y003272D01*
X001741Y003113D02*
X002521Y003113D01*
X002531Y002955D02*
X001731Y002955D01*
X001665Y002796D02*
X002597Y002796D01*
X002732Y002637D02*
X001530Y002637D01*
X000732Y002637D02*
X000611Y002637D01*
X000611Y002479D02*
X004807Y002479D01*
X004965Y002637D02*
X003530Y002637D01*
X003665Y002796D02*
X005111Y002796D01*
X005111Y002955D02*
X003731Y002955D01*
X003741Y003113D02*
X005111Y003113D01*
X005111Y003272D02*
X003720Y003272D01*
X003655Y003430D02*
X005111Y003430D01*
X005111Y003589D02*
X003506Y003589D01*
X003640Y003747D02*
X005125Y003747D01*
X005234Y003906D02*
X003710Y003906D01*
X003741Y004064D02*
X005392Y004064D01*
X005521Y004223D02*
X003741Y004223D01*
X003731Y004701D02*
X003131Y004101D01*
X003081Y004051D01*
X002581Y004051D01*
X001531Y005101D01*
X001131Y005101D01*
X001554Y004540D02*
X001639Y004540D01*
X001675Y004381D02*
X001798Y004381D01*
X001741Y004223D02*
X001956Y004223D01*
X002115Y004064D02*
X001741Y004064D01*
X001710Y003906D02*
X002273Y003906D01*
X003731Y004701D02*
X007081Y004701D01*
X008681Y006301D01*
X010781Y006301D01*
X011281Y006801D01*
X017531Y006801D01*
X017711Y006621D01*
X018241Y006621D01*
X017907Y007124D02*
X017731Y007301D01*
X011081Y007301D01*
X010531Y006751D01*
X008481Y006751D01*
X006731Y005001D01*
X004181Y005001D01*
X003881Y005301D01*
X003881Y006301D01*
X003631Y006551D01*
X003181Y006551D01*
X003131Y006601D01*
X002631Y007101D01*
X001131Y007101D01*
X001542Y007552D02*
X004094Y007552D01*
X004114Y007505D02*
X004285Y007334D01*
X004311Y007323D01*
X004311Y006564D01*
X004311Y006437D01*
X004360Y006319D01*
X005260Y005419D01*
X005350Y005329D01*
X005371Y005321D01*
X004314Y005321D01*
X004201Y005433D01*
X004201Y006237D01*
X004201Y006364D01*
X004152Y006482D01*
X003902Y006732D01*
X003812Y006822D01*
X003695Y006871D01*
X003679Y006871D01*
X003648Y006946D01*
X003477Y007118D01*
X003252Y007211D01*
X003010Y007211D01*
X002984Y007200D01*
X002812Y007372D01*
X002695Y007421D01*
X002567Y007421D01*
X001659Y007421D01*
X001648Y007446D01*
X001477Y007618D01*
X001252Y007711D01*
X001010Y007711D01*
X000785Y007618D01*
X000751Y007583D01*
X000751Y008518D01*
X000814Y008581D01*
X002767Y008581D01*
X002895Y008581D01*
X003012Y008629D01*
X003864Y009481D01*
X004059Y009481D01*
X003950Y009372D01*
X003860Y009282D01*
X003811Y009164D01*
X003811Y009128D01*
X003785Y009118D01*
X003614Y008946D01*
X003521Y008722D01*
X003521Y008479D01*
X003614Y008255D01*
X003785Y008084D01*
X004010Y007991D01*
X004029Y007991D01*
X004021Y007972D01*
X004021Y007729D01*
X004114Y007505D01*
X004225Y007394D02*
X002760Y007394D01*
X002949Y007235D02*
X004311Y007235D01*
X004311Y007077D02*
X003518Y007077D01*
X003660Y006918D02*
X004311Y006918D01*
X004311Y006760D02*
X003875Y006760D01*
X004033Y006601D02*
X004311Y006601D01*
X004311Y006443D02*
X004169Y006443D01*
X004201Y006284D02*
X004395Y006284D01*
X004554Y006125D02*
X004201Y006125D01*
X004201Y005967D02*
X004712Y005967D01*
X004871Y005808D02*
X004201Y005808D01*
X004201Y005650D02*
X005029Y005650D01*
X005188Y005491D02*
X004201Y005491D01*
X004302Y005333D02*
X005346Y005333D01*
X005531Y005601D02*
X006131Y005601D01*
X005634Y005967D02*
X005617Y005967D01*
X005626Y005958D02*
X005768Y006101D01*
X005614Y006255D01*
X005521Y006479D01*
X005521Y006722D01*
X005614Y006946D01*
X005785Y007118D01*
X005811Y007128D01*
X005811Y008637D01*
X005811Y008764D01*
X005860Y008882D01*
X005959Y008981D01*
X004614Y008981D01*
X004648Y008946D01*
X004741Y008722D01*
X004741Y008479D01*
X004733Y008461D01*
X004752Y008461D01*
X004977Y008368D01*
X005148Y008196D01*
X005241Y007972D01*
X005241Y007729D01*
X005148Y007505D01*
X004977Y007334D01*
X004951Y007323D01*
X004951Y006633D01*
X005626Y005958D01*
X005744Y006125D02*
X005459Y006125D01*
X005602Y006284D02*
X005300Y006284D01*
X005142Y006443D02*
X005536Y006443D01*
X005521Y006601D02*
X004983Y006601D01*
X004951Y006760D02*
X005537Y006760D01*
X005602Y006918D02*
X004951Y006918D01*
X004951Y007077D02*
X005744Y007077D01*
X005811Y007235D02*
X004951Y007235D01*
X005037Y007394D02*
X005811Y007394D01*
X005811Y007552D02*
X005168Y007552D01*
X005233Y007711D02*
X005811Y007711D01*
X005811Y007869D02*
X005241Y007869D01*
X005218Y008028D02*
X005811Y008028D01*
X005811Y008186D02*
X005152Y008186D01*
X004999Y008345D02*
X005811Y008345D01*
X005811Y008504D02*
X004741Y008504D01*
X004741Y008662D02*
X005811Y008662D01*
X005834Y008821D02*
X004700Y008821D01*
X004615Y008979D02*
X005957Y008979D01*
X006131Y008701D02*
X006731Y009301D01*
X006881Y009301D01*
X007881Y008301D01*
X018331Y008301D01*
X018507Y008124D01*
X018690Y008124D01*
X018111Y007621D02*
X017931Y007801D01*
X007131Y007801D01*
X006931Y007601D01*
X006131Y006601D02*
X006131Y008701D01*
X006731Y009301D02*
X004331Y009301D01*
X004131Y009101D01*
X004131Y008601D01*
X003562Y008821D02*
X003203Y008821D01*
X003045Y008662D02*
X003521Y008662D01*
X003521Y008504D02*
X000751Y008504D01*
X000751Y008345D02*
X003577Y008345D01*
X003683Y008186D02*
X000751Y008186D01*
X000751Y008028D02*
X003920Y008028D01*
X004021Y007869D02*
X000751Y007869D01*
X000751Y007711D02*
X004029Y007711D01*
X004631Y007851D02*
X004631Y006501D01*
X005531Y005601D01*
X005881Y004101D02*
X005431Y003651D01*
X005431Y002651D01*
X004631Y001851D01*
X004021Y001845D02*
X000611Y001845D01*
X000611Y002003D02*
X004034Y002003D01*
X004100Y002162D02*
X000611Y002162D01*
X000611Y002320D02*
X004238Y002320D01*
X004039Y001686D02*
X000611Y001686D01*
X000611Y001528D02*
X004105Y001528D01*
X004250Y001369D02*
X000611Y001369D01*
X000611Y001211D02*
X004521Y001211D01*
X004521Y001052D02*
X000611Y001052D01*
X000611Y000894D02*
X004557Y000894D01*
X004634Y000735D02*
X000611Y000735D01*
X001131Y001101D02*
X004131Y001101D01*
X005131Y001101D02*
X006131Y002101D01*
X006131Y003101D01*
X007031Y003101D01*
X008131Y004201D01*
X009831Y004201D01*
X010331Y004701D01*
X010731Y004701D01*
X011831Y005801D01*
X017131Y005801D01*
X017311Y005621D01*
X018241Y005621D01*
X018690Y006124D02*
X017507Y006124D01*
X017331Y006301D01*
X011481Y006301D01*
X010981Y005801D01*
X008831Y005801D01*
X006881Y003851D01*
X006881Y003651D01*
X007496Y003113D02*
X008756Y003113D01*
X008768Y003101D02*
X008614Y002946D01*
X008521Y002722D01*
X008521Y002479D01*
X006451Y002479D01*
X006451Y002573D02*
X006477Y002584D01*
X006648Y002755D01*
X006659Y002781D01*
X007095Y002781D01*
X007212Y002829D01*
X007302Y002919D01*
X008264Y003881D01*
X008587Y003881D01*
X008521Y003722D01*
X008521Y003479D01*
X008614Y003255D01*
X008768Y003101D01*
X008622Y002955D02*
X007337Y002955D01*
X007131Y002796D02*
X008552Y002796D01*
X008521Y002637D02*
X006530Y002637D01*
X006451Y002573D02*
X006451Y002164D01*
X006451Y002037D01*
X006402Y001919D01*
X005730Y001248D01*
X005741Y001222D01*
X005741Y000979D01*
X005648Y000755D01*
X005477Y000584D01*
X005469Y000581D01*
X022121Y000581D01*
X022121Y002169D01*
X021980Y002028D01*
X021819Y001961D01*
X021643Y001961D01*
X021313Y001961D01*
X020080Y000728D01*
X019919Y000661D01*
X019743Y000661D01*
X015398Y000661D01*
X015338Y000601D01*
X014924Y000601D01*
X014864Y000661D01*
X010898Y000661D01*
X010838Y000601D01*
X010424Y000601D01*
X010131Y000894D01*
X010131Y001308D01*
X010424Y001601D01*
X010838Y001601D01*
X010898Y001661D01*
X011788Y001661D01*
X011891Y001558D01*
X011933Y001541D01*
X010898Y001541D01*
X010838Y001601D01*
X010424Y001601D01*
X010244Y001781D01*
X009695Y001781D01*
X009567Y001781D01*
X009450Y001829D01*
X009278Y002001D01*
X009252Y001991D01*
X009010Y001991D01*
X008785Y002084D01*
X008614Y002255D01*
X008521Y002479D01*
X008587Y002320D02*
X006451Y002320D01*
X006451Y002162D02*
X008707Y002162D01*
X008979Y002003D02*
X006437Y002003D01*
X006328Y001845D02*
X009434Y001845D01*
X009631Y002101D02*
X009131Y002601D01*
X009741Y002637D02*
X010191Y002637D01*
X010191Y002479D02*
X009741Y002479D01*
X009741Y002722D01*
X009648Y002946D01*
X009494Y003101D01*
X009648Y003255D01*
X009741Y003479D01*
X009741Y003722D01*
X009675Y003881D01*
X009895Y003881D01*
X010012Y003929D01*
X010102Y004019D01*
X010464Y004381D01*
X010795Y004381D01*
X010912Y004429D01*
X011002Y004519D01*
X011964Y005481D01*
X016148Y005481D01*
X016114Y005446D01*
X016021Y005222D01*
X016021Y004979D01*
X016054Y004900D01*
X015804Y005150D01*
X015680Y005274D01*
X015519Y005341D01*
X014869Y005341D01*
X014693Y005341D01*
X014532Y005274D01*
X011909Y002651D01*
X011891Y002643D01*
X011788Y002541D01*
X011071Y002541D01*
X011071Y002834D01*
X011131Y002894D01*
X011131Y003308D01*
X010838Y003601D01*
X010424Y003601D01*
X010131Y003308D01*
X010131Y002894D01*
X010191Y002834D01*
X010191Y002421D01*
X009764Y002421D01*
X009730Y002454D01*
X009741Y002479D01*
X009631Y002101D02*
X010631Y002101D01*
X010338Y001686D02*
X006169Y001686D01*
X006010Y001528D02*
X010351Y001528D01*
X010192Y001369D02*
X005852Y001369D01*
X005741Y001211D02*
X010131Y001211D01*
X010131Y001052D02*
X005741Y001052D01*
X005705Y000894D02*
X010131Y000894D01*
X010290Y000735D02*
X005628Y000735D01*
X009506Y003113D02*
X010131Y003113D01*
X010131Y002955D02*
X009640Y002955D01*
X009710Y002796D02*
X010191Y002796D01*
X010131Y003272D02*
X009655Y003272D01*
X009721Y003430D02*
X010253Y003430D01*
X010412Y003589D02*
X009741Y003589D01*
X009731Y003747D02*
X013005Y003747D01*
X012847Y003589D02*
X010850Y003589D01*
X011009Y003430D02*
X012688Y003430D01*
X012530Y003272D02*
X011131Y003272D01*
X011131Y003113D02*
X012371Y003113D01*
X012213Y002955D02*
X011131Y002955D01*
X011071Y002796D02*
X012054Y002796D01*
X011885Y002637D02*
X011071Y002637D01*
X009955Y003906D02*
X013164Y003906D01*
X013322Y004064D02*
X010147Y004064D01*
X010306Y004223D02*
X013481Y004223D01*
X013639Y004381D02*
X010796Y004381D01*
X011023Y004540D02*
X013798Y004540D01*
X013957Y004699D02*
X011181Y004699D01*
X011340Y004857D02*
X014115Y004857D01*
X014274Y005016D02*
X011498Y005016D01*
X011657Y005174D02*
X014432Y005174D01*
X014674Y005333D02*
X011816Y005333D01*
X012131Y005101D02*
X013631Y005101D01*
X014884Y004381D02*
X015328Y004381D01*
X015249Y004461D02*
X015732Y003978D01*
X015893Y003911D01*
X016069Y003911D01*
X016099Y003911D01*
X016021Y003722D01*
X016021Y003479D01*
X016114Y003255D01*
X016268Y003101D01*
X016208Y003041D01*
X015719Y003041D01*
X015631Y003041D01*
X015631Y003308D01*
X015338Y003601D01*
X014924Y003601D01*
X014631Y003308D01*
X014631Y002894D01*
X014691Y002834D01*
X014691Y002541D01*
X014271Y002541D01*
X014271Y002549D01*
X014234Y002637D01*
X014167Y002704D01*
X014079Y002741D01*
X013243Y002741D01*
X014963Y004461D01*
X015249Y004461D01*
X015487Y004223D02*
X014725Y004223D01*
X014567Y004064D02*
X015645Y004064D01*
X016097Y003906D02*
X014408Y003906D01*
X014250Y003747D02*
X016031Y003747D01*
X016021Y003589D02*
X015350Y003589D01*
X015509Y003430D02*
X016041Y003430D01*
X016107Y003272D02*
X015631Y003272D01*
X015631Y003113D02*
X016256Y003113D01*
X014912Y003589D02*
X014091Y003589D01*
X013933Y003430D02*
X014753Y003430D01*
X014631Y003272D02*
X013774Y003272D01*
X013616Y003113D02*
X014631Y003113D01*
X014631Y002955D02*
X013457Y002955D01*
X013298Y002796D02*
X014691Y002796D01*
X014691Y002637D02*
X014234Y002637D01*
X014271Y001661D02*
X014864Y001661D01*
X014924Y001601D01*
X015338Y001601D01*
X015631Y001894D01*
X015631Y001979D01*
X015813Y002161D01*
X016208Y002161D01*
X016285Y002084D01*
X016510Y001991D01*
X016752Y001991D01*
X016977Y002084D01*
X017054Y002161D01*
X019743Y002161D01*
X019919Y002161D01*
X020080Y002228D01*
X020930Y003078D01*
X021054Y003202D01*
X021121Y003363D01*
X021121Y004187D01*
X021211Y004277D01*
X021304Y004502D01*
X021304Y004747D01*
X021211Y004972D01*
X021058Y005124D01*
X021211Y005277D01*
X021304Y005502D01*
X021304Y005747D01*
X021211Y005972D01*
X021058Y006124D01*
X021211Y006277D01*
X021304Y006502D01*
X021304Y006747D01*
X021211Y006972D01*
X021038Y007145D01*
X020812Y007238D01*
X020568Y007238D01*
X020342Y007145D01*
X020170Y006972D01*
X020158Y006944D01*
X019280Y006944D01*
X019304Y007002D01*
X019304Y007247D01*
X019263Y007346D01*
X019272Y007349D01*
X020184Y008262D01*
X020342Y008104D01*
X020568Y008010D01*
X020812Y008010D01*
X021038Y008104D01*
X021211Y008277D01*
X021304Y008502D01*
X021304Y008747D01*
X021211Y008972D01*
X021172Y009011D01*
X021548Y009011D01*
X021691Y009070D01*
X021691Y002983D01*
X021549Y002841D01*
X021043Y002841D01*
X020882Y002774D01*
X020758Y002650D01*
X020758Y002650D01*
X019649Y001541D01*
X015398Y001541D01*
X015338Y001601D01*
X014924Y001601D01*
X014864Y001541D01*
X014210Y001541D01*
X014234Y001565D01*
X014271Y001653D01*
X014271Y001661D01*
X015424Y001686D02*
X019794Y001686D01*
X019953Y001845D02*
X015582Y001845D01*
X015656Y002003D02*
X016479Y002003D01*
X016783Y002003D02*
X020111Y002003D01*
X020270Y002162D02*
X019921Y002162D01*
X020173Y002320D02*
X020428Y002320D01*
X020331Y002479D02*
X020587Y002479D01*
X020490Y002637D02*
X020746Y002637D01*
X020649Y002796D02*
X020936Y002796D01*
X020807Y002955D02*
X021663Y002955D01*
X021691Y003113D02*
X020966Y003113D01*
X021083Y003272D02*
X021691Y003272D01*
X021691Y003430D02*
X021121Y003430D01*
X021121Y003589D02*
X021691Y003589D01*
X021691Y003747D02*
X021121Y003747D01*
X021121Y003906D02*
X021691Y003906D01*
X021691Y004064D02*
X021121Y004064D01*
X021157Y004223D02*
X021691Y004223D01*
X021691Y004381D02*
X021254Y004381D01*
X021304Y004540D02*
X021691Y004540D01*
X021691Y004699D02*
X021304Y004699D01*
X021258Y004857D02*
X021691Y004857D01*
X021691Y005016D02*
X021167Y005016D01*
X021108Y005174D02*
X021691Y005174D01*
X021691Y005333D02*
X021234Y005333D01*
X021299Y005491D02*
X021691Y005491D01*
X021691Y005650D02*
X021304Y005650D01*
X021278Y005808D02*
X021691Y005808D01*
X021691Y005967D02*
X021213Y005967D01*
X021059Y006125D02*
X021691Y006125D01*
X021691Y006284D02*
X021214Y006284D01*
X021279Y006443D02*
X021691Y006443D01*
X021691Y006601D02*
X021304Y006601D01*
X021299Y006760D02*
X021691Y006760D01*
X021691Y006918D02*
X021233Y006918D01*
X021106Y007077D02*
X021691Y007077D01*
X021691Y007235D02*
X020820Y007235D01*
X020560Y007235D02*
X019304Y007235D01*
X019304Y007077D02*
X020274Y007077D01*
X020690Y006624D02*
X019085Y006624D01*
X019081Y006621D01*
X018690Y007124D02*
X017907Y007124D01*
X018111Y007621D02*
X018221Y007621D01*
X019091Y007621D02*
X020095Y008624D01*
X020690Y008624D01*
X021304Y008662D02*
X021691Y008662D01*
X021691Y008504D02*
X021304Y008504D01*
X021239Y008345D02*
X021691Y008345D01*
X021691Y008186D02*
X021121Y008186D01*
X020855Y008028D02*
X021691Y008028D01*
X021691Y007869D02*
X019792Y007869D01*
X019634Y007711D02*
X021691Y007711D01*
X021691Y007552D02*
X019475Y007552D01*
X019317Y007394D02*
X021691Y007394D01*
X020526Y008028D02*
X019951Y008028D01*
X020109Y008186D02*
X020260Y008186D01*
X021273Y008821D02*
X021691Y008821D01*
X021691Y008979D02*
X021204Y008979D01*
X016198Y009171D02*
X009564Y009171D01*
X009648Y009255D01*
X009741Y009479D01*
X009741Y009722D01*
X009648Y009946D01*
X009477Y010118D01*
X009451Y010128D01*
X009451Y010573D01*
X009477Y010584D01*
X009648Y010755D01*
X009741Y010979D01*
X009741Y011222D01*
X009648Y011446D01*
X009494Y011601D01*
X009648Y011755D01*
X009741Y011979D01*
X009741Y012222D01*
X009730Y012248D01*
X009764Y012281D01*
X010191Y012281D01*
X010191Y011868D01*
X010131Y011808D01*
X010131Y011394D01*
X010424Y011101D01*
X010838Y011101D01*
X011131Y011394D01*
X011131Y011808D01*
X011071Y011868D01*
X011071Y012161D01*
X011491Y012161D01*
X011491Y012153D01*
X011528Y012065D01*
X011595Y011997D01*
X011683Y011961D01*
X011899Y011961D01*
X014382Y009478D01*
X014543Y009411D01*
X014719Y009411D01*
X015669Y009411D01*
X015830Y009478D01*
X015954Y009602D01*
X016021Y009669D01*
X016021Y009479D01*
X016114Y009255D01*
X016198Y009171D01*
X016097Y009296D02*
X009665Y009296D01*
X009731Y009455D02*
X014437Y009455D01*
X014246Y009613D02*
X009741Y009613D01*
X009720Y009772D02*
X014088Y009772D01*
X013929Y009930D02*
X009655Y009930D01*
X009505Y010089D02*
X013771Y010089D01*
X013612Y010248D02*
X009451Y010248D01*
X009451Y010406D02*
X013453Y010406D01*
X013295Y010565D02*
X009451Y010565D01*
X009616Y010723D02*
X013136Y010723D01*
X012978Y010882D02*
X009701Y010882D01*
X009741Y011040D02*
X012819Y011040D01*
X012661Y011199D02*
X010936Y011199D01*
X011095Y011357D02*
X012502Y011357D01*
X012344Y011516D02*
X011131Y011516D01*
X011131Y011674D02*
X012185Y011674D01*
X012027Y011833D02*
X011106Y011833D01*
X011071Y011992D02*
X011609Y011992D01*
X011492Y012150D02*
X011071Y012150D01*
X010631Y012601D02*
X009631Y012601D01*
X009131Y012101D01*
X008557Y012309D02*
X006196Y012309D01*
X006196Y012331D02*
X006875Y013011D01*
X010334Y013011D01*
X010244Y012921D01*
X009695Y012921D01*
X009567Y012921D01*
X009450Y012872D01*
X009278Y012700D01*
X009252Y012711D01*
X009010Y012711D01*
X008785Y012618D01*
X008614Y012446D01*
X008521Y012222D01*
X008521Y011979D01*
X008614Y011755D01*
X008768Y011601D01*
X008614Y011446D01*
X008521Y011222D01*
X008521Y010979D01*
X008614Y010755D01*
X008785Y010584D01*
X008811Y010573D01*
X008811Y010128D01*
X008785Y010118D01*
X008614Y009946D01*
X008521Y009722D01*
X008521Y009479D01*
X008614Y009255D01*
X008698Y009171D01*
X008364Y009171D01*
X007462Y010072D01*
X007345Y010121D01*
X007217Y010121D01*
X003667Y010121D01*
X003550Y010072D01*
X003460Y009982D01*
X002698Y009221D01*
X000745Y009221D01*
X000617Y009221D01*
X000611Y009218D01*
X000611Y014117D01*
X006335Y014117D01*
X006297Y014101D01*
X006131Y013935D01*
X005362Y013166D01*
X005258Y013166D01*
X005170Y013129D01*
X005103Y013062D01*
X005066Y012974D01*
X005066Y012870D01*
X004265Y012069D01*
X001879Y012069D01*
X001758Y012119D01*
X001504Y012119D01*
X001268Y012021D01*
X001088Y011841D01*
X000991Y011606D01*
X000991Y011351D01*
X001088Y011116D01*
X001268Y010936D01*
X001504Y010839D01*
X001758Y010839D01*
X001879Y010889D01*
X004392Y010889D01*
X004626Y010889D01*
X004843Y010979D01*
X005900Y012036D01*
X006004Y012036D01*
X006092Y012072D01*
X006159Y012140D01*
X006196Y012228D01*
X006196Y012331D01*
X006164Y012150D02*
X008521Y012150D01*
X008521Y011992D02*
X005856Y011992D01*
X005698Y011833D02*
X008582Y011833D01*
X008695Y011674D02*
X005539Y011674D01*
X005381Y011516D02*
X008684Y011516D01*
X008577Y011357D02*
X005222Y011357D01*
X005063Y011199D02*
X008521Y011199D01*
X008521Y011040D02*
X004905Y011040D01*
X005631Y010601D02*
X002131Y010601D01*
X001631Y010101D01*
X001231Y010101D01*
X000631Y010701D01*
X000631Y012201D01*
X001131Y012701D01*
X001131Y013601D01*
X000611Y013577D02*
X005773Y013577D01*
X005931Y013736D02*
X000611Y013736D01*
X000611Y013894D02*
X006090Y013894D01*
X006248Y014053D02*
X000611Y014053D01*
X000611Y013418D02*
X005614Y013418D01*
X005456Y013260D02*
X000611Y013260D01*
X000611Y013101D02*
X005142Y013101D01*
X005066Y012943D02*
X000611Y012943D01*
X000611Y012784D02*
X004980Y012784D01*
X004822Y012626D02*
X000611Y012626D01*
X000611Y012467D02*
X004663Y012467D01*
X004504Y012309D02*
X000611Y012309D01*
X000611Y012150D02*
X004346Y012150D01*
X006332Y012467D02*
X008635Y012467D01*
X008804Y012626D02*
X006490Y012626D01*
X006649Y012784D02*
X009362Y012784D01*
X009741Y012150D02*
X010191Y012150D01*
X010191Y011992D02*
X009741Y011992D01*
X009680Y011833D02*
X010156Y011833D01*
X010131Y011674D02*
X009567Y011674D01*
X009579Y011516D02*
X010131Y011516D01*
X010167Y011357D02*
X009685Y011357D01*
X009741Y011199D02*
X010326Y011199D01*
X010631Y010601D02*
X011131Y010601D01*
X012131Y009601D01*
X013631Y009601D01*
X014698Y010406D02*
X015514Y010406D01*
X015399Y010291D02*
X014813Y010291D01*
X012771Y012333D01*
X012771Y013049D01*
X012745Y013111D01*
X013114Y013111D01*
X012966Y012963D01*
X012869Y012728D01*
X012869Y012473D01*
X012966Y012238D01*
X013146Y012058D01*
X013382Y011961D01*
X013636Y011961D01*
X013871Y012058D01*
X013974Y012161D01*
X014691Y012161D01*
X014691Y011868D01*
X014631Y011808D01*
X014631Y011394D01*
X014924Y011101D01*
X015338Y011101D01*
X015631Y011394D01*
X015631Y011661D01*
X015719Y011661D01*
X016208Y011661D01*
X016268Y011601D01*
X016114Y011446D01*
X016021Y011222D01*
X016021Y010979D01*
X016099Y010791D01*
X015993Y010791D01*
X015832Y010724D01*
X015399Y010291D01*
X015673Y010565D02*
X014539Y010565D01*
X014381Y010723D02*
X015831Y010723D01*
X016061Y010882D02*
X014222Y010882D01*
X014064Y011040D02*
X016021Y011040D01*
X016021Y011199D02*
X015436Y011199D01*
X015595Y011357D02*
X016077Y011357D01*
X016184Y011516D02*
X015631Y011516D01*
X014826Y011199D02*
X013905Y011199D01*
X013747Y011357D02*
X014667Y011357D01*
X014631Y011516D02*
X013588Y011516D01*
X013430Y011674D02*
X014631Y011674D01*
X014656Y011833D02*
X013271Y011833D01*
X013307Y011992D02*
X013112Y011992D01*
X013055Y012150D02*
X012954Y012150D01*
X012937Y012309D02*
X012795Y012309D01*
X012771Y012467D02*
X012872Y012467D01*
X012869Y012626D02*
X012771Y012626D01*
X012771Y012784D02*
X012892Y012784D01*
X012958Y012943D02*
X012771Y012943D01*
X012749Y013101D02*
X013104Y013101D01*
X013963Y012150D02*
X014691Y012150D01*
X014691Y011992D02*
X013710Y011992D01*
X010266Y012943D02*
X006807Y012943D01*
X009131Y011101D02*
X009131Y009601D01*
X008521Y009613D02*
X007921Y009613D01*
X008079Y009455D02*
X008531Y009455D01*
X008597Y009296D02*
X008238Y009296D01*
X008542Y009772D02*
X007762Y009772D01*
X007604Y009930D02*
X008607Y009930D01*
X008757Y010089D02*
X007421Y010089D01*
X008646Y010723D02*
X000611Y010723D01*
X000611Y010565D02*
X008811Y010565D01*
X008811Y010406D02*
X000611Y010406D01*
X000611Y010248D02*
X008811Y010248D01*
X008561Y010882D02*
X001862Y010882D01*
X001400Y010882D02*
X000611Y010882D01*
X000611Y011040D02*
X001164Y011040D01*
X001054Y011199D02*
X000611Y011199D01*
X000611Y011357D02*
X000991Y011357D01*
X000991Y011516D02*
X000611Y011516D01*
X000611Y011674D02*
X001019Y011674D01*
X001085Y011833D02*
X000611Y011833D01*
X000611Y011992D02*
X001239Y011992D01*
X000611Y010089D02*
X003591Y010089D01*
X003408Y009930D02*
X000611Y009930D01*
X000611Y009772D02*
X003250Y009772D01*
X003091Y009613D02*
X000611Y009613D01*
X000611Y009455D02*
X002933Y009455D01*
X002774Y009296D02*
X000611Y009296D01*
X003362Y008979D02*
X003647Y008979D01*
X003521Y009138D02*
X003811Y009138D01*
X003874Y009296D02*
X003679Y009296D01*
X003838Y009455D02*
X004033Y009455D01*
X011131Y004101D02*
X012131Y005101D01*
X011131Y004101D02*
X010631Y004101D01*
X008531Y003747D02*
X008130Y003747D01*
X007972Y003589D02*
X008521Y003589D01*
X008541Y003430D02*
X007813Y003430D01*
X007654Y003272D02*
X008607Y003272D01*
X006131Y004101D02*
X005881Y004101D01*
X015538Y005333D02*
X016067Y005333D01*
X016021Y005174D02*
X015780Y005174D01*
X015938Y005016D02*
X016021Y005016D01*
X019121Y005621D02*
X019125Y005624D01*
X020690Y005624D01*
X022114Y002162D02*
X022121Y002162D01*
X022121Y002003D02*
X021921Y002003D01*
X022121Y001845D02*
X021197Y001845D01*
X021039Y001686D02*
X022121Y001686D01*
X022121Y001528D02*
X020880Y001528D01*
X020722Y001369D02*
X022121Y001369D01*
X022121Y001211D02*
X020563Y001211D01*
X020405Y001052D02*
X022121Y001052D01*
X022121Y000894D02*
X020246Y000894D01*
X020087Y000735D02*
X022121Y000735D01*
X016031Y009455D02*
X015775Y009455D01*
X015966Y009613D02*
X016021Y009613D01*
D21*
X018221Y007621D02*
X019091Y007621D01*
X019081Y006621D02*
X018241Y006621D01*
X018241Y005621D02*
X019121Y005621D01*
D22*
X006931Y007601D03*
X006881Y003651D03*
D23*
X004509Y011479D02*
X001631Y011479D01*
X004509Y011479D02*
X005631Y012601D01*
X006631Y013601D01*
X010631Y013601D01*
X010731Y013701D01*
X015031Y013701D01*
X015131Y013601D01*
X019431Y013601D01*
X021031Y012001D01*
X021331Y012001D01*
X021831Y011501D01*
X021831Y010001D01*
X021781Y009951D01*
X021431Y009601D01*
X020714Y009601D01*
X020690Y009624D01*
D24*
X021781Y009951D02*
X022131Y009601D01*
X022131Y002801D01*
X021731Y002401D01*
X021131Y002401D01*
X019831Y001101D01*
X015131Y001101D01*
X010631Y001101D01*
X010631Y002101D02*
X010631Y003101D01*
X010631Y002101D02*
X012253Y002101D01*
X012281Y002129D01*
X012281Y002401D01*
X014781Y004901D01*
X015431Y004901D01*
X015981Y004351D01*
X017531Y004351D01*
X018305Y005124D01*
X018690Y005124D01*
X020681Y004615D02*
X020690Y004624D01*
X020681Y004615D02*
X020681Y003451D01*
X019831Y002601D01*
X016631Y002601D01*
X015631Y002601D01*
X015131Y002101D01*
X015131Y003101D01*
X015131Y002101D02*
X013631Y002101D01*
X014631Y009851D02*
X012131Y012351D01*
X012131Y012601D01*
X010631Y012601D01*
X010631Y011601D01*
X013509Y012601D02*
X015131Y012601D01*
X015631Y012101D01*
X016631Y012101D01*
X019214Y012101D01*
X020690Y010624D01*
X018690Y010124D02*
X017507Y010124D01*
X017281Y010351D01*
X016081Y010351D01*
X015581Y009851D01*
X014631Y009851D01*
X015131Y011601D02*
X015131Y012601D01*
M02*
