P0.0                    TXD0
P0.1                    RXD0
P0.2                    SCL0
P0.3                    SDA0
P0.4                            AD0.6
P0.5            MAT0.1
P0.6                            AD1.0  
P0.7            PWM2       
P0.8                    TXD1
P0.9                    RXD1
P0.10                           AD1.2
P0.11           CAP1.1
P0.12           MAT1.0
P0.13           MAT1.1
P0.14   EINT1        
P0.15                           AD1.5
P0.16           MAT0.2
P0.17                   SCK1
P0.18                   MISO1
P0.19                   MOSI1
P0.20                   SSEL1
P0.21           PWM5
P0.22           MAT0.0
P0.23   P23
P0.24   -
P0.25                           DAC
P0.26                           AD0.5
P0.27                           AD0.0
P0.28                           AD0.1
P0.29           MAT0.3
P0.30                           AD0.3
P0.31   P31

P1.16
P1.17
P1.18
P1.19
P1.20
P1.21
P1.22
P1.23
P1.24
P1.25
P1.26
P1.27
P1.28
P1.29
P1.30
P1.31
