kokoro
no
naka
de
ikiteitai
basho
ga
aru
chiisana
sekai
mou
todokanai
kako
no
hi
wa
sono
mama
no
watashi
to
sono
mama
no
anata
ga
itsumo
waraitteita
wasurenai
shizukani
mimamotteruwa
ima
demo
saikou
ni
aishiteru
to
wakatteru
hazuyo
doushite
mo
aitakunattara
sotto
aisatsu
ni
ikuwa
tooku
shiawase
negau
kanata
kara
