%!PS-Adobe-2.0 EPSF-2.0
%%Title: ex1-5.fig
%%Creator: fig2dev Version 3.2 Patchlevel 5-alpha5
%%CreationDate: Tue Apr 12 21:29:10 2005
%%For: xan@canostra (Xavier J. B. L.,,,)
%%BoundingBox: 0 0 299 271
%Magnification: 1.0000
%%EndComments
/$F2psDict 200 dict def
$F2psDict begin
$F2psDict /mtrx matrix put
/col-1 {0 setgray} bind def
/col0 {0.000 0.000 0.000 srgb} bind def
/col1 {0.000 0.000 1.000 srgb} bind def
/col2 {0.000 1.000 0.000 srgb} bind def
/col3 {0.000 1.000 1.000 srgb} bind def
/col4 {1.000 0.000 0.000 srgb} bind def
/col5 {1.000 0.000 1.000 srgb} bind def
/col6 {1.000 1.000 0.000 srgb} bind def
/col7 {1.000 1.000 1.000 srgb} bind def
/col8 {0.000 0.000 0.560 srgb} bind def
/col9 {0.000 0.000 0.690 srgb} bind def
/col10 {0.000 0.000 0.820 srgb} bind def
/col11 {0.530 0.810 1.000 srgb} bind def
/col12 {0.000 0.560 0.000 srgb} bind def
/col13 {0.000 0.690 0.000 srgb} bind def
/col14 {0.000 0.820 0.000 srgb} bind def
/col15 {0.000 0.560 0.560 srgb} bind def
/col16 {0.000 0.690 0.690 srgb} bind def
/col17 {0.000 0.820 0.820 srgb} bind def
/col18 {0.560 0.000 0.000 srgb} bind def
/col19 {0.690 0.000 0.000 srgb} bind def
/col20 {0.820 0.000 0.000 srgb} bind def
/col21 {0.560 0.000 0.560 srgb} bind def
/col22 {0.690 0.000 0.690 srgb} bind def
/col23 {0.820 0.000 0.820 srgb} bind def
/col24 {0.500 0.190 0.000 srgb} bind def
/col25 {0.630 0.250 0.000 srgb} bind def
/col26 {0.750 0.380 0.000 srgb} bind def
/col27 {1.000 0.500 0.500 srgb} bind def
/col28 {1.000 0.630 0.630 srgb} bind def
/col29 {1.000 0.750 0.750 srgb} bind def
/col30 {1.000 0.880 0.880 srgb} bind def
/col31 {1.000 0.840 0.000 srgb} bind def

end
save
newpath 0 271 moveto 0 0 lineto 299 0 lineto 299 271 lineto closepath clip newpath
-98.5 525.2 translate
1 -1 scale

/cp {closepath} bind def
/ef {eofill} bind def
/gr {grestore} bind def
/gs {gsave} bind def
/sa {save} bind def
/rs {restore} bind def
/l {lineto} bind def
/m {moveto} bind def
/rm {rmoveto} bind def
/n {newpath} bind def
/s {stroke} bind def
/sh {show} bind def
/slc {setlinecap} bind def
/slj {setlinejoin} bind def
/slw {setlinewidth} bind def
/srgb {setrgbcolor} bind def
/rot {rotate} bind def
/sc {scale} bind def
/sd {setdash} bind def
/ff {findfont} bind def
/sf {setfont} bind def
/scf {scalefont} bind def
/sw {stringwidth} bind def
/tr {translate} bind def
/tnt {dup dup currentrgbcolor
  4 -2 roll dup 1 exch sub 3 -1 roll mul add
  4 -2 roll dup 1 exch sub 3 -1 roll mul add
  4 -2 roll dup 1 exch sub 3 -1 roll mul add srgb}
  bind def
/shd {dup dup currentrgbcolor 4 -2 roll mul 4 -2 roll mul
  4 -2 roll mul srgb} bind def
/$F2psBegin {$F2psDict begin /$F2psEnteredState save def} def
/$F2psEnd {$F2psEnteredState restore end} def

$F2psBegin
10 setmiterlimit
0 slj 0 slc
 0.06299 0.06299 sc
%
% Fig objects follow
%
% 
% here starts figure with depth 50
% Polyline
0 slj
0 slc
7.500 slw
n 1575 4950 m 3150 4050 l 5625 4050 l 4050 4950 l
 1575 4950 l  cp gs col0 s gr 
% Polyline
n 4050 4950 m 4050 6525 l 5625 7425 l
 5625 4050 l gs col0 s gr 
% Polyline
n 5625 7425 m 4050 8325 l 2475 7425 l
 4050 6525 l gs col0 s gr 
% Polyline
 [60] 0 sd
gs  clippath
5472 7455 m 5640 7455 l 5640 7395 l 5472 7395 l 5472 7395 l 5592 7425 l 5472 7455 l cp
2628 7395 m 2460 7395 l 2460 7455 l 2628 7455 l 2628 7455 l 2508 7425 l 2628 7395 l cp
eoclip
n 2475 7425 m
 5625 7425 l gs col0 s gr gr
 [] 0 sd
% arrowhead
n 2628 7395 m 2508 7425 l 2628 7455 l  col0 s
% arrowhead
n 5472 7455 m 5592 7425 l 5472 7395 l  col0 s
% Polyline
 [60] 0 sd
gs  clippath
4020 8172 m 4020 8340 l 4080 8340 l 4080 8172 l 4080 8172 l 4050 8292 l 4020 8172 l cp
4080 6678 m 4080 6510 l 4020 6510 l 4020 6678 l 4020 6678 l 4050 6558 l 4080 6678 l cp
eoclip
n 4050 6525 m
 4050 8325 l gs col0 s gr gr
 [] 0 sd
% arrowhead
n 4080 6678 m 4050 6558 l 4020 6678 l  col0 s
% arrowhead
n 4020 8172 m 4050 8292 l 4080 8172 l  col0 s
% Polyline
gs  clippath
5880 4203 m 5880 4035 l 5820 4035 l 5820 4203 l 5820 4203 l 5850 4083 l 5880 4203 l cp
5820 7272 m 5820 7440 l 5880 7440 l 5880 7272 l 5880 7272 l 5850 7392 l 5820 7272 l cp
eoclip
n 5850 7425 m
 5850 4050 l gs col0 s gr gr

% arrowhead
n 5820 7272 m 5850 7392 l 5880 7272 l  col0 s
% arrowhead
n 5880 4203 m 5850 4083 l 5820 4203 l  col0 s
% Polyline
 [60] 0 sd
gs  clippath
5472 5880 m 5640 5880 l 5640 5820 l 5472 5820 l 5472 5820 l 5592 5850 l 5472 5880 l cp
4203 5820 m 4035 5820 l 4035 5880 l 4203 5880 l 4203 5880 l 4083 5850 l 4203 5820 l cp
eoclip
n 4050 5850 m
 5625 5850 l gs col0 s gr gr
 [] 0 sd
% arrowhead
n 4203 5820 m 4083 5850 l 4203 5880 l  col0 s
% arrowhead
n 5472 5880 m 5592 5850 l 5472 5820 l  col0 s
/Times-Roman ff 190.50 scf sf
3870 7110 m
gs 1 -1 sc (8) col0 sh gr
/Times-Roman ff 190.50 scf sf
4140 7650 m
gs 1 -1 sc (14) col0 sh gr
/Times-Roman ff 190.50 scf sf
3870 5850 m
gs 1 -1 sc (7) col0 sh gr
/Times-Roman ff 190.50 scf sf
6075 5850 m
gs 1 -1 sc (15) col0 sh gr
/Times-Roman ff 190.50 scf sf
4770 5760 m
gs 1 -1 sc (7) col0 sh gr
/Times-Roman ff 190.50 scf sf
2790 5130 m
gs 1 -1 sc (11) col0 sh gr
% here ends figure;
$F2psEnd
rs
showpage
%%Trailer
%EOF
