%!PS-Adobe-3.0 EPSF-3.0
%%Title: trens.fig
%%Creator: fig2dev Version 3.2 Patchlevel 5e
%%CreationDate: Thu Oct 17 15:54:13 2013
%%For: xan@rulot (Xavier J. B. L.)
%%BoundingBox: 0 0 740 56
%Magnification: 1.0000
%%EndComments
%%BeginProlog
/$F2psDict 200 dict def
$F2psDict begin
$F2psDict /mtrx matrix put
/col-1 {0 setgray} bind def
/col0 {0.000 0.000 0.000 srgb} bind def
/col1 {0.000 0.000 1.000 srgb} bind def
/col2 {0.000 1.000 0.000 srgb} bind def
/col3 {0.000 1.000 1.000 srgb} bind def
/col4 {1.000 0.000 0.000 srgb} bind def
/col5 {1.000 0.000 1.000 srgb} bind def
/col6 {1.000 1.000 0.000 srgb} bind def
/col7 {1.000 1.000 1.000 srgb} bind def
/col8 {0.000 0.000 0.560 srgb} bind def
/col9 {0.000 0.000 0.690 srgb} bind def
/col10 {0.000 0.000 0.820 srgb} bind def
/col11 {0.530 0.810 1.000 srgb} bind def
/col12 {0.000 0.560 0.000 srgb} bind def
/col13 {0.000 0.690 0.000 srgb} bind def
/col14 {0.000 0.820 0.000 srgb} bind def
/col15 {0.000 0.560 0.560 srgb} bind def
/col16 {0.000 0.690 0.690 srgb} bind def
/col17 {0.000 0.820 0.820 srgb} bind def
/col18 {0.560 0.000 0.000 srgb} bind def
/col19 {0.690 0.000 0.000 srgb} bind def
/col20 {0.820 0.000 0.000 srgb} bind def
/col21 {0.560 0.000 0.560 srgb} bind def
/col22 {0.690 0.000 0.690 srgb} bind def
/col23 {0.820 0.000 0.820 srgb} bind def
/col24 {0.500 0.190 0.000 srgb} bind def
/col25 {0.630 0.250 0.000 srgb} bind def
/col26 {0.750 0.380 0.000 srgb} bind def
/col27 {1.000 0.500 0.500 srgb} bind def
/col28 {1.000 0.630 0.630 srgb} bind def
/col29 {1.000 0.750 0.750 srgb} bind def
/col30 {1.000 0.880 0.880 srgb} bind def
/col31 {1.000 0.840 0.000 srgb} bind def

end

/cp {closepath} bind def
/ef {eofill} bind def
/gr {grestore} bind def
/gs {gsave} bind def
/sa {save} bind def
/rs {restore} bind def
/l {lineto} bind def
/m {moveto} bind def
/rm {rmoveto} bind def
/n {newpath} bind def
/s {stroke} bind def
/sh {show} bind def
/slc {setlinecap} bind def
/slj {setlinejoin} bind def
/slw {setlinewidth} bind def
/srgb {setrgbcolor} bind def
/rot {rotate} bind def
/sc {scale} bind def
/sd {setdash} bind def
/ff {findfont} bind def
/sf {setfont} bind def
/scf {scalefont} bind def
/sw {stringwidth} bind def
/tr {translate} bind def
/tnt {dup dup currentrgbcolor
  4 -2 roll dup 1 exch sub 3 -1 roll mul add
  4 -2 roll dup 1 exch sub 3 -1 roll mul add
  4 -2 roll dup 1 exch sub 3 -1 roll mul add srgb}
  bind def
/shd {dup dup currentrgbcolor 4 -2 roll mul 4 -2 roll mul
  4 -2 roll mul srgb} bind def
/$F2psBegin {$F2psDict begin /$F2psEnteredState save def} def
/$F2psEnd {$F2psEnteredState restore end} def

/pageheader {
save
newpath 0 56 moveto 0 0 lineto 740 0 lineto 740 56 lineto closepath clip newpath
-35.3 252.7 translate
1 -1 scale
$F2psBegin
10 setmiterlimit
0 slj 0 slc
 0.06000 0.06000 sc
} bind def
/pagefooter {
$F2psEnd
restore
} bind def
%%EndProlog
pageheader
%
% Fig objects follow
%
% 
% here starts figure with depth 50
% Polyline
0 slj
0 slc
7.500 slw
n 2100 3300 m 3300 3300 l 3300 4200 l 2100 4200 l
 2100 3300 l  cp gs col0 s gr 
% Polyline
n 2325 3525 m 2325 3750 l 2625 3750 l 2625 3525 l
 2325 3525 l  cp gs col0 s gr 
% Polyline
n 2775 3525 m 2775 3750 l 3075 3750 l 3075 3525 l
 2775 3525 l  cp gs col0 s gr 
% Polyline
n 3375 3300 m 4575 3300 l 4575 4200 l 3375 4200 l
 3375 3300 l  cp gs col0 s gr 
% Polyline
n 3600 3525 m 3600 3750 l 3900 3750 l 3900 3525 l
 3600 3525 l  cp gs col0 s gr 
% Polyline
n 4050 3525 m 4050 3750 l 4350 3750 l 4350 3525 l
 4050 3525 l  cp gs col0 s gr 
% Polyline
n 4650 3300 m 5850 3300 l 5850 4200 l 4650 4200 l
 4650 3300 l  cp gs col0 s gr 
% Polyline
n 4875 3525 m 4875 3750 l 5175 3750 l 5175 3525 l
 4875 3525 l  cp gs col0 s gr 
% Polyline
n 5325 3525 m 5325 3750 l 5625 3750 l 5625 3525 l
 5325 3525 l  cp gs col0 s gr 
% Polyline
n 9900 3300 m 9075 3300 l 8475 3750 l 8475 4200 l 9900 4200 l
 9900 3300 l  cp gs col0 s gr 
% Polyline
n 9300 3525 m 9300 3750 l 8925 3750 l 9075 3525 l
 9300 3525 l  cp gs col0 s gr 
% Polyline
n 5925 3300 m 6750 3300 l 7350 3750 l 7350 4200 l 5925 4200 l
 5925 3300 l  cp gs col0 s gr 
% Polyline
n 6525 3525 m 6525 3750 l 6900 3750 l 6750 3525 l
 6525 3525 l  cp gs col0 s gr 
% Polyline
n 11175 3300 m 9975 3300 l 9975 4200 l 11175 4200 l
 11175 3300 l  cp gs col0 s gr 
% Polyline
n 10950 3525 m 10950 3750 l 10650 3750 l 10650 3525 l
 10950 3525 l  cp gs col0 s gr 
% Polyline
n 10500 3525 m 10500 3750 l 10200 3750 l 10200 3525 l
 10500 3525 l  cp gs col0 s gr 
% Polyline
n 12450 3300 m 11250 3300 l 11250 4200 l 12450 4200 l
 12450 3300 l  cp gs col0 s gr 
% Polyline
n 12225 3525 m 12225 3750 l 11925 3750 l 11925 3525 l
 12225 3525 l  cp gs col0 s gr 
% Polyline
n 11775 3525 m 11775 3750 l 11475 3750 l 11475 3525 l
 11775 3525 l  cp gs col0 s gr 
% Polyline
n 600 4200 m
 12900 4200 l gs col0 s gr 
% here ends figure;
pagefooter
showpage
%%Trailer
%EOF
