#FIG 3.2  Produced by xfig version 3.2.5
Landscape
Center
Metric
A4      
100.00
Single
-2
1200 2
2 1 0 1 0 7 50 -1 -1 0.000 0 0 -1 0 0 4
	 2700 4950 4275 3825 4275 4950 2700 4950
2 1 0 1 0 7 50 -1 -1 0.000 0 0 -1 0 0 4
	 8986 4961 5836 3836 5836 4961 8986 4961
4 0 0 50 -1 0 12 0.0000 4 180 540 4500 4500 4,8cm\001
4 0 0 50 -1 0 12 0.0000 4 150 105 3150 4275 6\001
4 0 0 50 -1 0 12 0.0000 4 150 210 7200 5175 10\001
