%!PS-Adobe-3.0 EPSF-3.0
%%Creator: EpsGraphics 1.0.0 by Thomas Abeel, http://www.sourceforge.net/epsgraphics/
%%Title: GeoGebra, http://www.geogebra.org/
%%CreationDate: Wed Jan 21 11:29:07 CET 2015
%%BoundingBox: 0 0 465 336
%%DocumentData: Clean7Bit
%%LanguageLevel: 2
%%DocumentProcessColors: Black
%%ColorUsage: Color
%%Origin: 0 0
%%Pages: 1
%%Page: 1 1
%%EndComments

gsave
0.0 336.0 translate
0.0 0.0 0.0 setrgbcolor
0.0 0.0 0.0 setrgbcolor
gsave
newpath
0.0 -0.0 moveto
465.3244715815448 -0.0 lineto
465.3244715815448 -336.35813863385073 lineto
0.0 -336.35813863385073 lineto
0.0 -0.0 lineto
closepath
clip
newpath
1.0 1.0 1.0 setrgbcolor
newpath
0.0 -0.0 moveto
465.3244715815448 -0.0 lineto
465.3244715815448 -336.35813863385073 lineto
0.0 -336.35813863385073 lineto
0.0 -0.0 lineto
closepath
fill
newpath
0.0 0.0 0.0 setrgbcolor
1.0 setlinewidth
10.0 setmiterlimit
0 setlinejoin
0 setlinecap
[ ] 0 setdash
newpath
81.30926940398422 -1.1618588553846312 moveto
81.30926940398422 -336.35813863385073 lineto
stroke
newpath
1.0 setlinewidth
10.0 setmiterlimit
0 setlinejoin
0 setlinecap
[ ] 0 setdash
newpath
81.59973411783038 -0.5809294276923156 moveto
79.56648112090727 -2.3237177107692624 lineto
stroke
newpath
1.0 setlinewidth
10.0 setmiterlimit
0 setlinejoin
0 setlinecap
[ ] 0 setdash
newpath
81.01880469013807 -0.5809294276923156 moveto
83.05205768706116 -2.3237177107692624 lineto
stroke
newpath
1.0 setlinewidth
10.0 setmiterlimit
0 setlinejoin
0 setlinecap
[ ] 0 setdash
newpath
0.0 -243.06111505754214 moveto
464.16261272616015 -243.06111505754214 lineto
stroke
newpath
1.0 setlinewidth
10.0 setmiterlimit
0 setlinejoin
0 setlinecap
[ ] 0 setdash
newpath
464.74354215385245 -243.3515797713883 moveto
463.00075387077555 -241.3183267744652 lineto
stroke
newpath
1.0 setlinewidth
10.0 setmiterlimit
0 setlinejoin
0 setlinecap
[ ] 0 setdash
newpath
464.74354215385245 -242.77065034369596 moveto
463.00075387077555 -244.8039033406191 lineto
stroke
newpath
0.0 0.0 0.0 setrgbcolor
1.0 setlinewidth
10.0 setmiterlimit
0 setlinejoin
0 setlinecap
[ ] 0 setdash
newpath
20.613917660769513 -249.16426234615724 moveto
22.955789416154158 -249.16426234615724 lineto
22.955789416154158 -249.5727283500034 lineto
20.613917660769513 -249.5727283500034 lineto
20.613917660769513 -249.16426234615724 lineto
closepath
24.35365085153879 -250.48043058077263 moveto
26.350595759231126 -250.48043058077263 lineto
26.350595759231126 -250.96151276308035 lineto
23.663797156154168 -250.96151276308035 lineto
23.663797156154168 -250.48043058077263 lineto
23.88164569803118 -250.25653069051015 24.178161759180743 -249.95396328124562 24.553345342308027 -249.5727283500034 curveto
24.928528942207322 -249.19149340171862 25.164531512468738 -248.9464138091495 25.261353082308037 -248.8374895430803 curveto
25.442893533872212 -248.63174369797423 25.569971841851643 -248.45776744108946 25.642588019231116 -248.315560760388 curveto
25.715204199856785 -248.1733540733294 25.751512286923425 -248.03266022972429 25.751512286923425 -247.8934792230803 curveto
25.751512286923425 -247.66957933281782 25.672844757912284 -247.48652605416638 25.515509706923424 -247.3443193734649 curveto
25.358174648901137 -247.20211268640628 25.152428810828496 -247.13100934923412 24.898272190000338 -247.13100934923412 curveto
24.716731738436163 -247.13100934923412 24.527627109505637 -247.16277892825784 24.330958295769562 -247.2263180834649 curveto
24.134289473241704 -247.28985724151235 23.92097945144558 -247.38516597574312 23.691028223077247 -247.5122442861572 curveto
23.691028223077247 -246.9313148584649 lineto
23.9209794617252 -246.84054463268282 24.135802319129855 -246.77095413030762 24.33549680692341 -246.72254334538798 curveto
24.535191303644 -246.6741325583042 24.719757420473872 -246.64992716692643 24.889195167692645 -246.64992716692643 curveto
25.324892251446666 -246.64992716692643 25.67435760123053 -246.75885143786493 25.937591244231122 -246.97669997000335 curveto
26.200824898999176 -247.19454851188036 26.332441714615744 -247.4880388988372 26.332441714615744 -247.85717113384953 curveto
26.332441714615744 -248.03266023702824 26.299159298495645 -248.1975594726874 26.232594469231127 -248.35186884961877 curveto
26.166029636990928 -248.5061782334483 26.048028346449893 -248.68923151521068 25.87859059923112 -248.90102869923416 curveto
25.83017981214734 -248.9554908347034 25.67889610467466 -249.1143387273874 25.4247394838465 -249.377572370388 curveto
25.170582851656654 -249.64080602515605 24.813553308275463 -250.00842542780606 24.35365085153879 -250.48043058077263 curveto
closepath
28.775862657067698 -247.10377828231105 moveto
28.485397934565018 -247.10377828231105 28.26603656857642 -247.2490106435624 28.117778539759996 -247.5394753530803 curveto
27.96952050431592 -247.82994007558298 27.895391493221535 -248.26563714635222 27.895391493221535 -248.846566565388 curveto
27.895391493221535 -249.42749601039336 27.96952051094357 -249.86319306817782 28.117778539759996 -250.1536577776957 curveto
28.266036575204073 -250.4441225001984 28.485397947549803 -250.58935484846495 28.775862657067698 -250.58935484846495 curveto
29.078430076341323 -250.58935484846495 29.30384279017436 -250.4441224872136 29.452100818990786 -250.1536577776957 curveto
29.600358854434862 -249.86319305519302 29.67448786552925 -249.42749598442379 29.67448786552925 -248.846566565388 curveto
29.67448786552925 -248.26563712038265 29.60035884780721 -247.82994006259818 29.452100818990786 -247.5394753530803 curveto
29.30384278354671 -247.2490106305776 29.078430062815507 -247.10377828231105 28.775862657067698 -247.10377828231105 curveto
closepath
28.775862657067698 -246.64992716692643 moveto
29.25391917952003 -246.64992716692643 29.618512898373957 -246.83751896687608 29.869643845144637 -247.21270255000337 curveto
30.120774803141746 -247.58788614990266 30.246340270913873 -248.13250748782318 30.246340270913873 -248.846566565388 curveto
30.246340270913873 -249.56062567487376 30.120774791915316 -250.10524699764534 29.869643845144637 -250.48043058077263 curveto
29.618512887147528 -250.85561418067195 29.253919158149237 -251.04320596384957 28.775862657067698 -251.04320596384957 curveto
28.30385748300084 -251.04320596384957 27.942289438069132 -250.85561416389993 27.691158491298452 -250.48043058077263 curveto
27.440027533301343 -250.10524698087332 27.314462065529217 -249.56062564295283 27.314462065529217 -248.846566565388 curveto
27.314462065529217 -248.13250745590224 27.440027544527773 -247.58788613313064 27.691158491298452 -247.21270255000337 curveto
27.94228944929556 -246.83751895010406 28.303857504101117 -246.64992716692643 28.775862657067698 -246.64992716692643 curveto
closepath
fill
newpath
1.0 setlinewidth
10.0 setmiterlimit
0 setlinejoin
0 setlinecap
[ ] 0 setdash
newpath
24.616356018157457 -243.06111505754214 moveto
24.616356018157457 -245.38483276831138 lineto
stroke
newpath
0.0 0.0 0.0 setrgbcolor
1.0 setlinewidth
10.0 setmiterlimit
0 setlinejoin
0 setlinecap
[ ] 0 setdash
newpath
86.07740254384733 -247.10377828231105 moveto
85.78693782134465 -247.10377828231105 85.56757645535605 -247.2490106435624 85.41931842653962 -247.5394753530803 curveto
85.27106039109555 -247.82994007558298 85.19693138000116 -248.26563714635222 85.19693138000116 -248.846566565388 curveto
85.19693138000116 -249.42749601039336 85.27106039772319 -249.86319306817782 85.41931842653962 -250.1536577776957 curveto
85.5675764619837 -250.4441225001984 85.78693783432944 -250.58935484846495 86.07740254384733 -250.58935484846495 curveto
86.37996996312096 -250.58935484846495 86.60538267695398 -250.4441224872136 86.75364070577041 -250.1536577776957 curveto
86.9018987412145 -249.86319305519302 86.97602775230888 -249.42749598442379 86.97602775230888 -248.846566565388 curveto
86.97602775230888 -248.26563712038265 86.90189873458684 -247.82994006259818 86.75364070577041 -247.5394753530803 curveto
86.60538267032634 -247.2490106305776 86.37996994959514 -247.10377828231105 86.07740254384733 -247.10377828231105 curveto
closepath
86.07740254384733 -246.64992716692643 moveto
86.55545906629965 -246.64992716692643 86.92005278515357 -246.83751896687608 87.17118373192426 -247.21270255000337 curveto
87.42231468992136 -247.58788614990266 87.5478801576935 -248.13250748782318 87.5478801576935 -248.846566565388 curveto
87.5478801576935 -249.56062567487376 87.42231467869495 -250.10524699764534 87.17118373192426 -250.48043058077263 curveto
86.92005277392715 -250.85561418067195 86.55545904492885 -251.04320596384957 86.07740254384733 -251.04320596384957 curveto
85.60539736978046 -251.04320596384957 85.24382932484876 -250.85561416389993 84.99269837807807 -250.48043058077263 curveto
84.74156742008097 -250.10524698087332 84.61600195230885 -249.56062564295283 84.61600195230885 -248.846566565388 curveto
84.61600195230885 -248.13250745590224 84.7415674313074 -247.58788613313064 84.99269837807807 -247.21270255000337 curveto
85.24382933607518 -246.83751895010406 85.60539739088074 -246.64992716692643 86.07740254384733 -246.64992716692643 curveto
closepath
fill
newpath
0.0 0.0 0.0 setrgbcolor
1.0 setlinewidth
10.0 setmiterlimit
0 setlinejoin
0 setlinecap
[ ] 0 setdash
newpath
136.4730303961557 -250.48043058077263 moveto
138.46997530384803 -250.48043058077263 lineto
138.46997530384803 -250.96151276308035 lineto
135.78317670077107 -250.96151276308035 lineto
135.78317670077107 -250.48043058077263 lineto
136.0010252426481 -250.25653069051015 136.29754130379766 -249.95396328124562 136.67272488692493 -249.5727283500034 curveto
137.04790848682424 -249.19149340171862 137.28391105708565 -248.9464138091495 137.38073262692495 -248.8374895430803 curveto
137.5622730784891 -248.63174369797423 137.68935138646856 -248.45776744108946 137.76196756384803 -248.315560760388 curveto
137.83458374447372 -248.1733540733294 137.87089183154035 -248.03266022972429 137.87089183154035 -247.8934792230803 curveto
137.87089183154035 -247.66957933281782 137.7922243025292 -247.48652605416638 137.63488925154033 -247.3443193734649 curveto
137.47755419351805 -247.20211268640628 137.27180835544542 -247.13100934923412 137.01765173461726 -247.13100934923412 curveto
136.83611128305307 -247.13100934923412 136.64700665412255 -247.16277892825784 136.45033784038648 -247.2263180834649 curveto
136.2536690178586 -247.28985724151235 136.04035899606248 -247.38516597574312 135.81040776769416 -247.5122442861572 curveto
135.81040776769416 -246.9313148584649 lineto
136.0403590063421 -246.84054463268282 136.25518186374677 -246.77095413030762 136.45487635154032 -246.72254334538798 curveto
136.65457084826093 -246.6741325583042 136.8391369650908 -246.64992716692643 137.00857471230955 -246.64992716692643 curveto
137.4442717960636 -246.64992716692643 137.79373714584744 -246.75885143786493 138.05697078884802 -246.97669997000335 curveto
138.32020444361606 -247.19454851188036 138.45182125923264 -247.4880388988372 138.45182125923264 -247.85717113384953 curveto
138.45182125923264 -248.03266023702824 138.41853884311254 -248.1975594726874 138.35197401384804 -248.35186884961877 curveto
138.28540918160783 -248.5061782334483 138.1674078910668 -248.68923151521068 137.99797014384802 -248.90102869923416 curveto
137.94955935676424 -248.9554908347034 137.79827564929155 -249.1143387273874 137.5441190284634 -249.377572370388 curveto
137.28996239627355 -249.64080602515605 136.93293285289238 -250.00842542780606 136.4730303961557 -250.48043058077263 curveto
closepath
140.8952422016846 -247.10377828231105 moveto
140.6047774791819 -247.10377828231105 140.38541611319332 -247.2490106435624 140.23715808437692 -247.5394753530803 curveto
140.08890004893283 -247.82994007558298 140.01477103783844 -248.26563714635222 140.01477103783844 -248.846566565388 curveto
140.01477103783844 -249.42749601039336 140.0889000555605 -249.86319306817782 140.23715808437692 -250.1536577776957 curveto
140.38541611982097 -250.4441225001984 140.6047774921667 -250.58935484846495 140.8952422016846 -250.58935484846495 curveto
141.19780962095822 -250.58935484846495 141.42322233479126 -250.4441224872136 141.5714803636077 -250.1536577776957 curveto
141.71973839905178 -249.86319305519302 141.79386741014616 -249.42749598442379 141.79386741014616 -248.846566565388 curveto
141.79386741014616 -248.26563712038265 141.71973839242412 -247.82994006259818 141.5714803636077 -247.5394753530803 curveto
141.4232223281636 -247.2490106305776 141.19780960743242 -247.10377828231105 140.8952422016846 -247.10377828231105 curveto
closepath
140.8952422016846 -246.64992716692643 moveto
141.37329872413693 -246.64992716692643 141.73789244299087 -246.83751896687608 141.98902338976154 -247.21270255000337 curveto
142.24015434775865 -247.58788614990266 142.36571981553078 -248.13250748782318 142.36571981553078 -248.846566565388 curveto
142.36571981553078 -249.56062567487376 142.2401543365322 -250.10524699764534 141.98902338976154 -250.48043058077263 curveto
141.73789243176444 -250.85561418067195 141.37329870276614 -251.04320596384957 140.8952422016846 -251.04320596384957 curveto
140.42323702761774 -251.04320596384957 140.06166898268603 -250.85561416389993 139.81053803591536 -250.48043058077263 curveto
139.55940707791825 -250.10524698087332 139.43384161014612 -249.56062564295283 139.43384161014612 -248.846566565388 curveto
139.43384161014612 -248.13250745590224 139.55940708914468 -247.58788613313064 139.81053803591536 -247.21270255000337 curveto
140.06166899391246 -246.83751895010406 140.42323704871802 -246.64992716692643 140.8952422016846 -246.64992716692643 curveto
closepath
fill
newpath
1.0 setlinewidth
10.0 setmiterlimit
0 setlinejoin
0 setlinecap
[ ] 0 setdash
newpath
138.002182789811 -243.06111505754214 moveto
138.002182789811 -245.38483276831138 lineto
stroke
newpath
0.0 0.0 0.0 setrgbcolor
1.0 setlinewidth
10.0 setmiterlimit
0 setlinejoin
0 setlinecap
[ ] 0 setdash
newpath
194.48427996461803 -247.22177957231105 moveto
193.04103341769493 -249.48195812692646 lineto
194.48427996461803 -249.48195812692646 lineto
194.48427996461803 -247.22177957231105 lineto
closepath
194.32997058538726 -246.72254334538798 moveto
195.05613237000264 -246.72254334538798 lineto
195.05613237000264 -249.48195812692646 lineto
195.65521584231035 -249.48195812692646 lineto
195.65521584231035 -249.96304030923417 lineto
195.05613237000264 -249.96304030923417 lineto
195.05613237000264 -250.96151276308035 lineto
194.48427996461803 -250.96151276308035 lineto
194.48427996461803 -249.96304030923417 lineto
192.56902825769492 -249.96304030923417 lineto
192.56902825769492 -249.40934194846494 lineto
194.32997058538726 -246.72254334538798 lineto
closepath
197.82632611553154 -247.10377828231105 moveto
197.53586139302885 -247.10377828231105 197.31650002704026 -247.2490106435624 197.16824199822383 -247.5394753530803 curveto
197.01998396277975 -247.82994007558298 196.94585495168536 -248.26563714635222 196.94585495168536 -248.846566565388 curveto
196.94585495168536 -249.42749601039336 197.0199839694074 -249.86319306817782 197.16824199822383 -250.1536577776957 curveto
197.31650003366792 -250.4441225001984 197.53586140601365 -250.58935484846495 197.82632611553154 -250.58935484846495 curveto
198.12889353480517 -250.58935484846495 198.3543062486382 -250.4441224872136 198.5025642774546 -250.1536577776957 curveto
198.6508223128987 -249.86319305519302 198.72495132399308 -249.42749598442379 198.72495132399308 -248.846566565388 curveto
198.72495132399308 -248.26563712038265 198.65082230627104 -247.82994006259818 198.5025642774546 -247.5394753530803 curveto
198.35430624201055 -247.2490106305776 198.12889352127937 -247.10377828231105 197.82632611553154 -247.10377828231105 curveto
closepath
197.82632611553154 -246.64992716692643 moveto
198.30438263798388 -246.64992716692643 198.6689763568378 -246.83751896687608 198.92010730360846 -247.21270255000337 curveto
199.17123826160557 -247.58788614990266 199.2968037293777 -248.13250748782318 199.2968037293777 -248.846566565388 curveto
199.2968037293777 -249.56062567487376 199.17123825037913 -250.10524699764534 198.92010730360846 -250.48043058077263 curveto
198.66897634561136 -250.85561418067195 198.30438261661308 -251.04320596384957 197.82632611553154 -251.04320596384957 curveto
197.35432094146466 -251.04320596384957 196.99275289653298 -250.85561416389993 196.7416219497623 -250.48043058077263 curveto
196.4904909917652 -250.10524698087332 196.36492552399307 -249.56062564295283 196.36492552399307 -248.846566565388 curveto
196.36492552399307 -248.13250745590224 196.49049100299163 -247.58788613313064 196.7416219497623 -247.21270255000337 curveto
196.9927529077594 -246.83751895010406 197.35432096256494 -246.64992716692643 197.82632611553154 -246.64992716692643 curveto
closepath
fill
newpath
1.0 setlinewidth
10.0 setmiterlimit
0 setlinejoin
0 setlinecap
[ ] 0 setdash
newpath
194.69509617563776 -243.06111505754214 moveto
194.69509617563776 -245.38483276831138 lineto
stroke
newpath
0.0 0.0 0.0 setrgbcolor
1.0 setlinewidth
10.0 setmiterlimit
0 setlinejoin
0 setlinecap
[ ] 0 setdash
newpath
250.55304675923418 -248.6196410076957 moveto
250.29889012704433 -248.6196410076957 250.0961699674927 -248.70738555928503 249.9448862646188 -248.88287465461877 curveto
249.793602554982 -249.05836375779748 249.71796070692648 -249.29739201117866 249.71796070692648 -249.59995941692648 curveto
249.71796070692648 -249.90857818458556 249.79360256174488 -250.15063210620812 249.9448862646188 -250.32612120154187 curveto
250.0961699742556 -250.50161030472057 250.29889013840602 -250.58935484846495 250.55304675923418 -250.58935484846495 curveto
250.8132547398095 -250.58935484846495 251.017487736187 -250.5016102968756 251.1657457650034 -250.32612120154187 curveto
251.3140038004475 -250.15063209836316 251.38813281154188 -249.90857817078924 251.38813281154188 -249.59995941692648 curveto
251.38813281154188 -249.29739199765285 251.31400379381984 -249.05836374995252 251.1657457650034 -248.88287465461877 curveto
251.01748772955935 -248.70738555144007 250.8132547281773 -248.6196410076957 250.55304675923418 -248.6196410076957 curveto
closepath
251.6967515700034 -246.82239059077259 moveto
251.6967515700034 -247.33978086231104 lineto
251.5515192087521 -247.27321603007084 251.40477401689677 -247.22177957177 251.25651598808034 -247.18547148308028 curveto
251.10825795263625 -247.14916339276743 250.96453843510892 -247.13100934923412 250.82535742846494 -247.13100934923412 curveto
250.44412248018017 -247.13100934923412 250.15365777472002 -247.25808766532904 249.95396328692647 -247.5122442861572 curveto
249.75426879020588 -247.76640091834707 249.6423188540017 -248.15368720365564 249.61811346154187 -248.67410314154185 curveto
249.72703773248037 -248.51071673513408 249.86621874047694 -248.38515126343947 250.03565648769572 -248.2974067157726 curveto
250.20509424248894 -248.20966216418327 250.3896603606714 -248.16578989231107 250.58935484846495 -248.16578989231107 curveto
251.01294923544802 -248.16578989231107 251.3487990519056 -248.29438104550235 251.5969043246188 -248.551563340388 curveto
251.8450096084232 -248.80874564677057 251.9690622392342 -249.15821100453468 251.9690622392342 -249.59995941692648 curveto
251.9690622392342 -250.0356565006805 251.8404710860429 -250.38512185046434 251.58328879115726 -250.64835549346495 curveto
251.32610648477467 -250.911589148233 250.98269247539608 -251.04320596384957 250.55304675923418 -251.04320596384957 curveto
250.0628875400109 -251.04320596384957 249.6892167991198 -250.85561416389993 249.43203450423417 -250.48043058077263 curveto
249.17485219785158 -250.10524698087332 249.04626105615722 -249.56062564295283 249.04626105615722 -248.846566565388 curveto
249.04626105615722 -248.18091824298602 249.2051089512759 -247.64839961482124 249.5228047273111 -247.24901063923414 curveto
249.8405005175484 -246.84962164579295 250.26560772742573 -246.64992716692643 250.79812636154188 -246.64992716692643 curveto
250.9433587227932 -246.64992716692643 251.08859107755217 -246.66354270079376 251.2338234323111 -246.69077376731104 curveto
251.37905579356243 -246.71800483504566 251.5333651708996 -246.76187710962301 251.6967515700034 -246.82239059077259 curveto
closepath
254.17648060168614 -247.10377828231105 moveto
253.88601587918345 -247.10377828231105 253.66665451319486 -247.2490106435624 253.51839648437846 -247.5394753530803 curveto
253.37013844893437 -247.82994007558298 253.29600943783998 -248.26563714635222 253.29600943783998 -248.846566565388 curveto
253.29600943783998 -249.42749601039336 253.37013845556203 -249.86319306817782 253.51839648437846 -250.1536577776957 curveto
253.66665451982252 -250.4441225001984 253.88601589216825 -250.58935484846495 254.17648060168614 -250.58935484846495 curveto
254.47904802095977 -250.58935484846495 254.7044607347928 -250.4441224872136 254.85271876360923 -250.1536577776957 curveto
255.00097679905332 -249.86319305519302 255.0751058101477 -249.42749598442379 255.0751058101477 -248.846566565388 curveto
255.0751058101477 -248.26563712038265 255.00097679242566 -247.82994006259818 254.85271876360923 -247.5394753530803 curveto
254.70446072816515 -247.2490106305776 254.47904800743396 -247.10377828231105 254.17648060168614 -247.10377828231105 curveto
closepath
254.17648060168614 -246.64992716692643 moveto
254.65453712413847 -246.64992716692643 255.0191308429924 -246.83751896687608 255.27026178976308 -247.21270255000337 curveto
255.5213927477602 -247.58788614990266 255.64695821553232 -248.13250748782318 255.64695821553232 -248.846566565388 curveto
255.64695821553232 -249.56062567487376 255.52139273653376 -250.10524699764534 255.27026178976308 -250.48043058077263 curveto
255.01913083176598 -250.85561418067195 254.65453710276768 -251.04320596384957 254.17648060168614 -251.04320596384957 curveto
253.7044754276193 -251.04320596384957 253.34290738268757 -250.85561416389993 253.0917764359169 -250.48043058077263 curveto
252.8406454779198 -250.10524698087332 252.71508001014766 -249.56062564295283 252.71508001014766 -248.846566565388 curveto
252.71508001014766 -248.13250745590224 252.84064548914623 -247.58788613313064 253.0917764359169 -247.21270255000337 curveto
253.342907393914 -246.83751895010406 253.70447544871956 -246.64992716692643 254.17648060168614 -246.64992716692643 curveto
closepath
fill
newpath
1.0 setlinewidth
10.0 setmiterlimit
0 setlinejoin
0 setlinecap
[ ] 0 setdash
newpath
251.38800956146451 -243.06111505754214 moveto
251.38800956146451 -245.38483276831138 lineto
stroke
newpath
0.0 0.0 0.0 setrgbcolor
1.0 setlinewidth
10.0 setmiterlimit
0 setlinejoin
0 setlinecap
[ ] 0 setdash
newpath
307.41151449461955 -248.9464138107726 moveto
307.13920381727326 -248.9464138107726 306.9258937988586 -249.02054282849465 306.77158442192723 -249.16880085731108 curveto
306.61727503809766 -249.31705889275517 306.5401203530811 -249.51826621994448 306.5401203530811 -249.77242284077263 curveto
306.5401203530811 -250.02657947296248 306.61727504499584 -250.22627395832137 306.77158442192723 -250.37150631308032 curveto
306.9258938057568 -250.51673867433166 307.1392038294465 -250.58935484846495 307.41151449461955 -250.58935484846495 curveto
307.68382517196585 -250.58935484846495 307.89864802747684 -250.51673866783926 308.0559830784657 -250.37150631308032 curveto
308.213318136488 -250.226273951829 308.2919856584657 -250.0265794616008 308.2919856584657 -249.77242284077263 curveto
308.2919856584657 -249.5182662085828 308.21483096655095 -249.3170588861275 308.06052158961955 -249.16880085731108 curveto
307.90621220579 -249.020542821867 307.6898765079075 -248.9464138107726 307.41151449461955 -248.9464138107726 curveto
closepath
306.83966208923493 -248.71041123077262 moveto
306.59760815381605 -248.6498977469179 306.40699069049435 -248.53492213029907 306.2678096838503 -248.36548438308031 curveto
306.1286286709845 -248.19604662828706 306.0590381707734 -247.99030079075547 306.0590381707734 -247.74824686615722 curveto
306.0590381707734 -247.40937135657074 306.18006513848286 -247.14159920566252 306.4221190630811 -246.94493039192645 curveto
306.6641729985 -246.74826156939858 306.9939714746876 -246.64992716692643 307.41151449461955 -246.64992716692643 curveto
307.83510888160265 -246.64992716692643 308.1679330238675 -246.74826157819035 308.40998694846576 -246.94493039192645 curveto
308.65204088388464 -247.1415992144543 308.7730678407734 -247.40937137171966 308.7730678407734 -247.74824686615722 curveto
308.7730678407734 -247.99030080157613 308.7034773343405 -248.19604663586153 308.5642963276965 -248.36548438308031 curveto
308.42511531483063 -248.53492213787354 308.23449784691013 -248.64989774962305 307.9924439223119 -248.71041123077262 curveto
308.27080594804363 -248.77092471462734 308.48562880328416 -248.89497735382434 308.63691250615807 -249.082569145388 curveto
308.78819621579487 -249.27016094533764 308.8638380638504 -249.5001121755996 308.8638380638504 -249.77242284077263 curveto
308.8638380638504 -250.18391453098477 308.73978542194817 -250.4985846286342 308.491680149235 -250.71643316077265 curveto
308.2435748654306 -250.93428170264966 307.8835196475861 -251.04320596384957 307.41151449461955 -251.04320596384957 curveto
306.9455606689382 -251.04320596384957 306.5870182979287 -250.93428169291107 306.335887351158 -250.71643316077265 curveto
306.0847563931609 -250.49858461889562 305.9591909253888 -250.18391451258964 305.9591909253888 -249.77242284077263 curveto
305.9591909253888 -249.50011216342637 306.0378584543999 -249.27016093695164 306.1951935053888 -249.082569145388 curveto
306.35252856341106 -248.89497734543835 306.5673514240619 -248.77092471192216 306.83966208923493 -248.71041123077262 curveto
closepath
306.63089057615804 -247.80270900000338 moveto
306.63089057615804 -248.02055754188038 306.70048108259095 -248.1915081240314 306.83966208923493 -248.315560760388 curveto
306.9788431021008 -248.43961340229018 307.16946057002133 -248.5016397176957 307.41151449461955 -248.5016397176957 curveto
307.6596197784239 -248.5016397176957 307.85326291566787 -248.4396133967446 307.9924439223119 -248.315560760388 curveto
308.13162493517774 -248.1915081184858 308.2012154353888 -248.0205575321418 308.2012154353888 -247.80270900000338 curveto
308.2012154353888 -247.58486045812637 308.1316249289559 -247.41390987597535 307.9924439223119 -247.28985723961875 curveto
307.853262909446 -247.16580459771657 307.65961976733274 -247.10377828231105 307.41151449461955 -247.10377828231105 curveto
307.1694605592007 -247.10377828231105 306.978843095879 -247.16580460326216 306.83966208923493 -247.28985723961875 curveto
306.7004810763691 -247.41390988152094 306.63089057615804 -247.58486046786496 306.63089057615804 -247.80270900000338 curveto
closepath
311.10756451553306 -247.10377828231105 moveto
310.8170997930304 -247.10377828231105 310.5977384270418 -247.2490106435624 310.4494803982254 -247.5394753530803 curveto
310.3012223627813 -247.82994007558298 310.2270933516869 -248.26563714635222 310.2270933516869 -248.846566565388 curveto
310.2270933516869 -249.42749601039336 310.30122236940895 -249.86319306817782 310.4494803982254 -250.1536577776957 curveto
310.59773843366946 -250.4441225001984 310.81709980601516 -250.58935484846495 311.10756451553306 -250.58935484846495 curveto
311.41013193480666 -250.58935484846495 311.6355446486397 -250.4441224872136 311.78380267745615 -250.1536577776957 curveto
311.93206071290024 -249.86319305519302 312.0061897239946 -249.42749598442379 312.0061897239946 -248.846566565388 curveto
312.0061897239946 -248.26563712038265 311.9320607062726 -247.82994006259818 311.78380267745615 -247.5394753530803 curveto
311.63554464201206 -247.2490106305776 311.4101319212809 -247.10377828231105 311.10756451553306 -247.10377828231105 curveto
closepath
311.10756451553306 -246.64992716692643 moveto
311.5856210379854 -246.64992716692643 311.95021475683933 -246.83751896687608 312.20134570361 -247.21270255000337 curveto
312.45247666160714 -247.58788614990266 312.57804212937924 -248.13250748782318 312.57804212937924 -248.846566565388 curveto
312.57804212937924 -249.56062567487376 312.4524766503807 -250.10524699764534 312.20134570361 -250.48043058077263 curveto
311.95021474561287 -250.85561418067195 311.5856210166146 -251.04320596384957 311.10756451553306 -251.04320596384957 curveto
310.6355593414662 -251.04320596384957 310.2739912965345 -250.85561416389993 310.02286034976385 -250.48043058077263 curveto
309.7717293917667 -250.10524698087332 309.6461639239946 -249.56062564295283 309.6461639239946 -248.846566565388 curveto
309.6461639239946 -248.13250745590224 309.7717294029932 -247.58788613313064 310.02286034976385 -247.21270255000337 curveto
310.273991307761 -246.83751895010406 310.6355593625665 -246.64992716692643 311.10756451553306 -246.64992716692643 curveto
closepath
fill
newpath
1.0 setlinewidth
10.0 setmiterlimit
0 setlinejoin
0 setlinecap
[ ] 0 setdash
newpath
308.0809229472913 -243.06111505754214 moveto
308.0809229472913 -245.38483276831138 lineto
stroke
newpath
0.0 0.0 0.0 setrgbcolor
1.0 setlinewidth
10.0 setmiterlimit
0 setlinejoin
0 setlinecap
[ ] 0 setdash
newpath
361.4742593592357 -250.48043058077263 moveto
362.4182696792357 -250.48043058077263 lineto
362.4182696792357 -247.24901063923414 lineto
361.3925661584665 -247.44870513000336 lineto
361.3925661584665 -246.9313148584649 lineto
362.409192656928 -246.72254334538798 lineto
362.9810450623126 -246.72254334538798 lineto
362.9810450623126 -250.48043058077263 lineto
363.91597836000494 -250.48043058077263 lineto
363.91597836000494 -250.96151276308035 lineto
361.4742593592357 -250.96151276308035 lineto
361.4742593592357 -250.48043058077263 lineto
closepath
366.2958601463031 -247.10377828231105 moveto
366.0053954238004 -247.10377828231105 365.7860340578118 -247.2490106435624 365.63777602899535 -247.5394753530803 curveto
365.48951799355126 -247.82994007558298 365.4153889824569 -248.26563714635222 365.4153889824569 -248.846566565388 curveto
365.4153889824569 -249.42749601039336 365.4895180001789 -249.86319306817782 365.63777602899535 -250.1536577776957 curveto
365.78603406443943 -250.4441225001984 366.0053954367852 -250.58935484846495 366.2958601463031 -250.58935484846495 curveto
366.5984275655767 -250.58935484846495 366.82384027940975 -250.4441224872136 366.9720983082261 -250.1536577776957 curveto
367.1203563436702 -249.86319305519302 367.1944853547646 -249.42749598442379 367.1944853547646 -248.846566565388 curveto
367.1944853547646 -248.26563712038265 367.12035633704255 -247.82994006259818 366.9720983082261 -247.5394753530803 curveto
366.8238402727821 -247.2490106305776 366.5984275520509 -247.10377828231105 366.2958601463031 -247.10377828231105 curveto
closepath
366.2958601463031 -246.64992716692643 moveto
366.77391666875536 -246.64992716692643 367.1385103876093 -246.83751896687608 367.38964133438 -247.21270255000337 curveto
367.6407722923771 -247.58788614990266 367.7663377601492 -248.13250748782318 367.7663377601492 -248.846566565388 curveto
367.7663377601492 -249.56062567487376 367.64077228115065 -250.10524699764534 367.38964133438 -250.48043058077263 curveto
367.13851037638284 -250.85561418067195 366.77391664738457 -251.04320596384957 366.2958601463031 -251.04320596384957 curveto
365.82385497223623 -251.04320596384957 365.4622869273045 -250.85561416389993 365.2111559805338 -250.48043058077263 curveto
364.9600250225367 -250.10524698087332 364.8344595547646 -249.56062564295283 364.8344595547646 -248.846566565388 curveto
364.8344595547646 -248.13250745590224 364.96002503376315 -247.58788613313064 365.2111559805338 -247.21270255000337 curveto
365.46228693853095 -246.83751895010406 365.8238549933365 -246.64992716692643 366.2958601463031 -246.64992716692643 curveto
closepath
369.9919101672166 -247.10377828231105 moveto
369.7014454447139 -247.10377828231105 369.4820840787253 -247.2490106435624 369.33382604990885 -247.5394753530803 curveto
369.18556801446476 -247.82994007558298 369.1114390033704 -248.26563714635222 369.1114390033704 -248.846566565388 curveto
369.1114390033704 -249.42749601039336 369.1855680210924 -249.86319306817782 369.33382604990885 -250.1536577776957 curveto
369.48208408535294 -250.4441225001984 369.7014454576987 -250.58935484846495 369.9919101672166 -250.58935484846495 curveto
370.2944775864902 -250.58935484846495 370.51989030032325 -250.4441224872136 370.6681483291397 -250.1536577776957 curveto
370.8164063645837 -249.86319305519302 370.8905353756781 -249.42749598442379 370.8905353756781 -248.846566565388 curveto
370.8905353756781 -248.26563712038265 370.81640635795605 -247.82994006259818 370.6681483291397 -247.5394753530803 curveto
370.5198902936956 -247.2490106305776 370.2944775729644 -247.10377828231105 369.9919101672166 -247.10377828231105 curveto
closepath
369.9919101672166 -246.64992716692643 moveto
370.4699666896689 -246.64992716692643 370.83456040852286 -246.83751896687608 371.08569135529353 -247.21270255000337 curveto
371.3368223132906 -247.58788614990266 371.4623877810627 -248.13250748782318 371.4623877810627 -248.846566565388 curveto
371.4623877810627 -249.56062567487376 371.3368223020642 -250.10524699764534 371.08569135529353 -250.48043058077263 curveto
370.8345603972964 -250.85561418067195 370.4699666682981 -251.04320596384957 369.9919101672166 -251.04320596384957 curveto
369.51990499314974 -251.04320596384957 369.158336948218 -250.85561416389993 368.9072060014473 -250.48043058077263 curveto
368.6560750434502 -250.10524698087332 368.5305095756781 -249.56062564295283 368.5305095756781 -248.846566565388 curveto
368.5305095756781 -248.13250745590224 368.65607505467665 -247.58788613313064 368.9072060014473 -247.21270255000337 curveto
369.15833695944445 -246.83751895010406 369.51990501425 -246.64992716692643 369.9919101672166 -246.64992716692643 curveto
closepath
fill
newpath
1.0 setlinewidth
10.0 setmiterlimit
0 setlinejoin
0 setlinecap
[ ] 0 setdash
newpath
364.77383633311814 -243.06111505754214 moveto
364.77383633311814 -245.38483276831138 lineto
stroke
newpath
0.0 0.0 0.0 setrgbcolor
1.0 setlinewidth
10.0 setmiterlimit
0 setlinejoin
0 setlinecap
[ ] 0 setdash
newpath
418.4053432730826 -250.48043058077263 moveto
419.34935359308264 -250.48043058077263 lineto
419.34935359308264 -247.24901063923414 lineto
418.3236500723134 -247.44870513000336 lineto
418.3236500723134 -246.9313148584649 lineto
419.34027657077496 -246.72254334538798 lineto
419.9121289761596 -246.72254334538798 lineto
419.9121289761596 -250.48043058077263 lineto
420.84706227385186 -250.48043058077263 lineto
420.84706227385186 -250.96151276308035 lineto
418.4053432730826 -250.96151276308035 lineto
418.4053432730826 -250.48043058077263 lineto
closepath
422.5007822755346 -250.48043058077263 moveto
424.4977271832269 -250.48043058077263 lineto
424.4977271832269 -250.96151276308035 lineto
421.81092858014995 -250.96151276308035 lineto
421.81092858014995 -250.48043058077263 lineto
422.02877712202695 -250.25653069051015 422.32529318317654 -249.95396328124562 422.70047676630384 -249.5727283500034 curveto
423.0756603662031 -249.19149340171862 423.31166293646453 -248.9464138091495 423.4084845063038 -248.8374895430803 curveto
423.590024957868 -248.63174369797423 423.71710326584747 -248.45776744108946 423.78971944322694 -248.315560760388 curveto
423.8623356238526 -248.1733540733294 423.8986437109192 -248.03266022972429 423.8986437109192 -247.8934792230803 curveto
423.8986437109192 -247.66957933281782 423.8199761819081 -247.48652605416638 423.6626411309192 -247.3443193734649 curveto
423.50530607289693 -247.20211268640628 423.2995602348243 -247.13100934923412 423.04540361399614 -247.13100934923412 curveto
422.863863162432 -247.13100934923412 422.67475853350146 -247.16277892825784 422.47808971976536 -247.2263180834649 curveto
422.2814208972375 -247.28985724151235 422.0681108754414 -247.38516597574312 421.83815964707304 -247.5122442861572 curveto
421.83815964707304 -246.9313148584649 lineto
422.068110885721 -246.84054463268282 422.2829337431256 -246.77095413030762 422.4826282309192 -246.72254334538798 curveto
422.6823227276398 -246.6741325583042 422.86688884446966 -246.64992716692643 423.03632659168846 -246.64992716692643 curveto
423.4720236754425 -246.64992716692643 423.8214890252263 -246.75885143786493 424.0847226682269 -246.97669997000335 curveto
424.347956322995 -247.19454851188036 424.47957313861156 -247.4880388988372 424.47957313861156 -247.85717113384953 curveto
424.47957313861156 -248.03266023702824 424.4462907224914 -248.1975594726874 424.3797258932269 -248.35186884961877 curveto
424.3131610609867 -248.5061782334483 424.1951597704457 -248.68923151521068 424.02572202322693 -248.90102869923416 curveto
423.9773112361431 -248.9554908347034 423.82602752867047 -249.1143387273874 423.5718709078423 -249.377572370388 curveto
423.31771427565246 -249.64080602515605 422.96068473227126 -250.00842542780606 422.5007822755346 -250.48043058077263 curveto
closepath
426.9229940810635 -247.10377828231105 moveto
426.6325293585608 -247.10377828231105 426.4131679925722 -247.2490106435624 426.26490996375577 -247.5394753530803 curveto
426.11665192831174 -247.82994007558298 426.04252291721735 -248.26563714635222 426.04252291721735 -248.846566565388 curveto
426.04252291721735 -249.42749601039336 426.1166519349394 -249.86319306817782 426.26490996375577 -250.1536577776957 curveto
426.41316799919986 -250.4441225001984 426.6325293715456 -250.58935484846495 426.9229940810635 -250.58935484846495 curveto
427.2255615003371 -250.58935484846495 427.4509742141702 -250.4441224872136 427.5992322429866 -250.1536577776957 curveto
427.7474902784307 -249.86319305519302 427.8216192895251 -249.42749598442379 427.8216192895251 -248.846566565388 curveto
427.8216192895251 -248.26563712038265 427.74749027180303 -247.82994006259818 427.5992322429866 -247.5394753530803 curveto
427.4509742075425 -247.2490106305776 427.22556148681133 -247.10377828231105 426.9229940810635 -247.10377828231105 curveto
closepath
426.9229940810635 -246.64992716692643 moveto
427.40105060351584 -246.64992716692643 427.7656443223698 -246.83751896687608 428.01677526914045 -247.21270255000337 curveto
428.2679062271376 -247.58788614990266 428.3934716949097 -248.13250748782318 428.3934716949097 -248.846566565388 curveto
428.3934716949097 -249.56062567487376 428.2679062159111 -250.10524699764534 428.01677526914045 -250.48043058077263 curveto
427.7656443111433 -250.85561418067195 427.40105058214505 -251.04320596384957 426.9229940810635 -251.04320596384957 curveto
426.45098890699666 -251.04320596384957 426.0894208620649 -250.85561416389993 425.83828991529424 -250.48043058077263 curveto
425.5871589572971 -250.10524698087332 425.461593489525 -249.56062564295283 425.461593489525 -248.846566565388 curveto
425.461593489525 -248.13250745590224 425.58715896852357 -247.58788613313064 425.83828991529424 -247.21270255000337 curveto
426.0894208732914 -246.83751895010406 426.45098892809693 -246.64992716692643 426.9229940810635 -246.64992716692643 curveto
closepath
fill
newpath
1.0 setlinewidth
10.0 setmiterlimit
0 setlinejoin
0 setlinecap
[ ] 0 setdash
newpath
421.4667497189449 -243.06111505754214 moveto
421.4667497189449 -245.38483276831138 lineto
stroke
newpath
0.0 0.0 0.0 setrgbcolor
1.0 setlinewidth
10.0 setmiterlimit
0 setlinejoin
0 setlinecap
[ ] 0 setdash
newpath
65.92641302077013 -329.9134527953891 moveto
68.26828477615477 -329.9134527953891 lineto
68.26828477615477 -330.3219187992353 lineto
65.92641302077013 -330.3219187992353 lineto
65.92641302077013 -329.9134527953891 lineto
closepath
70.74631186615481 -327.97097002154294 moveto
69.3030653192317 -330.2311485761583 lineto
70.74631186615481 -330.2311485761583 lineto
70.74631186615481 -327.97097002154294 lineto
closepath
70.59200248692403 -327.47173379461987 moveto
71.31816427153943 -327.47173379461987 lineto
71.31816427153943 -330.2311485761583 lineto
71.91724774384713 -330.2311485761583 lineto
71.91724774384713 -330.71223075846603 lineto
71.31816427153943 -330.71223075846603 lineto
71.31816427153943 -331.7107032123122 lineto
70.74631186615481 -331.7107032123122 lineto
70.74631186615481 -330.71223075846603 lineto
68.83106015923171 -330.71223075846603 lineto
68.83106015923171 -330.1585323976968 lineto
70.59200248692403 -327.47173379461987 lineto
closepath
74.08835801706832 -327.85296873154294 moveto
73.79789329456564 -327.85296873154294 73.57853192857704 -327.99820109279426 73.4302738997606 -328.28866580231215 curveto
73.28201586431653 -328.57913052481484 73.20788685322215 -329.0148275955841 73.20788685322215 -329.5957570146199 curveto
73.20788685322215 -330.1766864596253 73.28201587094418 -330.6123835174097 73.4302738997606 -330.9028482269276 curveto
73.5785319352047 -331.19331294943026 73.79789330755042 -331.33854529769684 74.08835801706832 -331.33854529769684 curveto
74.39092543634194 -331.33854529769684 74.61633815017497 -331.19331293644547 74.7645961789914 -330.9028482269276 curveto
74.91285421443548 -330.61238350442494 74.98698322552987 -330.1766864336557 74.98698322552987 -329.5957570146199 curveto
74.98698322552987 -329.0148275696145 74.91285420780783 -328.57913051183004 74.7645961789914 -328.28866580231215 curveto
74.61633814354732 -327.9982010798095 74.39092542281612 -327.85296873154294 74.08835801706832 -327.85296873154294 curveto
closepath
74.08835801706832 -327.3991176161583 moveto
74.56641453952065 -327.3991176161583 74.93100825837458 -327.58670941610796 75.18213920514525 -327.9618929992352 curveto
75.43327016314235 -328.3370765991345 75.55883563091449 -328.88169793705504 75.55883563091449 -329.5957570146199 curveto
75.55883563091449 -330.3098161241056 75.43327015191593 -330.8544374468772 75.18213920514525 -331.2296210300045 curveto
74.93100824714814 -331.6048046299038 74.56641451814986 -331.79239641308146 74.08835801706832 -331.79239641308146 curveto
73.61635284300145 -331.79239641308146 73.25478479806975 -331.6048046131318 73.00365385129906 -331.2296210300045 curveto
72.75252289330196 -330.85443743010524 72.62695742552984 -330.3098160921847 72.62695742552984 -329.5957570146199 curveto
72.62695742552984 -328.8816979051341 72.75252290452839 -328.3370765823625 73.00365385129906 -327.9618929992352 curveto
73.25478480929617 -327.5867093993359 73.61635286410173 -327.3991176161583 74.08835801706832 -327.3991176161583 curveto
closepath
77.78440803798183 -327.85296873154294 moveto
77.49394331547916 -327.85296873154294 77.27458194949055 -327.99820109279426 77.12632392067412 -328.28866580231215 curveto
76.97806588523005 -328.57913052481484 76.90393687413567 -329.0148275955841 76.90393687413567 -329.5957570146199 curveto
76.90393687413567 -330.1766864596253 76.9780658918577 -330.6123835174097 77.12632392067412 -330.9028482269276 curveto
77.27458195611821 -331.19331294943026 77.49394332846394 -331.33854529769684 77.78440803798183 -331.33854529769684 curveto
78.08697545725545 -331.33854529769684 78.31238817108849 -331.19331293644547 78.46064619990491 -330.9028482269276 curveto
78.60890423534899 -330.61238350442494 78.68303324644337 -330.1766864336557 78.68303324644337 -329.5957570146199 curveto
78.68303324644337 -329.0148275696145 78.60890422872134 -328.57913051183004 78.46064619990491 -328.28866580231215 curveto
78.31238816446083 -327.9982010798095 78.08697544372963 -327.85296873154294 77.78440803798183 -327.85296873154294 curveto
closepath
77.78440803798183 -327.3991176161583 moveto
78.26246456043415 -327.3991176161583 78.62705827928808 -327.58670941610796 78.87818922605877 -327.9618929992352 curveto
79.12932018405587 -328.3370765991345 79.254885651828 -328.88169793705504 79.254885651828 -329.5957570146199 curveto
79.254885651828 -330.3098161241056 79.12932017282945 -330.8544374468772 78.87818922605877 -331.2296210300045 curveto
78.62705826806166 -331.6048046299038 78.26246453906336 -331.79239641308146 77.78440803798183 -331.79239641308146 curveto
77.31240286391497 -331.79239641308146 76.95083481898327 -331.6048046131318 76.69970387221258 -331.2296210300045 curveto
76.44857291421548 -330.85443743010524 76.32300744644334 -330.3098160921847 76.32300744644334 -329.5957570146199 curveto
76.32300744644334 -328.8816979051341 76.4485729254419 -328.3370765823625 76.69970387221258 -327.9618929992352 curveto
76.95083483020969 -327.5867093993359 77.31240288501525 -327.3991176161583 77.78440803798183 -327.3991176161583 curveto
closepath
fill
newpath
1.0 setlinewidth
10.0 setmiterlimit
0 setlinejoin
0 setlinecap
[ ] 0 setdash
newpath
78.98555169321496 -329.86995305466195 moveto
81.30926940398422 -329.86995305466195 lineto
stroke
newpath
0.0 0.0 0.0 setrgbcolor
1.0 setlinewidth
10.0 setmiterlimit
0 setlinejoin
0 setlinecap
[ ] 0 setdash
newpath
65.92641302077013 -286.92467514615777 moveto
68.26828477615477 -286.92467514615777 lineto
68.26828477615477 -287.3331411500039 lineto
65.92641302077013 -287.3331411500039 lineto
65.92641302077013 -286.92467514615777 lineto
closepath
69.66614621153941 -288.24084338077313 moveto
71.66309111923174 -288.24084338077313 lineto
71.66309111923174 -288.72192556308084 lineto
68.97629251615479 -288.72192556308084 lineto
68.97629251615479 -288.24084338077313 lineto
69.19414105803179 -288.0169434905107 69.49065711918136 -287.71437608124614 69.86584070230865 -287.3331411500039 curveto
70.24102430220793 -286.9519062017191 70.47702687246935 -286.70682660915 70.57384844230866 -286.5979023430808 curveto
70.75538889387283 -286.3921564979748 70.88246720185226 -286.21818024108995 70.95508337923174 -286.0759735603885 curveto
71.0276995598574 -285.9337668733299 71.06400764692404 -285.79307302972484 71.06400764692404 -285.6538920230808 curveto
71.06400764692404 -285.4299921328183 70.9853401179129 -285.2469388541669 70.82800506692404 -285.10473217346544 curveto
70.67067000890175 -284.96252548640683 70.46492417082911 -284.89142214923464 70.21076755000095 -284.89142214923464 curveto
70.02922709843678 -284.89142214923464 69.84012246950624 -284.92319172825836 69.64345365577017 -284.98673088346544 curveto
69.44678483324232 -285.0502700415129 69.2334748114462 -285.1455787757436 69.00352358307786 -285.2726570861577 curveto
69.00352358307786 -284.6917276584654 lineto
69.23347482172582 -284.60095743268334 69.44829767913048 -284.53136693030814 69.64799216692403 -284.48295614538847 curveto
69.84768666364461 -284.43454535830466 70.03225278047448 -284.4103399669269 70.20169052769326 -284.4103399669269 curveto
70.63738761144728 -284.4103399669269 70.98685296123114 -284.51926423786546 71.25008660423174 -284.7371127700039 curveto
71.5133202589998 -284.9549613118809 71.64493707461637 -285.2484516988377 71.64493707461637 -285.61758393385 curveto
71.64493707461637 -285.7930730370287 71.61165465849626 -285.95797227268787 71.54508982923174 -286.11228164961926 curveto
71.47852499699154 -286.26659103344883 71.36052370645051 -286.4496443152112 71.19108595923174 -286.6614414992347 curveto
71.14267517214796 -286.7159036347039 70.99139146467527 -286.8747515273879 70.73723484384712 -287.1379851703885 curveto
70.48307821165727 -287.4012188251566 70.12604866827608 -287.76883822780655 69.66614621153941 -288.24084338077313 curveto
closepath
74.08835801706832 -284.86419108231155 moveto
73.79789329456564 -284.86419108231155 73.57853192857704 -285.0094234435629 73.4302738997606 -285.2998881530808 curveto
73.28201586431653 -285.59035287558345 73.20788685322215 -286.0260499463527 73.20788685322215 -286.6069793653885 curveto
73.20788685322215 -287.1879088103939 73.28201587094418 -287.62360586817834 73.4302738997606 -287.91407057769624 curveto
73.5785319352047 -288.20453530019887 73.79789330755042 -288.34976764846544 74.08835801706832 -288.34976764846544 curveto
74.39092543634194 -288.34976764846544 74.61633815017497 -288.2045352872141 74.7645961789914 -287.91407057769624 curveto
74.91285421443548 -287.62360585519355 74.98698322552987 -287.1879087844243 74.98698322552987 -286.6069793653885 curveto
74.98698322552987 -286.0260499203831 74.91285420780783 -285.5903528625987 74.7645961789914 -285.2998881530808 curveto
74.61633814354732 -285.0094234305781 74.39092542281612 -284.86419108231155 74.08835801706832 -284.86419108231155 curveto
closepath
74.08835801706832 -284.4103399669269 moveto
74.56641453952065 -284.4103399669269 74.93100825837458 -284.59793176687657 75.18213920514525 -284.97311535000387 curveto
75.43327016314235 -285.34829894990315 75.55883563091449 -285.8929202878237 75.55883563091449 -286.6069793653885 curveto
75.55883563091449 -287.3210384748743 75.43327015191593 -287.8656597976459 75.18213920514525 -288.24084338077313 curveto
74.93100824714814 -288.6160269806724 74.56641451814986 -288.80361876385007 74.08835801706832 -288.80361876385007 curveto
73.61635284300145 -288.80361876385007 73.25478479806975 -288.6160269639004 73.00365385129906 -288.24084338077313 curveto
72.75252289330196 -287.86565978087384 72.62695742552984 -287.32103844295335 72.62695742552984 -286.6069793653885 curveto
72.62695742552984 -285.89292025590277 72.75252290452839 -285.34829893313116 73.00365385129906 -284.97311535000387 curveto
73.25478480929617 -284.5979317501046 73.61635286410173 -284.4103399669269 74.08835801706832 -284.4103399669269 curveto
closepath
77.78440803798183 -284.86419108231155 moveto
77.49394331547916 -284.86419108231155 77.27458194949055 -285.0094234435629 77.12632392067412 -285.2998881530808 curveto
76.97806588523005 -285.59035287558345 76.90393687413567 -286.0260499463527 76.90393687413567 -286.6069793653885 curveto
76.90393687413567 -287.1879088103939 76.9780658918577 -287.62360586817834 77.12632392067412 -287.91407057769624 curveto
77.27458195611821 -288.20453530019887 77.49394332846394 -288.34976764846544 77.78440803798183 -288.34976764846544 curveto
78.08697545725545 -288.34976764846544 78.31238817108849 -288.2045352872141 78.46064619990491 -287.91407057769624 curveto
78.60890423534899 -287.62360585519355 78.68303324644337 -287.1879087844243 78.68303324644337 -286.6069793653885 curveto
78.68303324644337 -286.0260499203831 78.60890422872134 -285.5903528625987 78.46064619990491 -285.2998881530808 curveto
78.31238816446083 -285.0094234305781 78.08697544372963 -284.86419108231155 77.78440803798183 -284.86419108231155 curveto
closepath
77.78440803798183 -284.4103399669269 moveto
78.26246456043415 -284.4103399669269 78.62705827928808 -284.59793176687657 78.87818922605877 -284.97311535000387 curveto
79.12932018405587 -285.34829894990315 79.254885651828 -285.8929202878237 79.254885651828 -286.6069793653885 curveto
79.254885651828 -287.3210384748743 79.12932017282945 -287.8656597976459 78.87818922605877 -288.24084338077313 curveto
78.62705826806166 -288.6160269806724 78.26246453906336 -288.80361876385007 77.78440803798183 -288.80361876385007 curveto
77.31240286391497 -288.80361876385007 76.95083481898327 -288.6160269639004 76.69970387221258 -288.24084338077313 curveto
76.44857291421548 -287.86565978087384 76.32300744644334 -287.32103844295335 76.32300744644334 -286.6069793653885 curveto
76.32300744644334 -285.89292025590277 76.4485729254419 -285.34829893313116 76.69970387221258 -284.97311535000387 curveto
76.95083483020969 -284.5979317501046 77.31240288501525 -284.4103399669269 77.78440803798183 -284.4103399669269 curveto
closepath
fill
newpath
1.0 setlinewidth
10.0 setmiterlimit
0 setlinejoin
0 setlinecap
[ ] 0 setdash
newpath
78.98555169321496 -286.46553405610206 moveto
81.30926940398422 -286.46553405610206 lineto
stroke
newpath
0.0 0.0 0.0 setrgbcolor
1.0 setlinewidth
10.0 setmiterlimit
0 setlinejoin
0 setlinecap
[ ] 0 setdash
newpath
76.20160227307795 -237.808907439234 moveto
75.91113755057528 -237.808907439234 75.69177618458669 -237.95413980048534 75.54351815577026 -238.24460451000323 curveto
75.39526012032618 -238.53506923250592 75.3211311092318 -238.97076630327516 75.3211311092318 -239.55169572231094 curveto
75.3211311092318 -240.1326251673163 75.39526012695383 -240.56832222510076 75.54351815577026 -240.85878693461865 curveto
75.69177619121433 -241.14925165712134 75.91113756356006 -241.2944840053879 76.20160227307795 -241.2944840053879 curveto
76.50416969235158 -241.2944840053879 76.72958240618462 -241.14925164413654 76.87784043500105 -240.85878693461865 curveto
77.02609847044512 -240.56832221211596 77.1002274815395 -240.13262514134672 77.1002274815395 -239.55169572231094 curveto
77.1002274815395 -238.9707662773056 77.02609846381748 -238.53506921952112 76.87784043500105 -238.24460451000323 curveto
76.72958239955696 -237.95413978750054 76.50416967882576 -237.808907439234 76.20160227307795 -237.808907439234 curveto
closepath
76.20160227307795 -237.35505632384937 moveto
76.67965879553029 -237.35505632384937 77.04425251438421 -237.542648123799 77.2953834611549 -237.9178317069263 curveto
77.546514419152 -238.29301530682562 77.67207988692414 -238.8376366447461 77.67207988692414 -239.55169572231094 curveto
77.67207988692414 -240.2657548317967 77.54651440792559 -240.8103761545683 77.2953834611549 -241.1855597376956 curveto
77.0442525031578 -241.5607433375949 76.67965877415949 -241.7483351207725 76.20160227307795 -241.7483351207725 curveto
75.7295970990111 -241.7483351207725 75.3680290540794 -241.56074332082287 75.11689810730871 -241.1855597376956 curveto
74.86576714931161 -240.81037613779628 74.74020168153947 -240.26575479987577 74.74020168153947 -239.55169572231094 curveto
74.74020168153947 -238.83763661282518 74.86576716053803 -238.2930152900536 75.11689810730871 -237.9178317069263 curveto
75.36802906530582 -237.542648107027 75.72959712011138 -237.35505632384937 76.20160227307795 -237.35505632384937 curveto
closepath
fill
newpath
0.0 0.0 0.0 setrgbcolor
1.0 setlinewidth
10.0 setmiterlimit
0 setlinejoin
0 setlinecap
[ ] 0 setdash
newpath
69.66614621153941 -201.1014292269258 moveto
71.66309111923174 -201.1014292269258 lineto
71.66309111923174 -201.58251140923352 lineto
68.97629251615479 -201.58251140923352 lineto
68.97629251615479 -201.1014292269258 lineto
69.19414105803179 -200.87752933666334 69.49065711918136 -200.57496192739882 69.86584070230865 -200.19372699615656 curveto
70.24102430220793 -199.81249204787179 70.47702687246935 -199.5674124553027 70.57384844230866 -199.4584881892335 curveto
70.75538889387283 -199.25274234412743 70.88246720185226 -199.07876608724263 70.95508337923174 -198.93655940654116 curveto
71.0276995598574 -198.79435271948256 71.06400764692404 -198.65365887587745 71.06400764692404 -198.51447786923347 curveto
71.06400764692404 -198.290577978971 70.9853401179129 -198.10752470031954 70.82800506692404 -197.96531801961808 curveto
70.67067000890175 -197.82311133255948 70.46492417082911 -197.75200799538732 70.21076755000095 -197.75200799538732 curveto
70.02922709843678 -197.75200799538732 69.84012246950624 -197.78377757441103 69.64345365577017 -197.8473167296181 curveto
69.44678483324232 -197.91085588766555 69.2334748114462 -198.00616462189632 69.00352358307786 -198.1332429323104 curveto
69.00352358307786 -197.55231350461807 lineto
69.23347482172582 -197.461543278836 69.44829767913048 -197.39195277646078 69.64799216692403 -197.34354199154114 curveto
69.84768666364461 -197.29513120445736 70.03225278047448 -197.2709258130796 70.20169052769326 -197.2709258130796 curveto
70.63738761144728 -197.2709258130796 70.98685296123114 -197.3798500840181 71.25008660423174 -197.59769861615652 curveto
71.5133202589998 -197.81554715803355 71.64493707461637 -198.10903754499037 71.64493707461637 -198.4781697800027 curveto
71.64493707461637 -198.6536588831814 71.61165465849626 -198.81855811884057 71.54508982923174 -198.97286749577194 curveto
71.47852499699154 -199.12717687960148 71.36052370645051 -199.31023016136385 71.19108595923174 -199.52202734538733 curveto
71.14267517214796 -199.57648948085657 70.99139146467527 -199.73533737354057 70.73723484384712 -199.99857101654118 curveto
70.48307821165727 -200.26180467130922 70.12604866827608 -200.62942407395923 69.66614621153941 -201.1014292269258 curveto
closepath
74.08835801706832 -197.72477692846422 moveto
73.79789329456564 -197.72477692846422 73.57853192857704 -197.87000928971557 73.4302738997606 -198.16047399923346 curveto
73.28201586431653 -198.45093872173615 73.20788685322215 -198.8866357925054 73.20788685322215 -199.46756521154117 curveto
73.20788685322215 -200.04849465654652 73.28201587094418 -200.484191714331 73.4302738997606 -200.77465642384888 curveto
73.5785319352047 -201.06512114635157 73.79789330755042 -201.21035349461812 74.08835801706832 -201.21035349461812 curveto
74.39092543634194 -201.21035349461812 74.61633815017497 -201.06512113336677 74.7645961789914 -200.77465642384888 curveto
74.91285421443548 -200.4841917013462 74.98698322552987 -200.04849463057695 74.98698322552987 -199.46756521154117 curveto
74.98698322552987 -198.88663576653582 74.91285420780783 -198.45093870875135 74.7645961789914 -198.16047399923346 curveto
74.61633814354732 -197.87000927673077 74.39092542281612 -197.72477692846422 74.08835801706832 -197.72477692846422 curveto
closepath
74.08835801706832 -197.2709258130796 moveto
74.56641453952065 -197.2709258130796 74.93100825837458 -197.45851761302924 75.18213920514525 -197.83370119615654 curveto
75.43327016314235 -198.20888479605586 75.55883563091449 -198.75350613397634 75.55883563091449 -199.46756521154117 curveto
75.55883563091449 -200.18162432102693 75.43327015191593 -200.72624564379853 75.18213920514525 -201.1014292269258 curveto
74.93100824714814 -201.47661282682512 74.56641451814986 -201.66420461000274 74.08835801706832 -201.66420461000274 curveto
73.61635284300145 -201.66420461000274 73.25478479806975 -201.4766128100531 73.00365385129906 -201.1014292269258 curveto
72.75252289330196 -200.72624562702651 72.62695742552984 -200.181624289106 72.62695742552984 -199.46756521154117 curveto
72.62695742552984 -198.7535061020554 72.75252290452839 -198.20888477928384 73.00365385129906 -197.83370119615654 curveto
73.25478480929617 -197.45851759625722 73.61635286410173 -197.2709258130796 74.08835801706832 -197.2709258130796 curveto
closepath
77.78440803798183 -197.72477692846422 moveto
77.49394331547916 -197.72477692846422 77.27458194949055 -197.87000928971557 77.12632392067412 -198.16047399923346 curveto
76.97806588523005 -198.45093872173615 76.90393687413567 -198.8866357925054 76.90393687413567 -199.46756521154117 curveto
76.90393687413567 -200.04849465654652 76.9780658918577 -200.484191714331 77.12632392067412 -200.77465642384888 curveto
77.27458195611821 -201.06512114635157 77.49394332846394 -201.21035349461812 77.78440803798183 -201.21035349461812 curveto
78.08697545725545 -201.21035349461812 78.31238817108849 -201.06512113336677 78.46064619990491 -200.77465642384888 curveto
78.60890423534899 -200.4841917013462 78.68303324644337 -200.04849463057695 78.68303324644337 -199.46756521154117 curveto
78.68303324644337 -198.88663576653582 78.60890422872134 -198.45093870875135 78.46064619990491 -198.16047399923346 curveto
78.31238816446083 -197.87000927673077 78.08697544372963 -197.72477692846422 77.78440803798183 -197.72477692846422 curveto
closepath
77.78440803798183 -197.2709258130796 moveto
78.26246456043415 -197.2709258130796 78.62705827928808 -197.45851761302924 78.87818922605877 -197.83370119615654 curveto
79.12932018405587 -198.20888479605586 79.254885651828 -198.75350613397634 79.254885651828 -199.46756521154117 curveto
79.254885651828 -200.18162432102693 79.12932017282945 -200.72624564379853 78.87818922605877 -201.1014292269258 curveto
78.62705826806166 -201.47661282682512 78.26246453906336 -201.66420461000274 77.78440803798183 -201.66420461000274 curveto
77.31240286391497 -201.66420461000274 76.95083481898327 -201.4766128100531 76.69970387221258 -201.1014292269258 curveto
76.44857291421548 -200.72624562702651 76.32300744644334 -200.181624289106 76.32300744644334 -199.46756521154117 curveto
76.32300744644334 -198.7535061020554 76.4485729254419 -198.20888477928384 76.69970387221258 -197.83370119615654 curveto
76.95083483020969 -197.45851759625722 77.31240288501525 -197.2709258130796 77.78440803798183 -197.2709258130796 curveto
closepath
fill
newpath
1.0 setlinewidth
10.0 setmiterlimit
0 setlinejoin
0 setlinecap
[ ] 0 setdash
newpath
78.98555169321496 -199.65669605898222 moveto
81.30926940398422 -199.65669605898222 lineto
stroke
newpath
0.0 0.0 0.0 setrgbcolor
1.0 setlinewidth
10.0 setmiterlimit
0 setlinejoin
0 setlinecap
[ ] 0 setdash
newpath
70.74631186615481 -154.27307114154056 moveto
69.3030653192317 -156.53324969615596 lineto
70.74631186615481 -156.53324969615596 lineto
70.74631186615481 -154.27307114154056 lineto
closepath
70.59200248692403 -153.77383491461748 moveto
71.31816427153943 -153.77383491461748 lineto
71.31816427153943 -156.53324969615596 lineto
71.91724774384713 -156.53324969615596 lineto
71.91724774384713 -157.01433187846368 lineto
71.31816427153943 -157.01433187846368 lineto
71.31816427153943 -158.01280433230983 lineto
70.74631186615481 -158.01280433230983 lineto
70.74631186615481 -157.01433187846368 lineto
68.83106015923171 -157.01433187846368 lineto
68.83106015923171 -156.46063351769445 lineto
70.59200248692403 -153.77383491461748 lineto
closepath
74.08835801706832 -154.15506985154056 moveto
73.79789329456564 -154.15506985154056 73.57853192857704 -154.3003022127919 73.4302738997606 -154.5907669223098 curveto
73.28201586431653 -154.8812316448125 73.20788685322215 -155.31692871558172 73.20788685322215 -155.8978581346175 curveto
73.20788685322215 -156.47878757962286 73.28201587094418 -156.91448463740733 73.4302738997606 -157.20494934692522 curveto
73.5785319352047 -157.4954140694279 73.79789330755042 -157.64064641769446 74.08835801706832 -157.64064641769446 curveto
74.39092543634194 -157.64064641769446 74.61633815017497 -157.4954140564431 74.7645961789914 -157.20494934692522 curveto
74.91285421443548 -156.91448462442253 74.98698322552987 -156.4787875536533 74.98698322552987 -155.8978581346175 curveto
74.98698322552987 -155.31692868961215 74.91285420780783 -154.8812316318277 74.7645961789914 -154.5907669223098 curveto
74.61633814354732 -154.3003021998071 74.39092542281612 -154.15506985154056 74.08835801706832 -154.15506985154056 curveto
closepath
74.08835801706832 -153.70121873615594 moveto
74.56641453952065 -153.70121873615594 74.93100825837458 -153.88881053610558 75.18213920514525 -154.26399411923288 curveto
75.43327016314235 -154.63917771913216 75.55883563091449 -155.18379905705268 75.55883563091449 -155.8978581346175 curveto
75.55883563091449 -156.61191724410327 75.43327015191593 -157.15653856687484 75.18213920514525 -157.53172215000214 curveto
74.93100824714814 -157.90690574990145 74.56641451814986 -158.09449753307908 74.08835801706832 -158.09449753307908 curveto
73.61635284300145 -158.09449753307908 73.25478479806975 -157.90690573312943 73.00365385129906 -157.53172215000214 curveto
72.75252289330196 -157.15653855010282 72.62695742552984 -156.61191721218233 72.62695742552984 -155.8978581346175 curveto
72.62695742552984 -155.18379902513175 72.75252290452839 -154.63917770236014 73.00365385129906 -154.26399411923288 curveto
73.25478480929617 -153.88881051933356 73.61635286410173 -153.70121873615594 74.08835801706832 -153.70121873615594 curveto
closepath
77.78440803798183 -154.15506985154056 moveto
77.49394331547916 -154.15506985154056 77.27458194949055 -154.3003022127919 77.12632392067412 -154.5907669223098 curveto
76.97806588523005 -154.8812316448125 76.90393687413567 -155.31692871558172 76.90393687413567 -155.8978581346175 curveto
76.90393687413567 -156.47878757962286 76.9780658918577 -156.91448463740733 77.12632392067412 -157.20494934692522 curveto
77.27458195611821 -157.4954140694279 77.49394332846394 -157.64064641769446 77.78440803798183 -157.64064641769446 curveto
78.08697545725545 -157.64064641769446 78.31238817108849 -157.4954140564431 78.46064619990491 -157.20494934692522 curveto
78.60890423534899 -156.91448462442253 78.68303324644337 -156.4787875536533 78.68303324644337 -155.8978581346175 curveto
78.68303324644337 -155.31692868961215 78.60890422872134 -154.8812316318277 78.46064619990491 -154.5907669223098 curveto
78.31238816446083 -154.3003021998071 78.08697544372963 -154.15506985154056 77.78440803798183 -154.15506985154056 curveto
closepath
77.78440803798183 -153.70121873615594 moveto
78.26246456043415 -153.70121873615594 78.62705827928808 -153.88881053610558 78.87818922605877 -154.26399411923288 curveto
79.12932018405587 -154.63917771913216 79.254885651828 -155.18379905705268 79.254885651828 -155.8978581346175 curveto
79.254885651828 -156.61191724410327 79.12932017282945 -157.15653856687484 78.87818922605877 -157.53172215000214 curveto
78.62705826806166 -157.90690574990145 78.26246453906336 -158.09449753307908 77.78440803798183 -158.09449753307908 curveto
77.31240286391497 -158.09449753307908 76.95083481898327 -157.90690573312943 76.69970387221258 -157.53172215000214 curveto
76.44857291421548 -157.15653855010282 76.32300744644334 -156.61191721218233 76.32300744644334 -155.8978581346175 curveto
76.32300744644334 -155.18379902513175 76.4485729254419 -154.63917770236014 76.69970387221258 -154.26399411923288 curveto
76.95083483020969 -153.88881051933356 77.31240288501525 -153.70121873615594 77.78440803798183 -153.70121873615594 curveto
closepath
fill
newpath
1.0 setlinewidth
10.0 setmiterlimit
0 setlinejoin
0 setlinecap
[ ] 0 setdash
newpath
78.98555169321496 -156.2522770604223 moveto
81.30926940398422 -156.2522770604223 lineto
stroke
newpath
0.0 0.0 0.0 setrgbcolor
1.0 setlinewidth
10.0 setmiterlimit
0 setlinejoin
0 setlinecap
[ ] 0 setdash
newpath
70.46492417461634 -112.68215492769384 moveto
70.2107675424265 -112.68215492769384 70.00804738287486 -112.7698994792832 69.85676368000095 -112.94538857461691 curveto
69.70547997036414 -113.12087767779562 69.62983812230864 -113.35990593117681 69.62983812230864 -113.66247333692462 curveto
69.62983812230864 -113.97109210458372 69.70547997712704 -114.21314602620629 69.85676368000095 -114.38863512154002 curveto
70.00804738963777 -114.56412422471873 70.21076755378819 -114.6518687684631 70.46492417461634 -114.6518687684631 curveto
70.72513215519166 -114.6518687684631 70.92936515156916 -114.56412421687375 71.07762318038559 -114.38863512154002 curveto
71.22588121582966 -114.21314601836131 71.30001022692404 -113.97109209078738 71.30001022692404 -113.66247333692462 curveto
71.30001022692404 -113.35990591765099 71.22588120920202 -113.12087766995064 71.07762318038559 -112.94538857461691 curveto
70.9293651449415 -112.76989947143822 70.72513214355945 -112.68215492769384 70.46492417461634 -112.68215492769384 curveto
closepath
71.6086289853856 -110.88490451077074 moveto
71.6086289853856 -111.40229478230921 lineto
71.46339662413425 -111.33572995006901 71.31665143227893 -111.28429349176817 71.1683934034625 -111.24798540307843 curveto
71.02013536801843 -111.2116773127656 70.87641585049111 -111.19352326923229 70.73723484384712 -111.19352326923229 curveto
70.35599989556235 -111.19352326923229 70.0655351901022 -111.32060158532721 69.86584070230865 -111.57475820615537 curveto
69.66614620558805 -111.82891483834521 69.55419626938384 -112.21620112365376 69.52999087692402 -112.73661706153999 curveto
69.63891514786253 -112.57323065513224 69.7780961558591 -112.44766518343764 69.94753390307787 -112.35992063577076 curveto
70.1169716578711 -112.27217608418141 70.30153777605356 -112.22830381230922 70.50123226384711 -112.22830381230922 curveto
70.92482665083018 -112.22830381230922 71.26067646728777 -112.35689496550052 71.50878174000097 -112.61407726038615 curveto
71.75688702380533 -112.87125956676873 71.88093965461636 -113.22072492453282 71.88093965461636 -113.66247333692462 curveto
71.88093965461636 -114.09817042067864 71.75234850142506 -114.4476357704625 71.49516620653944 -114.7108694134631 curveto
71.23798390015685 -114.97410306823114 70.89456989077823 -115.10571988384771 70.46492417461634 -115.10571988384771 curveto
69.97476495539307 -115.10571988384771 69.60109421450196 -114.91812808389807 69.34391191961633 -114.54294450077079 curveto
69.08672961323374 -114.1677609008715 68.9581384715394 -113.62313956295098 68.9581384715394 -112.90908048538616 curveto
68.9581384715394 -112.24343216298418 69.11698636665805 -111.71091353481938 69.43468214269325 -111.31152455923228 curveto
69.75237793293056 -110.9121355657911 70.1774851428079 -110.71244108692458 70.71000377692404 -110.71244108692458 curveto
70.85523613817539 -110.71244108692458 71.00046849293433 -110.7260566207919 71.14570084769328 -110.7532876873092 curveto
71.29093320894462 -110.78051875504381 71.44524258628178 -110.82439102962117 71.6086289853856 -110.88490451077074 curveto
closepath
74.08835801706832 -111.16629220230921 moveto
73.79789329456564 -111.16629220230921 73.57853192857704 -111.31152456356055 73.4302738997606 -111.60198927307844 curveto
73.28201586431653 -111.89245399558112 73.20788685322215 -112.32815106635036 73.20788685322215 -112.90908048538616 curveto
73.20788685322215 -113.49000993039152 73.28201587094418 -113.92570698817597 73.4302738997606 -114.21617169769387 curveto
73.5785319352047 -114.50663642019654 73.79789330755042 -114.6518687684631 74.08835801706832 -114.6518687684631 curveto
74.39092543634194 -114.6518687684631 74.61633815017497 -114.50663640721176 74.7645961789914 -114.21617169769387 curveto
74.91285421443548 -113.92570697519119 74.98698322552987 -113.49000990442195 74.98698322552987 -112.90908048538616 curveto
74.98698322552987 -112.32815104038079 74.91285420780783 -111.89245398259634 74.7645961789914 -111.60198927307844 curveto
74.61633814354732 -111.31152455057577 74.39092542281612 -111.16629220230921 74.08835801706832 -111.16629220230921 curveto
closepath
74.08835801706832 -110.71244108692458 moveto
74.56641453952065 -110.71244108692458 74.93100825837458 -110.90003288687423 75.18213920514525 -111.27521647000151 curveto
75.43327016314235 -111.65040006990081 75.55883563091449 -112.19502140782133 75.55883563091449 -112.90908048538616 curveto
75.55883563091449 -113.62313959487192 75.43327015191593 -114.1677609176435 75.18213920514525 -114.54294450077079 curveto
74.93100824714814 -114.91812810067007 74.56641451814986 -115.10571988384771 74.08835801706832 -115.10571988384771 curveto
73.61635284300145 -115.10571988384771 73.25478479806975 -114.91812808389807 73.00365385129906 -114.54294450077079 curveto
72.75252289330196 -114.1677609008715 72.62695742552984 -113.62313956295098 72.62695742552984 -112.90908048538616 curveto
72.62695742552984 -112.1950213759004 72.75252290452839 -111.65040005312879 73.00365385129906 -111.27521647000151 curveto
73.25478480929617 -110.90003287010222 73.61635286410173 -110.71244108692458 74.08835801706832 -110.71244108692458 curveto
closepath
77.78440803798183 -111.16629220230921 moveto
77.49394331547916 -111.16629220230921 77.27458194949055 -111.31152456356055 77.12632392067412 -111.60198927307844 curveto
76.97806588523005 -111.89245399558112 76.90393687413567 -112.32815106635036 76.90393687413567 -112.90908048538616 curveto
76.90393687413567 -113.49000993039152 76.9780658918577 -113.92570698817597 77.12632392067412 -114.21617169769387 curveto
77.27458195611821 -114.50663642019654 77.49394332846394 -114.6518687684631 77.78440803798183 -114.6518687684631 curveto
78.08697545725545 -114.6518687684631 78.31238817108849 -114.50663640721176 78.46064619990491 -114.21617169769387 curveto
78.60890423534899 -113.92570697519119 78.68303324644337 -113.49000990442195 78.68303324644337 -112.90908048538616 curveto
78.68303324644337 -112.32815104038079 78.60890422872134 -111.89245398259634 78.46064619990491 -111.60198927307844 curveto
78.31238816446083 -111.31152455057577 78.08697544372963 -111.16629220230921 77.78440803798183 -111.16629220230921 curveto
closepath
77.78440803798183 -110.71244108692458 moveto
78.26246456043415 -110.71244108692458 78.62705827928808 -110.90003288687423 78.87818922605877 -111.27521647000151 curveto
79.12932018405587 -111.65040006990081 79.254885651828 -112.19502140782133 79.254885651828 -112.90908048538616 curveto
79.254885651828 -113.62313959487192 79.12932017282945 -114.1677609176435 78.87818922605877 -114.54294450077079 curveto
78.62705826806166 -114.91812810067007 78.26246453906336 -115.10571988384771 77.78440803798183 -115.10571988384771 curveto
77.31240286391497 -115.10571988384771 76.95083481898327 -114.91812808389807 76.69970387221258 -114.54294450077079 curveto
76.44857291421548 -114.1677609008715 76.32300744644334 -113.62313956295098 76.32300744644334 -112.90908048538616 curveto
76.32300744644334 -112.1950213759004 76.4485729254419 -111.65040005312879 76.69970387221258 -111.27521647000151 curveto
76.95083483020969 -110.90003287010222 77.31240288501525 -110.71244108692458 77.78440803798183 -110.71244108692458 curveto
closepath
fill
newpath
1.0 setlinewidth
10.0 setmiterlimit
0 setlinejoin
0 setlinecap
[ ] 0 setdash
newpath
78.98555169321496 -112.84785806186237 moveto
81.30926940398422 -112.84785806186237 lineto
stroke
newpath
0.0 0.0 0.0 setrgbcolor
1.0 setlinewidth
10.0 setmiterlimit
0 setlinejoin
0 setlinecap
[ ] 0 setdash
newpath
70.3923079961548 -69.4392206538471 moveto
70.11999731880853 -69.4392206538471 69.90668730039387 -69.51334967156913 69.75237792346249 -69.66160770038556 curveto
69.59806853963293 -69.80986573582965 69.52091385461632 -70.01107306301896 69.52091385461632 -70.26522968384711 curveto
69.52091385461632 -70.51938631603696 69.5980685465311 -70.71908080139586 69.75237792346249 -70.86431315615481 curveto
69.90668730729203 -71.00954551740615 70.11999733098178 -71.08216169153943 70.3923079961548 -71.08216169153943 curveto
70.66461867350107 -71.08216169153943 70.8794415290121 -71.00954551091375 71.03677658000096 -70.86431315615481 curveto
71.19411163802324 -70.71908079490346 71.27277916000097 -70.51938630467527 71.27277916000097 -70.26522968384711 curveto
71.27277916000097 -70.01107305165726 71.1956244680862 -69.80986572920199 71.04131509115481 -69.66160770038556 curveto
70.88700570732526 -69.51334966494149 70.67067000944279 -69.4392206538471 70.3923079961548 -69.4392206538471 curveto
closepath
69.82045559077018 -69.2032180738471 moveto
69.57840165535129 -69.14270458999236 69.38778419202956 -69.02772897337356 69.24860318538556 -68.85829122615478 curveto
69.1094221725197 -68.68885347136155 69.03983167230864 -68.48310763382995 69.03983167230864 -68.24105370923169 curveto
69.03983167230864 -67.90217819964523 69.16085864001809 -67.63440604873699 69.40291256461633 -67.43773723500092 curveto
69.64496650003522 -67.24106841247306 69.97476497622283 -67.14273401000091 70.3923079961548 -67.14273401000091 curveto
70.81590238313787 -67.14273401000091 71.14872652540272 -67.24106842126484 71.39078045000097 -67.43773723500092 curveto
71.63283438541987 -67.63440605752878 71.75386134230867 -67.90217821479415 71.75386134230867 -68.24105370923169 curveto
71.75386134230867 -68.4831076446506 71.68427083587574 -68.68885347893601 71.54508982923174 -68.85829122615478 curveto
71.40590881636588 -69.02772898094801 71.21529134844536 -69.14270459269753 70.97323742384712 -69.2032180738471 curveto
71.25159944957886 -69.26373155770182 71.46642230481937 -69.38778419689883 71.61770600769329 -69.57537598846248 curveto
71.7689897173301 -69.76296778841214 71.8446315653856 -69.99291901867409 71.8446315653856 -70.26522968384711 curveto
71.8446315653856 -70.67672137405924 71.7205789234834 -70.9913914717087 71.4724736507702 -71.20924000384713 curveto
71.22436836696583 -71.42708854572413 70.86431314912139 -71.53601280692405 70.3923079961548 -71.53601280692405 curveto
69.92635417047342 -71.53601280692405 69.56781179946394 -71.42708853598555 69.31668085269325 -71.20924000384713 curveto
69.06554989469615 -70.99139146197011 68.93998442692401 -70.67672135566413 68.93998442692401 -70.26522968384711 curveto
68.93998442692401 -69.99291900650084 69.01865195593516 -69.76296778002613 69.17598700692402 -69.57537598846248 curveto
69.3333220649463 -69.38778418851282 69.54814492559716 -69.26373155499665 69.82045559077018 -69.2032180738471 curveto
closepath
69.61168407769325 -68.29551584307785 moveto
69.61168407769325 -68.51336438495487 69.68127458412619 -68.68431496710588 69.82045559077018 -68.80836760346247 curveto
69.95963660363604 -68.93242024536467 70.15025407155656 -68.99444656077017 70.3923079961548 -68.99444656077017 curveto
70.64041327995918 -68.99444656077017 70.83405641720313 -68.93242023981908 70.97323742384712 -68.80836760346247 curveto
71.11241843671299 -68.68431496156029 71.18200893692405 -68.51336437521628 71.18200893692405 -68.29551584307785 curveto
71.18200893692405 -68.07766730120085 71.11241843049112 -67.90671671904984 70.97323742384712 -67.78266408269323 curveto
70.83405641098126 -67.65861144079103 70.640413268868 -67.59658512538553 70.3923079961548 -67.59658512538553 curveto
70.1502540607359 -67.59658512538553 69.95963659741417 -67.65861144633662 69.82045559077018 -67.78266408269323 curveto
69.68127457790432 -67.90671672459543 69.61168407769325 -68.07766731093943 69.61168407769325 -68.29551584307785 curveto
closepath
74.08835801706832 -67.59658512538553 moveto
73.79789329456564 -67.59658512538553 73.57853192857704 -67.74181748663688 73.4302738997606 -68.03228219615477 curveto
73.28201586431653 -68.32274691865744 73.20788685322215 -68.75844398942668 73.20788685322215 -69.33937340846248 curveto
73.20788685322215 -69.92030285346785 73.28201587094418 -70.3559999112523 73.4302738997606 -70.64646462077019 curveto
73.5785319352047 -70.93692934327287 73.79789330755042 -71.08216169153943 74.08835801706832 -71.08216169153943 curveto
74.39092543634194 -71.08216169153943 74.61633815017497 -70.93692933028808 74.7645961789914 -70.64646462077019 curveto
74.91285421443548 -70.35599989826751 74.98698322552987 -69.92030282749828 74.98698322552987 -69.33937340846248 curveto
74.98698322552987 -68.75844396345711 74.91285420780783 -68.32274690567266 74.7645961789914 -68.03228219615477 curveto
74.61633814354732 -67.74181747365209 74.39092542281612 -67.59658512538553 74.08835801706832 -67.59658512538553 curveto
closepath
74.08835801706832 -67.14273401000091 moveto
74.56641453952065 -67.14273401000091 74.93100825837458 -67.33032580995057 75.18213920514525 -67.70550939307785 curveto
75.43327016314235 -68.08069299297713 75.55883563091449 -68.62531433089765 75.55883563091449 -69.33937340846248 curveto
75.55883563091449 -70.05343251794824 75.43327015191593 -70.59805384071984 75.18213920514525 -70.97323742384712 curveto
74.93100824714814 -71.34842102374641 74.56641451814986 -71.53601280692405 74.08835801706832 -71.53601280692405 curveto
73.61635284300145 -71.53601280692405 73.25478479806975 -71.3484210069744 73.00365385129906 -70.97323742384712 curveto
72.75252289330196 -70.59805382394782 72.62695742552984 -70.0534324860273 72.62695742552984 -69.33937340846248 curveto
72.62695742552984 -68.62531429897672 72.75252290452839 -68.08069297620513 73.00365385129906 -67.70550939307785 curveto
73.25478480929617 -67.33032579317855 73.61635286410173 -67.14273401000091 74.08835801706832 -67.14273401000091 curveto
closepath
77.78440803798183 -67.59658512538553 moveto
77.49394331547916 -67.59658512538553 77.27458194949055 -67.74181748663688 77.12632392067412 -68.03228219615477 curveto
76.97806588523005 -68.32274691865744 76.90393687413567 -68.75844398942668 76.90393687413567 -69.33937340846248 curveto
76.90393687413567 -69.92030285346785 76.9780658918577 -70.3559999112523 77.12632392067412 -70.64646462077019 curveto
77.27458195611821 -70.93692934327287 77.49394332846394 -71.08216169153943 77.78440803798183 -71.08216169153943 curveto
78.08697545725545 -71.08216169153943 78.31238817108849 -70.93692933028808 78.46064619990491 -70.64646462077019 curveto
78.60890423534899 -70.35599989826751 78.68303324644337 -69.92030282749828 78.68303324644337 -69.33937340846248 curveto
78.68303324644337 -68.75844396345711 78.60890422872134 -68.32274690567266 78.46064619990491 -68.03228219615477 curveto
78.31238816446083 -67.74181747365209 78.08697544372963 -67.59658512538553 77.78440803798183 -67.59658512538553 curveto
closepath
77.78440803798183 -67.14273401000091 moveto
78.26246456043415 -67.14273401000091 78.62705827928808 -67.33032580995057 78.87818922605877 -67.70550939307785 curveto
79.12932018405587 -68.08069299297713 79.254885651828 -68.62531433089765 79.254885651828 -69.33937340846248 curveto
79.254885651828 -70.05343251794824 79.12932017282945 -70.59805384071984 78.87818922605877 -70.97323742384712 curveto
78.62705826806166 -71.34842102374641 78.26246453906336 -71.53601280692405 77.78440803798183 -71.53601280692405 curveto
77.31240286391497 -71.53601280692405 76.95083481898327 -71.3484210069744 76.69970387221258 -70.97323742384712 curveto
76.44857291421548 -70.59805382394782 76.32300744644334 -70.0534324860273 76.32300744644334 -69.33937340846248 curveto
76.32300744644334 -68.62531429897672 76.4485729254419 -68.08069297620513 76.69970387221258 -67.70550939307785 curveto
76.95083483020969 -67.33032579317855 77.31240288501525 -67.14273401000091 77.78440803798183 -67.14273401000091 curveto
closepath
fill
newpath
1.0 setlinewidth
10.0 setmiterlimit
0 setlinejoin
0 setlinecap
[ ] 0 setdash
newpath
78.98555169321496 -69.44343906330245 moveto
81.30926940398422 -69.44343906330245 lineto
stroke
newpath
0.0 0.0 0.0 setrgbcolor
1.0 setlinewidth
10.0 setmiterlimit
0 setlinejoin
0 setlinecap
[ ] 0 setdash
newpath
66.36211009153936 -27.40353034692345 moveto
67.30612041153938 -27.40353034692345 lineto
67.30612041153938 -24.172110405384945 lineto
66.28041689077013 -24.371804896154178 lineto
66.28041689077013 -23.85441462461571 lineto
67.29704338923169 -23.64564311153878 lineto
67.86889579461631 -23.64564311153878 lineto
67.86889579461631 -27.40353034692345 lineto
68.80382909230863 -27.40353034692345 lineto
68.80382909230863 -27.88461252923115 lineto
66.36211009153936 -27.88461252923115 lineto
66.36211009153936 -27.40353034692345 lineto
closepath
71.18371087860673 -24.026878048461864 moveto
70.89324615610406 -24.026878048461864 70.67388479011547 -24.172110409713206 70.52562676129904 -24.4625751192311 curveto
70.37736872585495 -24.75303984173378 70.30323971476056 -25.188736912503018 70.30323971476056 -25.76966633153881 curveto
70.30323971476056 -26.350595776544175 70.37736873248261 -26.786292834328627 70.52562676129904 -27.076757543846522 curveto
70.67388479674311 -27.367222266349202 70.89324616908884 -27.51245461461576 71.18371087860673 -27.51245461461576 curveto
71.48627829788036 -27.51245461461576 71.7116910117134 -27.367222253364417 71.85994904052983 -27.076757543846522 curveto
72.0082070759739 -26.786292821343842 72.08233608706828 -26.350595750574605 72.08233608706828 -25.76966633153881 curveto
72.08233608706828 -25.188736886533448 72.00820706934626 -24.753039828748996 71.85994904052983 -24.4625751192311 curveto
71.71169100508574 -24.17211039672842 71.48627828435454 -24.026878048461864 71.18371087860673 -24.026878048461864 curveto
closepath
71.18371087860673 -23.573026933077244 moveto
71.66176740105907 -23.573026933077244 72.02636111991299 -23.76061873302689 72.27749206668368 -24.135802316154173 curveto
72.52862302468078 -24.51098591605347 72.65418849245292 -25.055607253973985 72.65418849245292 -25.76966633153881 curveto
72.65418849245292 -26.483725441024568 72.52862301345436 -27.028346763796165 72.27749206668368 -27.40353034692345 curveto
72.02636110868657 -27.778713946822744 71.66176737968827 -27.96630573000038 71.18371087860673 -27.96630573000038 curveto
70.71170570453988 -27.96630573000038 70.35013765960818 -27.77871393005073 70.0990067128375 -27.40353034692345 curveto
69.84787575484039 -27.028346747024152 69.72231028706825 -26.483725409103638 69.72231028706825 -25.76966633153881 curveto
69.72231028706825 -25.055607222053055 69.8478757660668 -24.510985899281458 70.0990067128375 -24.135802316154173 curveto
70.3501376708346 -23.76061871625488 70.71170572564016 -23.573026933077244 71.18371087860673 -23.573026933077244 curveto
closepath
74.87976089952025 -24.026878048461864 moveto
74.58929617701757 -24.026878048461864 74.36993481102898 -24.172110409713206 74.22167678221255 -24.4625751192311 curveto
74.07341874676847 -24.75303984173378 73.99928973567408 -25.188736912503018 73.99928973567408 -25.76966633153881 curveto
73.99928973567408 -26.350595776544175 74.07341875339613 -26.786292834328627 74.22167678221255 -27.076757543846522 curveto
74.36993481765663 -27.367222266349202 74.58929619000236 -27.51245461461576 74.87976089952025 -27.51245461461576 curveto
75.18232831879388 -27.51245461461576 75.4077410326269 -27.367222253364417 75.55599906144333 -27.076757543846522 curveto
75.70425709688742 -26.786292821343842 75.7783861079818 -26.350595750574605 75.7783861079818 -25.76966633153881 curveto
75.7783861079818 -25.188736886533448 75.70425709025976 -24.753039828748996 75.55599906144333 -24.4625751192311 curveto
75.40774102599926 -24.17211039672842 75.18232830526806 -24.026878048461864 74.87976089952025 -24.026878048461864 curveto
closepath
74.87976089952025 -23.573026933077244 moveto
75.35781742197258 -23.573026933077244 75.72241114082651 -23.76061873302689 75.97354208759718 -24.135802316154173 curveto
76.22467304559429 -24.51098591605347 76.35023851336642 -25.055607253973985 76.35023851336642 -25.76966633153881 curveto
76.35023851336642 -26.483725441024568 76.22467303436787 -27.028346763796165 75.97354208759718 -27.40353034692345 curveto
75.72241112960008 -27.778713946822744 75.35781740060179 -27.96630573000038 74.87976089952025 -27.96630573000038 curveto
74.40775572545338 -27.96630573000038 74.04618768052168 -27.77871393005073 73.795056733751 -27.40353034692345 curveto
73.54392577575389 -27.028346747024152 73.41836030798177 -26.483725409103638 73.41836030798177 -25.76966633153881 curveto
73.41836030798177 -25.055607222053055 73.54392578698032 -24.510985899281458 73.795056733751 -24.135802316154173 curveto
74.0461876917481 -23.76061871625488 74.40775574655366 -23.573026933077244 74.87976089952025 -23.573026933077244 curveto
closepath
78.57581092043377 -24.026878048461864 moveto
78.28534619793109 -24.026878048461864 78.06598483194249 -24.172110409713206 77.91772680312606 -24.4625751192311 curveto
77.76946876768199 -24.75303984173378 77.6953397565876 -25.188736912503018 77.6953397565876 -25.76966633153881 curveto
77.6953397565876 -26.350595776544175 77.76946877430963 -26.786292834328627 77.91772680312606 -27.076757543846522 curveto
78.06598483857015 -27.367222266349202 78.28534621091588 -27.51245461461576 78.57581092043377 -27.51245461461576 curveto
78.87837833970738 -27.51245461461576 79.10379105354042 -27.367222253364417 79.25204908235685 -27.076757543846522 curveto
79.40030711780092 -26.786292821343842 79.4744361288953 -26.350595750574605 79.4744361288953 -25.76966633153881 curveto
79.4744361288953 -25.188736886533448 79.40030711117328 -24.753039828748996 79.25204908235685 -24.4625751192311 curveto
79.10379104691276 -24.17211039672842 78.87837832618156 -24.026878048461864 78.57581092043377 -24.026878048461864 curveto
closepath
78.57581092043377 -23.573026933077244 moveto
79.05386744288609 -23.573026933077244 79.41846116174001 -23.76061873302689 79.6695921085107 -24.135802316154173 curveto
79.9207230665078 -24.51098591605347 80.04628853427994 -25.055607253973985 80.04628853427994 -25.76966633153881 curveto
80.04628853427994 -26.483725441024568 79.92072305528139 -27.028346763796165 79.6695921085107 -27.40353034692345 curveto
79.4184611505136 -27.778713946822744 79.05386742151529 -27.96630573000038 78.57581092043377 -27.96630573000038 curveto
78.1038057463669 -27.96630573000038 77.7422377014352 -27.77871393005073 77.49110675466451 -27.40353034692345 curveto
77.23997579666741 -27.028346747024152 77.11441032889527 -26.483725409103638 77.11441032889527 -25.76966633153881 curveto
77.11441032889527 -25.055607222053055 77.23997580789383 -24.510985899281458 77.49110675466451 -24.135802316154173 curveto
77.74223771266162 -23.76061871625488 78.10380576746718 -23.573026933077244 78.57581092043377 -23.573026933077244 curveto
closepath
fill
newpath
1.0 setlinewidth
10.0 setmiterlimit
0 setlinejoin
0 setlinecap
[ ] 0 setdash
newpath
78.98555169321496 -26.03902006474252 moveto
81.30926940398422 -26.03902006474252 lineto
stroke
newpath
grestore
gsave
1.0 setlinewidth
10.0 setmiterlimit
0 setlinejoin
0 setlinecap
[ ] 0 setdash
newpath
0.0 -0.0 moveto
465.3244715815448 -0.0 lineto
465.3244715815448 -336.35813863385073 lineto
0.0 -336.35813863385073 lineto
0.0 -0.0 lineto
closepath
clip
newpath
0.7529412 0.7529412 0.7529412 setrgbcolor
1.0 setlinewidth
10.0 setmiterlimit
1 setlinejoin
0 setlinecap
[ 5.0 4.0 ] 0 setdash
newpath
24.616356018157457 -0.0 moveto
24.616356018157457 -243.06111505754214 lineto
stroke
newpath
1.0 setlinewidth
10.0 setmiterlimit
1 setlinejoin
0 setlinecap
[ 5.0 4.0 ] 0 setdash
newpath
24.616356018157457 -254.09877418369612 moveto
24.616356018157457 -336.35813863385073 lineto
stroke
newpath
1.0 setlinewidth
10.0 setmiterlimit
1 setlinejoin
0 setlinecap
[ 5.0 4.0 ] 0 setdash
newpath
24.616356018157457 -0.0 moveto
24.616356018157457 -243.06111505754214 lineto
stroke
newpath
1.0 setlinewidth
10.0 setmiterlimit
1 setlinejoin
0 setlinecap
[ 5.0 4.0 ] 0 setdash
newpath
24.616356018157457 -254.09877418369612 moveto
24.616356018157457 -336.35813863385073 lineto
stroke
newpath
1.0 setlinewidth
10.0 setmiterlimit
1 setlinejoin
0 setlinecap
[ 5.0 4.0 ] 0 setdash
newpath
138.002182789811 -0.0 moveto
138.002182789811 -243.06111505754214 lineto
stroke
newpath
1.0 setlinewidth
10.0 setmiterlimit
1 setlinejoin
0 setlinecap
[ 5.0 4.0 ] 0 setdash
newpath
138.002182789811 -254.09877418369612 moveto
138.002182789811 -336.35813863385073 lineto
stroke
newpath
1.0 setlinewidth
10.0 setmiterlimit
1 setlinejoin
0 setlinecap
[ 5.0 4.0 ] 0 setdash
newpath
194.69509617563776 -0.0 moveto
194.69509617563776 -243.06111505754214 lineto
stroke
newpath
1.0 setlinewidth
10.0 setmiterlimit
1 setlinejoin
0 setlinecap
[ 5.0 4.0 ] 0 setdash
newpath
194.69509617563776 -254.09877418369612 moveto
194.69509617563776 -336.35813863385073 lineto
stroke
newpath
1.0 setlinewidth
10.0 setmiterlimit
1 setlinejoin
0 setlinecap
[ 5.0 4.0 ] 0 setdash
newpath
251.38800956146451 -0.0 moveto
251.38800956146451 -243.06111505754214 lineto
stroke
newpath
1.0 setlinewidth
10.0 setmiterlimit
1 setlinejoin
0 setlinecap
[ 5.0 4.0 ] 0 setdash
newpath
251.38800956146451 -254.09877418369612 moveto
251.38800956146451 -336.35813863385073 lineto
stroke
newpath
1.0 setlinewidth
10.0 setmiterlimit
1 setlinejoin
0 setlinecap
[ 5.0 4.0 ] 0 setdash
newpath
308.0809229472913 -0.0 moveto
308.0809229472913 -243.06111505754214 lineto
stroke
newpath
1.0 setlinewidth
10.0 setmiterlimit
1 setlinejoin
0 setlinecap
[ 5.0 4.0 ] 0 setdash
newpath
308.0809229472913 -254.09877418369612 moveto
308.0809229472913 -336.35813863385073 lineto
stroke
newpath
1.0 setlinewidth
10.0 setmiterlimit
1 setlinejoin
0 setlinecap
[ 5.0 4.0 ] 0 setdash
newpath
364.773836333118 -0.0 moveto
364.773836333118 -243.06111505754214 lineto
stroke
newpath
1.0 setlinewidth
10.0 setmiterlimit
1 setlinejoin
0 setlinecap
[ 5.0 4.0 ] 0 setdash
newpath
364.773836333118 -254.09877418369612 moveto
364.773836333118 -336.35813863385073 lineto
stroke
newpath
1.0 setlinewidth
10.0 setmiterlimit
1 setlinejoin
0 setlinecap
[ 5.0 4.0 ] 0 setdash
newpath
421.4667497189448 -0.0 moveto
421.4667497189448 -243.06111505754214 lineto
stroke
newpath
1.0 setlinewidth
10.0 setmiterlimit
1 setlinejoin
0 setlinecap
[ 5.0 4.0 ] 0 setdash
newpath
421.4667497189448 -254.09877418369612 moveto
421.4667497189448 -336.35813863385073 lineto
stroke
newpath
1.0 setlinewidth
10.0 setmiterlimit
1 setlinejoin
0 setlinecap
[ 5.0 4.0 ] 0 setdash
newpath
0.0 -26.039020064742495 moveto
63.881386573214755 -26.039020064742495 lineto
stroke
newpath
1.0 setlinewidth
10.0 setmiterlimit
1 setlinejoin
0 setlinecap
[ 5.0 4.0 ] 0 setdash
newpath
81.30926940398422 -26.039020064742495 moveto
465.3244715815448 -26.039020064742495 lineto
stroke
newpath
1.0 setlinewidth
10.0 setmiterlimit
1 setlinejoin
0 setlinecap
[ 5.0 4.0 ] 0 setdash
newpath
0.0 -26.039020064742495 moveto
63.881386573214755 -26.039020064742495 lineto
stroke
newpath
1.0 setlinewidth
10.0 setmiterlimit
1 setlinejoin
0 setlinecap
[ 5.0 4.0 ] 0 setdash
newpath
81.30926940398422 -26.039020064742495 moveto
465.3244715815448 -26.039020064742495 lineto
stroke
newpath
1.0 setlinewidth
10.0 setmiterlimit
1 setlinejoin
0 setlinecap
[ 5.0 4.0 ] 0 setdash
newpath
0.0 -69.44343906330242 moveto
63.881386573214755 -69.44343906330242 lineto
stroke
newpath
1.0 setlinewidth
10.0 setmiterlimit
1 setlinejoin
0 setlinecap
[ 5.0 4.0 ] 0 setdash
newpath
81.30926940398422 -69.44343906330242 moveto
465.3244715815448 -69.44343906330242 lineto
stroke
newpath
1.0 setlinewidth
10.0 setmiterlimit
1 setlinejoin
0 setlinecap
[ 5.0 4.0 ] 0 setdash
newpath
0.0 -112.84785806186234 moveto
63.881386573214755 -112.84785806186234 lineto
stroke
newpath
1.0 setlinewidth
10.0 setmiterlimit
1 setlinejoin
0 setlinecap
[ 5.0 4.0 ] 0 setdash
newpath
81.30926940398422 -112.84785806186234 moveto
465.3244715815448 -112.84785806186234 lineto
stroke
newpath
1.0 setlinewidth
10.0 setmiterlimit
1 setlinejoin
0 setlinecap
[ 5.0 4.0 ] 0 setdash
newpath
0.0 -156.2522770604223 moveto
63.881386573214755 -156.2522770604223 lineto
stroke
newpath
1.0 setlinewidth
10.0 setmiterlimit
1 setlinejoin
0 setlinecap
[ 5.0 4.0 ] 0 setdash
newpath
81.30926940398422 -156.2522770604223 moveto
465.3244715815448 -156.2522770604223 lineto
stroke
newpath
1.0 setlinewidth
10.0 setmiterlimit
1 setlinejoin
0 setlinecap
[ 5.0 4.0 ] 0 setdash
newpath
0.0 -199.65669605898222 moveto
63.881386573214755 -199.65669605898222 lineto
stroke
newpath
1.0 setlinewidth
10.0 setmiterlimit
1 setlinejoin
0 setlinecap
[ 5.0 4.0 ] 0 setdash
newpath
81.30926940398422 -199.65669605898222 moveto
465.3244715815448 -199.65669605898222 lineto
stroke
newpath
1.0 setlinewidth
10.0 setmiterlimit
1 setlinejoin
0 setlinecap
[ 5.0 4.0 ] 0 setdash
newpath
0.0 -286.46553405610206 moveto
63.881386573214755 -286.46553405610206 lineto
stroke
newpath
1.0 setlinewidth
10.0 setmiterlimit
1 setlinejoin
0 setlinecap
[ 5.0 4.0 ] 0 setdash
newpath
81.30926940398422 -286.46553405610206 moveto
465.3244715815448 -286.46553405610206 lineto
stroke
newpath
1.0 setlinewidth
10.0 setmiterlimit
1 setlinejoin
0 setlinecap
[ 5.0 4.0 ] 0 setdash
newpath
0.0 -329.86995305466195 moveto
63.881386573214755 -329.86995305466195 lineto
stroke
newpath
1.0 setlinewidth
10.0 setmiterlimit
1 setlinejoin
0 setlinecap
[ 5.0 4.0 ] 0 setdash
newpath
81.30926940398422 -329.86995305466195 moveto
465.3244715815448 -329.86995305466195 lineto
stroke
newpath
grestore
gsave
1.0 setlinewidth
10.0 setmiterlimit
1 setlinejoin
0 setlinecap
[ 5.0 4.0 ] 0 setdash
newpath
0.0 -0.0 moveto
465.3244715815448 -0.0 lineto
465.3244715815448 -336.35813863385073 lineto
0.0 -336.35813863385073 lineto
0.0 -0.0 lineto
closepath
clip
newpath
0.0 0.6 0.0 setrgbcolor
1.0 setlinewidth
10.0 setmiterlimit
1 setlinejoin
0 setlinecap
[ 5.0 4.0 ] 0 setdash
newpath
81.3092710913112 -139.59799920400957 moveto
152.17541028906308 -139.59799920400957 lineto
152.17541028906308 -243.06111720058172 lineto
81.3092710913112 -243.06111720058172 lineto
closepath
fill
newpath
0.0 0.6 0.8 setrgbcolor
1.0 setlinewidth
10.0 setmiterlimit
1 setlinejoin
0 setlinecap
[ 5.0 4.0 ] 0 setdash
newpath
152.17541028906308 -94.15574851926284 moveto
251.38800871162752 -94.15574851926284 lineto
251.38800871162752 -243.06111720058172 lineto
152.17541028906308 -243.06111720058172 lineto
closepath
fill
newpath
0.6 0.2 0.0 setrgbcolor
1.0 setlinewidth
10.0 setmiterlimit
1 setlinejoin
0 setlinecap
[ 5.0 4.0 ] 0 setdash
newpath
251.38800871162752 -207.1070672969304 moveto
449.8132232853156 -207.1070672969304 lineto
449.8132232853156 -243.06111720058172 lineto
251.38800871162752 -243.06111720058172 lineto
closepath
fill
newpath
0.0 0.6 0.0 setrgbcolor
1.0 setlinewidth
10.0 setmiterlimit
1 setlinejoin
1 setlinecap
[ ] 0 setdash
newpath
81.30926940398422 -139.59800149067482 moveto
152.17541113626768 -139.59800149067482 lineto
stroke
newpath
0.0 0.6 0.0 setrgbcolor
1.0 setlinewidth
10.0 setmiterlimit
1 setlinejoin
1 setlinecap
[ ] 0 setdash
newpath
152.17541113626768 -139.59800149067482 moveto
152.17541113626768 -243.06111505754214 lineto
stroke
newpath
0.0 0.6 0.0 setrgbcolor
1.0 setlinewidth
10.0 setmiterlimit
1 setlinejoin
1 setlinecap
[ ] 0 setdash
newpath
152.17541113626768 -243.06111505754214 moveto
81.30926940398422 -243.06111505754214 lineto
stroke
newpath
0.0 0.6 0.0 setrgbcolor
1.0 setlinewidth
10.0 setmiterlimit
1 setlinejoin
1 setlinecap
[ ] 0 setdash
newpath
81.30926940398422 -243.06111505754214 moveto
81.30926940398422 -139.59800149067482 lineto
stroke
newpath
0.0 0.6 0.8 setrgbcolor
1.0 setlinewidth
10.0 setmiterlimit
1 setlinejoin
1 setlinecap
[ ] 0 setdash
newpath
152.17541113626768 -94.1557450201325 moveto
251.38800956146451 -94.1557450201325 lineto
stroke
newpath
0.0 0.6 0.8 setrgbcolor
1.0 setlinewidth
10.0 setmiterlimit
1 setlinejoin
1 setlinecap
[ ] 0 setdash
newpath
251.38800956146451 -94.1557450201325 moveto
251.38800956146451 -243.06111505754214 lineto
stroke
newpath
0.0 0.6 0.8 setrgbcolor
1.0 setlinewidth
10.0 setmiterlimit
1 setlinejoin
1 setlinecap
[ ] 0 setdash
newpath
251.38800956146451 -243.06111505754214 moveto
152.17541113626768 -243.06111505754214 lineto
stroke
newpath
0.0 0.6 0.8 setrgbcolor
1.0 setlinewidth
10.0 setmiterlimit
1 setlinejoin
1 setlinecap
[ ] 0 setdash
newpath
152.17541113626768 -243.06111505754214 moveto
152.17541113626768 -94.1557450201325 lineto
stroke
newpath
0.6 0.2 0.0 setrgbcolor
1.0 setlinewidth
10.0 setmiterlimit
1 setlinejoin
1 setlinecap
[ ] 0 setdash
newpath
251.38800956146451 -207.10706458008502 moveto
449.8132064118582 -207.10706458008502 lineto
stroke
newpath
0.6 0.2 0.0 setrgbcolor
1.0 setlinewidth
10.0 setmiterlimit
1 setlinejoin
1 setlinecap
[ ] 0 setdash
newpath
449.8132064118582 -207.10706458008502 moveto
449.8132064118582 -243.06111505754214 lineto
stroke
newpath
0.6 0.2 0.0 setrgbcolor
1.0 setlinewidth
10.0 setmiterlimit
1 setlinejoin
1 setlinecap
[ ] 0 setdash
newpath
449.8132064118582 -243.06111505754214 moveto
251.38800956146451 -243.06111505754214 lineto
stroke
newpath
0.6 0.2 0.0 setrgbcolor
1.0 setlinewidth
10.0 setmiterlimit
1 setlinejoin
1 setlinecap
[ ] 0 setdash
newpath
251.38800956146451 -243.06111505754214 moveto
251.38800956146451 -207.10706458008502 lineto
stroke
newpath
grestore
grestore
showpage

%%EOF