%!PS-Adobe-3.0 EPSF-3.0
%%Creator: inkscape 0.45.1
%%Pages: 1
%%Orientation: Portrait
%%BoundingBox: 6 230 855 414
%%HiResBoundingBox: 6.6602524 230.4754 854.62942 413.51928
%%EndComments
%%Page: 1 1
0 596 translate
0.8 -0.8 scale
0 0 0 setrgbcolor
[] 0 setdash
1 setlinewidth
0 setlinejoin
0 setlinecap
gsave [1 0 0 1 0 0] concat
gsave [0.9808637 0 0 1.0195096 0 0] concat
gsave
1 1 1 setrgbcolor
newpath
171.57063 266.92359 moveto
141.29904 266.92359 lineto
139.80677 275.02444 lineto
132.13229 268.62904 121.47326 265.00497 110.81426 265.00497 curveto
76.705454 265.00497 47.286545 296.12933 47.286545 332.36993 curveto
47.286545 358.80426 64.76735 377.77733 88.856694 377.77733 curveto
102.50022 377.77733 115.29105 371.80827 124.4578 360.93609 curveto
127.44232 371.80827 136.60908 377.77733 150.25261 377.77733 curveto
162.19069 377.77733 174.34199 372.02145 186.06689 360.93609 curveto
176.90014 349.63753 lineto
172.21018 353.26159 169.01247 354.75386 165.60159 354.75386 curveto
160.91162 354.75386 157.50074 351.12979 157.50074 346.22665 curveto
157.50074 343.66849 157.50074 343.4553 159.20618 335.56764 curveto
171.57063 266.92359 lineto
134.69045 290.5866 moveto
128.50823 319.57909 125.31051 330.45132 119.98101 339.61806 curveto
113.37243 350.9166 106.12429 356.4593 98.023445 356.4593 curveto
89.069884 356.4593 83.314008 348.99798 83.314008 337.0599 curveto
83.314008 323.62956 88.643521 305.93557 95.678462 296.34247 curveto
101.43432 288.24163 108.89565 283.76483 116.57013 283.76483 curveto
121.89963 283.76483 127.22915 285.89664 134.69045 290.5866 curveto
fill
grestore
gsave
1 1 1 setrgbcolor
newpath
227.35724 375.8587 moveto
241.85349 296.34247 lineto
247.82254 291.65251 255.49704 288.88116 262.95834 288.88116 curveto
271.05918 288.88116 275.96233 292.71841 275.96233 299.32699 curveto
275.96233 301.45879 275.96233 301.88516 275.74915 303.16424 curveto
267.43512 347.29255 lineto
266.79558 351.12979 266.36922 354.54068 266.36922 356.88566 curveto
266.36922 369.2501 277.24143 377.77733 293.01675 377.77733 curveto
304.10212 377.77733 314.54797 373.30053 326.69923 363.28107 curveto
318.3852 351.34297 lineto
313.90842 354.11432 312.20297 354.75386 309.43163 354.75386 curveto
304.52849 354.75386 301.54396 351.98251 301.54396 347.50573 curveto
301.54396 345.58711 301.54397 345.5871 303.24941 336.84672 curveto
309.85799 299.54017 lineto
311.13707 293.35795 311.35026 291.01296 311.35026 288.02844 curveto
311.35026 274.5981 298.55942 265.00497 280.6523 265.00497 curveto
268.50104 265.00497 254.43112 270.12131 245.26438 277.79579 curveto
247.183 266.92359 lineto
236.09763 266.92359 lineto
219.89594 272.03992 211.15552 273.53218 195.16702 274.3849 curveto
191.96932 291.86568 lineto
194.52748 291.86568 lineto
198.15154 291.86568 203.90741 293.78431 205.82603 295.27657 curveto
206.67875 296.12929 207.10511 297.62155 207.10511 299.54017 curveto
207.10511 301.03243 206.67875 304.6565 206.25239 307.42784 curveto
193.67476 375.8587 lineto
227.35724 375.8587 lineto
fill
grestore
gsave
1 1 1 setrgbcolor
newpath
456.03303 266.92359 moveto
422.35055 266.92359 lineto
408.28065 344.30803 lineto
403.16433 349.85071 393.78439 353.90114 386.32308 353.90114 curveto
379.92768 353.90114 375.02453 349.21117 375.02453 342.81576 curveto
375.02453 341.74986 375.23771 339.83124 375.66407 337.69944 curveto
376.09043 336.63354 376.30361 334.92809 376.72997 332.79629 curveto
388.66807 266.92359 lineto
377.58269 266.92359 lineto
361.38101 272.03992 352.64059 273.53218 336.65209 274.3849 curveto
333.45438 291.86568 lineto
336.01254 291.86568 lineto
339.42343 291.86568 345.60566 293.78431 347.3111 295.27657 curveto
347.95064 296.12929 348.59018 297.83473 348.59018 299.54017 curveto
348.59018 301.24561 348.16382 304.23014 347.52428 307.42784 curveto
340.91569 344.30803 lineto
340.27615 348.35845 339.84979 351.76934 339.84979 354.75386 curveto
339.84979 367.75784 352.8538 377.77733 369.9082 377.77733 curveto
380.78039 377.77733 389.94716 374.79279 402.52478 366.90513 curveto
404.44341 365.62605 lineto
403.16433 373.30053 401.67206 377.77733 398.68754 383.10683 curveto
392.93168 393.97901 382.69901 400.58761 372.04001 400.58761 curveto
364.57871 400.58761 359.24919 398.02944 356.26467 392.91312 curveto
352.42743 386.30454 352.42742 386.30453 350.93516 385.23863 curveto
348.377 383.32001 344.75293 382.25411 341.12887 382.25411 curveto
331.74895 382.25411 324.50081 388.86271 324.50081 397.38991 curveto
324.50081 409.96753 342.62116 419.34748 366.92368 419.34748 curveto
384.40444 419.34748 400.17981 415.08386 413.1838 406.55666 curveto
428.95912 396.5372 434.50183 385.87814 440.04451 355.18022 curveto
456.03303 266.92359 lineto
fill
grestore
grestore
gsave [0.9808637 0 0 1.0195096 0 0] concat
gsave
1 1 1 setrgbcolor
newpath
584.28121 266.12331 moveto
564.66863 266.12331 lineto
550.38555 345.21318 lineto
538.44747 355.01947 524.16437 361.62806 514.57127 361.62806 curveto
504.33863 361.62806 498.15639 356.51173 498.15639 347.98453 curveto
498.15639 345.42637 498.79593 340.31003 499.64865 334.98053 curveto
512.22629 266.12331 lineto
504.12544 266.12331 lineto
491.97417 268.89465 488.77644 269.5342 474.2802 270.81328 curveto
473.2143 276.9955 lineto
475.77246 277.42186 lineto
484.72602 278.91412 488.13692 281.89865 488.13692 288.08088 curveto
488.13692 290.21268 487.92374 291.49176 487.71056 293.41038 curveto
478.75699 342.65502 lineto
478.11745 345.63954 477.90426 348.62407 477.90426 351.39541 curveto
477.90426 363.97303 488.13693 371.64753 504.97816 371.64753 curveto
520.11394 371.64753 537.59475 364.82576 550.81191 353.74039 curveto
551.66463 365.03894 561.68412 371.64753 577.67262 371.64753 curveto
594.94021 371.64753 610.71557 364.82575 622.86684 351.82177 curveto
636.084 337.75189 644.8244 313.4493 644.8244 289.9995 curveto
644.8244 273.79782 638.00262 263.35197 627.5568 263.35197 curveto
620.73504 263.35197 614.55281 269.96056 614.55281 277.42186 curveto
614.55281 281.89864 616.04507 284.24364 621.58775 288.50724 curveto
628.19634 293.62356 631.18087 300.65852 631.18087 310.67798 curveto
631.18087 336.47277 609.86282 361.62806 588.33164 361.62806 curveto
577.24627 361.62806 570.63767 355.65901 570.63767 345.85272 curveto
570.63767 342.65502 571.27722 337.75187 572.76948 329.22466 curveto
584.28121 266.12331 lineto
fill
grestore
gsave
1 1 1 setrgbcolor
newpath
771.21032 266.12331 moveto
751.59774 266.12331 lineto
749.67911 276.9955 lineto
742.43099 268.89466 731.13242 264.20469 718.76798 264.20469 curveto
685.72507 264.20469 657.37206 295.7554 657.37206 332.20919 curveto
657.37206 355.87217 672.08152 371.64753 694.03907 371.64753 curveto
710.66711 371.64753 724.0975 363.54667 737.10148 345.85272 curveto
736.8883 347.34498 736.8883 348.62407 736.8883 349.26361 curveto
736.8883 354.16675 739.44647 361.20171 742.64417 365.25213 curveto
745.84187 369.08937 751.59774 371.64753 757.3536 371.64753 curveto
768.43897 371.64753 782.08252 364.3994 788.47792 355.01947 curveto
783.78795 350.54269 lineto
779.52435 355.65901 773.5553 358.85672 768.43898 358.85672 curveto
762.25676 358.85672 757.14042 353.74039 757.14042 347.34499 curveto
757.14042 344.78683 757.56678 341.16275 758.63268 335.62007 curveto
771.21032 266.12331 lineto
747.97367 285.94907 moveto
742.43099 316.00746 738.38055 328.37196 730.70607 340.52322 curveto
722.81841 353.10084 709.38803 361.62806 697.87631 361.62806 curveto
685.93823 361.62806 678.05055 351.82176 678.05055 337.53869 curveto
678.05055 323.89517 682.9537 306.62755 689.77546 295.75536 curveto
698.72902 281.68548 710.45396 274.22416 723.45794 274.22416 curveto
733.4774 274.22416 740.29919 277.42187 747.97367 285.94907 curveto
fill
grestore
gsave
1 1 1 setrgbcolor
newpath
904.0516 266.12331 moveto
884.43901 266.12331 lineto
870.36912 343.50774 lineto
857.57831 355.01946 842.86885 361.62806 830.71759 361.62806 curveto
822.61675 361.62806 816.86087 356.08537 816.86087 347.98453 curveto
816.86087 346.06591 817.28723 342.22866 818.13995 337.75187 curveto
831.14395 266.12331 lineto
823.0431 266.12331 lineto
811.10502 268.89465 807.48093 269.5342 793.19787 270.81328 curveto
792.13196 276.9955 lineto
794.69013 277.42186 lineto
803.85687 278.91412 807.05458 281.89865 807.05458 288.08088 curveto
807.05458 290.21268 806.8414 291.49176 806.62822 293.41038 curveto
798.52737 337.75187 lineto
798.10101 340.31004 797.46147 347.55817 797.46147 350.75587 curveto
797.46147 363.75985 807.26778 371.64753 823.68264 371.64753 curveto
838.39206 371.64753 855.44651 364.18621 868.87685 352.24813 curveto
865.67915 369.94209 lineto
861.41555 393.17872 846.06655 408.95408 827.51989 408.95408 curveto
819.20586 408.95408 813.66317 405.75637 809.39956 398.72143 curveto
806.41504 393.60511 803.43051 391.68648 798.31419 391.68648 curveto
791.70561 391.68648 787.01564 395.31055 787.01564 400.64005 curveto
787.01564 409.38043 803.43054 416.84175 823.0431 416.84175 curveto
838.39206 416.84175 854.38061 411.72541 866.53187 402.55867 curveto
877.40405 394.45783 882.30721 385.71742 885.07855 370.36845 curveto
904.0516 266.12331 lineto
fill
grestore
gsave
1 1 1 setrgbcolor
newpath
939.14308 343.72092 moveto
930.4027 343.72092 922.51502 351.82178 922.51502 360.98852 curveto
922.51502 367.81028 927.20499 372.50026 934.02675 372.50026 curveto
942.98031 372.50026 951.29435 364.61258 951.29435 356.08538 curveto
951.29435 348.83725 946.3912 343.72092 939.14308 343.72092 curveto
fill
grestore
gsave
1 1 1 setrgbcolor
newpath
1003.2637 343.72092 moveto
994.5233 343.72092 986.63562 351.82178 986.63562 360.98852 curveto
986.63562 367.81028 991.3256 372.50026 998.14736 372.50026 curveto
1007.1009 372.50026 1015.415 364.61258 1015.415 356.08538 curveto
1015.415 348.83725 1010.5118 343.72092 1003.2637 343.72092 curveto
fill
grestore
gsave
1 1 1 setrgbcolor
newpath
1067.3843 343.72092 moveto
1058.6439 343.72092 1050.7562 351.82178 1050.7562 360.98852 curveto
1050.7562 367.81028 1055.4462 372.50026 1062.268 372.50026 curveto
1071.2215 372.50026 1079.5356 364.61258 1079.5356 356.08538 curveto
1079.5356 348.83725 1074.6324 343.72092 1067.3843 343.72092 curveto
fill
grestore
grestore
grestore
showpage
%%EOF
