<?xml version="1.0" encoding="UTF-8" standalone="no"?>
<svg
   xmlns:dc="http://purl.org/dc/elements/1.1/"
   xmlns:cc="http://creativecommons.org/ns#"
   xmlns:rdf="http://www.w3.org/1999/02/22-rdf-syntax-ns#"
   xmlns:svg="http://www.w3.org/2000/svg"
   xmlns="http://www.w3.org/2000/svg"
   id="svg8"
   version="1.1"
   viewBox="0 0 60 180"
   height="180mm"
   width="60mm">
  <defs
     id="defs2" />
  <metadata
     id="metadata5">
    <rdf:RDF>
      <cc:Work
         rdf:about="">
        <dc:format>image/svg+xml</dc:format>
        <dc:type
           rdf:resource="http://purl.org/dc/dcmitype/StillImage" />
        <dc:title></dc:title>
      </cc:Work>
    </rdf:RDF>
  </metadata>
  <g
     transform="translate(-67.800263,-63.795664)"
     id="layer1">
    <path
       transform="matrix(0.26458333,0,0,0.26458333,67.800263,63.795664)"
       id="path866"
       d="M 112.53235,647.54953 C 109.94838,643.23353 83.435827,559.712 71.202174,517.34856 41.832185,415.64441 22.64094,324.0246 13.648959,242.58707 9.8335375,208.03201 10.36691,139.00172 14.632399,115.30785 27.527296,43.679525 59.405809,10.251987 114.82,10.251987 c 46.2492,0 79.59797,30.473393 92.85929,84.852814 7.01847,28.779949 8.97742,54.038369 7.67774,98.994949 -2.16702,74.95811 -14.24337,148.30557 -42.7435,259.6092 -19.43541,75.90252 -57.38588,198.34255 -60.08118,193.84058 z"
       style="opacity:1;fill:#ffd86a;fill-opacity:1;stroke:#ffa025;stroke-width:19.58551206;stroke-linecap:butt;stroke-linejoin:miter;stroke-miterlimit:4;stroke-dasharray:none;stroke-opacity:0.99572647;paint-order:markers fill stroke" />
  </g>
</svg>
