<?xml version="1.0" encoding="UTF-8" standalone="no"?>
<svg
   xmlns:dc="http://purl.org/dc/elements/1.1/"
   xmlns:cc="http://creativecommons.org/ns#"
   xmlns:rdf="http://www.w3.org/1999/02/22-rdf-syntax-ns#"
   xmlns:svg="http://www.w3.org/2000/svg"
   xmlns="http://www.w3.org/2000/svg"
   id="svg1556"
   version="1.1"
   viewBox="0 0 210 297"
   height="297mm"
   width="210mm">
  <defs
     id="defs1550" />
  <metadata
     id="metadata1553">
    <rdf:RDF>
      <cc:Work
         rdf:about="">
        <dc:format>image/svg+xml</dc:format>
        <dc:type
           rdf:resource="http://purl.org/dc/dcmitype/StillImage" />
        <dc:title></dc:title>
      </cc:Work>
    </rdf:RDF>
  </metadata>
  <g
     id="layer1">
    <path
       id="path1593"
       d="m 46.763585,142.01115 c -5.316056,-0.47066 -11.240791,-2.08174 -16.230642,-4.4135 -2.222121,-1.03841 -6.561096,-3.72077 -8.339651,-5.15559 l -0.649671,-0.52412 2.253288,-2.24856 c 12.93437,-12.90722 26.898374,-14.84422 42.030535,-5.83023 2.955573,1.76058 6.802078,4.537 9.427387,6.80472 l 1.532128,1.32343 -1.44068,1.29036 c -7.215788,6.46291 -17.809609,9.70728 -28.582694,8.75349 z"
       style="opacity:1;fill:#ffffff;fill-opacity:1;stroke:#303030;stroke-width:1.78291917;stroke-linecap:butt;stroke-linejoin:miter;stroke-miterlimit:4;stroke-dasharray:none;stroke-opacity:1;paint-order:markers fill stroke" />
    <path
       id="path1593-3"
       d="m 159.36271,142.00885 c 5.39054,-0.47066 11.39827,-2.08174 16.45803,-4.4135 2.25324,-1.03841 6.65301,-3.72077 8.45648,-5.15559 l 0.65877,-0.52412 -2.28485,-2.24856 c -13.11557,-12.90722 -27.2752,-14.84422 -42.61936,-5.83023 -2.99697,1.76058 -6.89736,4.537 -9.55944,6.80472 l -1.5536,1.32343 1.46086,1.29036 c 7.31688,6.46291 18.05911,9.70728 28.98311,8.75349 z"
       style="opacity:1;fill:#ffffff;fill-opacity:1;stroke:#303030;stroke-width:1.79536438;stroke-linecap:butt;stroke-linejoin:miter;stroke-miterlimit:4;stroke-dasharray:none;stroke-opacity:1;paint-order:markers fill stroke" />
    <ellipse
       ry="11.044199"
       rx="8.5067682"
       cy="130.29288"
       cx="48.791752"
       id="path2159"
       style="opacity:1;fill:#452a2a;fill-opacity:1;stroke:#867979;stroke-width:0;stroke-linecap:butt;stroke-linejoin:miter;stroke-miterlimit:4;stroke-dasharray:none;stroke-opacity:1;paint-order:markers fill stroke" />
    <ellipse
       ry="11.044199"
       rx="8.5067682"
       cy="130.2238"
       cx="157.15448"
       id="path2159-5"
       style="opacity:1;fill:#452a2a;fill-opacity:1;stroke:#867979;stroke-width:0;stroke-linecap:butt;stroke-linejoin:miter;stroke-miterlimit:4;stroke-dasharray:none;stroke-opacity:1;paint-order:markers fill stroke" />
    <path
       id="path2192"
       d="m 75.991137,130.73107 c 0.233521,-4.682 -0.28316,-5.34576 -0.544793,-5.7431"
       style="fill:none;fill-opacity:1;stroke:#303030;stroke-width:1.14069879;stroke-linecap:round;stroke-linejoin:round;stroke-miterlimit:4;stroke-dasharray:none;stroke-opacity:1" />
    <path
       id="path2192-6"
       d="m 71.758401,127.74932 c 0.233521,-4.682 -1.485873,-7.21665 -1.747506,-7.61399"
       style="fill:none;fill-opacity:1;stroke:#303030;stroke-width:1.14069879;stroke-linecap:round;stroke-linejoin:round;stroke-miterlimit:4;stroke-dasharray:none;stroke-opacity:1" />
    <path
       id="path2192-6-2"
       d="m 66.212558,123.40619 c 0.233521,-4.682 -2.020412,-8.48618 -2.282045,-8.88352"
       style="fill:none;fill-opacity:1;stroke:#303030;stroke-width:1.14069879;stroke-linecap:round;stroke-linejoin:round;stroke-miterlimit:4;stroke-dasharray:none;stroke-opacity:1" />
    <path
       id="path2192-6-9"
       d="m 59.129916,120.13213 c 0.233521,-4.682 -2.554951,-9.08753 -2.816584,-9.48487"
       style="fill:none;fill-opacity:1;stroke:#303030;stroke-width:1.14069879;stroke-linecap:round;stroke-linejoin:round;stroke-miterlimit:4;stroke-dasharray:none;stroke-opacity:1" />
    <path
       id="path2192-6-1"
       d="m 51.579551,118.0608 c 0.233521,-4.682 -3.289942,-8.48618 -3.551575,-8.88352"
       style="fill:none;fill-opacity:1;stroke:#303030;stroke-width:1.14069879;stroke-linecap:round;stroke-linejoin:round;stroke-miterlimit:4;stroke-dasharray:none;stroke-opacity:1" />
    <path
       id="path2192-6-27"
       d="m 43.561465,118.26125 c 0.233521,-4.682 -3.824481,-8.48618 -4.086114,-8.88352"
       style="fill:none;fill-opacity:1;stroke:#303030;stroke-width:1.14069879;stroke-linecap:round;stroke-linejoin:round;stroke-miterlimit:4;stroke-dasharray:none;stroke-opacity:1" />
    <path
       id="path2192-6-0"
       d="m 35.27611,120.66668 c -0.434653,-4.61519 -3.223125,-7.48392 -3.484758,-7.88126"
       style="fill:none;fill-opacity:1;stroke:#303030;stroke-width:1.14069879;stroke-linecap:round;stroke-linejoin:round;stroke-miterlimit:4;stroke-dasharray:none;stroke-opacity:1" />
    <path
       id="path2192-6-93"
       d="m 29.128911,124.6089 c -0.768739,-4.74882 -2.688585,-5.27894 -2.950218,-5.67628"
       style="fill:none;fill-opacity:1;stroke:#303030;stroke-width:1.14069879;stroke-linecap:round;stroke-linejoin:round;stroke-miterlimit:4;stroke-dasharray:none;stroke-opacity:1" />
    <path
       id="path2192-6-6"
       d="m 24.184425,129.28612 c -2.30554,-4.74882 -3.022672,-4.00942 -3.284305,-4.40676"
       style="fill:none;fill-opacity:1;stroke:#303030;stroke-width:1.14069879;stroke-linecap:round;stroke-linejoin:round;stroke-miterlimit:4;stroke-dasharray:none;stroke-opacity:1" />
    <path
       id="path2192-0"
       d="m 130.00419,130.72172 c -0.19937,-4.67955 0.34252,-5.33775 0.61749,-5.73221"
       style="fill:none;fill-opacity:1;stroke:#303030;stroke-width:1.1611172;stroke-linecap:round;stroke-linejoin:round;stroke-miterlimit:4;stroke-dasharray:none;stroke-opacity:1;opacity:1" />
    <path
       id="path2192-6-62"
       d="m 134.42108,127.78311 c -0.19937,-4.67954 1.60693,-7.19534 1.88191,-7.58981"
       style="fill:none;fill-opacity:1;stroke:#303030;stroke-width:1.1611172;stroke-linecap:round;stroke-linejoin:round;stroke-miterlimit:4;stroke-dasharray:none;stroke-opacity:1;opacity:1" />
    <path
       id="path2192-6-2-6"
       d="m 140.21219,123.49696 c -0.19936,-4.67956 2.17291,-8.45855 2.44787,-8.85301"
       style="fill:none;fill-opacity:1;stroke:#303030;stroke-width:1.1611172;stroke-linecap:round;stroke-linejoin:round;stroke-miterlimit:4;stroke-dasharray:none;stroke-opacity:1;opacity:1" />
    <path
       id="path2192-6-9-1"
       d="m 147.58732,120.29338 c -0.19938,-4.67955 2.73274,-9.05422 3.0077,-9.44868"
       style="fill:none;fill-opacity:1;stroke:#303030;stroke-width:1.1611172;stroke-linecap:round;stroke-linejoin:round;stroke-miterlimit:4;stroke-dasharray:none;stroke-opacity:1;opacity:1" />
    <path
       id="path2192-6-1-8"
       d="m 155.43649,118.29579 c -0.19937,-4.67956 3.48948,-8.4465 3.76445,-8.84096"
       style="fill:none;fill-opacity:1;stroke:#303030;stroke-width:1.1611172;stroke-linecap:round;stroke-linejoin:round;stroke-miterlimit:4;stroke-dasharray:none;stroke-opacity:1;opacity:1" />
    <path
       id="path2192-6-27-7"
       d="m 163.74995,118.57214 c -0.19936,-4.67955 4.04384,-8.44142 4.3188,-8.83588"
       style="fill:none;fill-opacity:1;stroke:#303030;stroke-width:1.1611172;stroke-linecap:round;stroke-linejoin:round;stroke-miterlimit:4;stroke-dasharray:none;stroke-opacity:1;opacity:1" />
    <path
       id="path2192-6-0-9"
       d="m 172.32043,121.05381 c 0.49296,-4.60646 3.41103,-7.44586 3.68599,-7.84032"
       style="fill:none;fill-opacity:1;stroke:#303030;stroke-width:1.1611172;stroke-linecap:round;stroke-linejoin:round;stroke-miterlimit:4;stroke-dasharray:none;stroke-opacity:1;opacity:1" />
    <path
       id="path2192-6-93-2"
       d="m 178.65945,125.05044 c 0.84065,-4.73678 2.83651,-5.24815 3.11148,-5.64261"
       style="fill:none;fill-opacity:1;stroke:#303030;stroke-width:1.1611172;stroke-linecap:round;stroke-linejoin:round;stroke-miterlimit:4;stroke-dasharray:none;stroke-opacity:1;opacity:1" />
    <path
       id="path2192-6-6-0"
       d="m 183.74445,129.76994 c 2.43442,-4.72221 3.17138,-3.97673 3.44633,-4.3712"
       style="fill:none;fill-opacity:1;stroke:#303030;stroke-width:1.1611172;stroke-linecap:round;stroke-linejoin:round;stroke-miterlimit:4;stroke-dasharray:none;stroke-opacity:1;opacity:1" />
    <ellipse
       ry="4.8555555"
       rx="2.4054255"
       cy="131.06871"
       cx="48.790119"
       id="path2299"
       style="opacity:1;fill:#ffffff;fill-opacity:1;stroke:#9b7e7e;stroke-width:0;stroke-linecap:round;stroke-linejoin:round;stroke-miterlimit:4;stroke-dasharray:none;stroke-opacity:1;paint-order:markers fill stroke" />
    <ellipse
       ry="1.4174107"
       rx="0.47247022"
       cy="131.17915"
       cx="50.443607"
       id="path2301"
       style="opacity:1;fill:#ffffff;fill-opacity:1;stroke:#9b7e7e;stroke-width:0;stroke-linecap:round;stroke-linejoin:round;stroke-miterlimit:4;stroke-dasharray:none;stroke-opacity:1;paint-order:markers fill stroke" />
    <ellipse
       ry="4.8555555"
       rx="2.4054255"
       cy="130.62473"
       cx="157.15448"
       id="path2299-3"
       style="opacity:1;fill:#ffffff;fill-opacity:1;stroke:#9b7e7e;stroke-width:0;stroke-linecap:round;stroke-linejoin:round;stroke-miterlimit:4;stroke-dasharray:none;stroke-opacity:1;paint-order:markers fill stroke" />
  </g>
</svg>
