<?xml version="1.0" encoding="UTF-8" standalone="no"?>
<!-- Created with Inkscape (http://www.inkscape.org/) -->
<svg
   xmlns:dc="http://purl.org/dc/elements/1.1/"
   xmlns:cc="http://web.resource.org/cc/"
   xmlns:rdf="http://www.w3.org/1999/02/22-rdf-syntax-ns#"
   xmlns:svg="http://www.w3.org/2000/svg"
   xmlns="http://www.w3.org/2000/svg"
   xmlns:xlink="http://www.w3.org/1999/xlink"
   xmlns:sodipodi="http://sodipodi.sourceforge.net/DTD/sodipodi-0.dtd"
   xmlns:inkscape="http://www.inkscape.org/namespaces/inkscape"
   id="svg2"
   sodipodi:version="0.32"
   inkscape:version="0.45.1"
   width="24"
   height="24"
   version="1.0"
   sodipodi:docbase="/home/maker/icons/anjuta-new2/smallsvg2"
   sodipodi:docname="anjuta-go-help-next.svg"
   inkscape:label="bracket"
   inkscape:output_extension="org.inkscape.output.svg.inkscape"
   inkscape:export-filename="/home/maker/icons/anjuta-new2/smallsvg2/anjuta-go-help-next-16.png"
   inkscape:export-xdpi="60"
   inkscape:export-ydpi="60">
  <metadata
     id="metadata7">
    <rdf:RDF>
      <cc:Work
         rdf:about="">
        <dc:format>image/svg+xml</dc:format>
        <dc:type
           rdf:resource="http://purl.org/dc/dcmitype/StillImage" />
        <cc:license
           rdf:resource="http://creativecommons.org/licenses/GPL/2.0/" />
      </cc:Work>
      <cc:License
         rdf:about="http://creativecommons.org/licenses/GPL/2.0/">
        <cc:permits
           rdf:resource="http://web.resource.org/cc/Reproduction" />
        <cc:permits
           rdf:resource="http://web.resource.org/cc/Distribution" />
        <cc:requires
           rdf:resource="http://web.resource.org/cc/Notice" />
        <cc:permits
           rdf:resource="http://web.resource.org/cc/DerivativeWorks" />
        <cc:requires
           rdf:resource="http://web.resource.org/cc/ShareAlike" />
        <cc:requires
           rdf:resource="http://web.resource.org/cc/SourceCode" />
      </cc:License>
    </rdf:RDF>
  </metadata>
  <defs
     id="defs5">
    <radialGradient
       inkscape:collect="always"
       xlink:href="#linearGradient8650"
       id="radialGradient3364"
       gradientUnits="userSpaceOnUse"
       gradientTransform="matrix(0.4797257,0.4985479,1.5415681e-2,-0.5258152,-6.468893,6.2659219)"
       cx="19.299603"
       cy="13.803786"
       fx="19.299603"
       fy="13.803786"
       r="17.171415" />
    <linearGradient
       inkscape:collect="always"
       id="linearGradient8547">
      <stop
         style="stop-color:#000000;stop-opacity:1;"
         offset="0"
         id="stop8549" />
      <stop
         style="stop-color:#000000;stop-opacity:0;"
         offset="1"
         id="stop8551" />
    </linearGradient>
    <linearGradient
       id="linearGradient8539">
      <stop
         style="stop-color:#000000;stop-opacity:1;"
         offset="0"
         id="stop8541" />
      <stop
         style="stop-color:#000000;stop-opacity:0;"
         offset="1"
         id="stop8543" />
    </linearGradient>
    <linearGradient
       inkscape:collect="always"
       id="linearGradient6339">
      <stop
         style="stop-color:#ffffff;stop-opacity:1;"
         offset="0"
         id="stop6341" />
      <stop
         style="stop-color:#ffffff;stop-opacity:0;"
         offset="1"
         id="stop6343" />
    </linearGradient>
    <linearGradient
       id="linearGradient20428">
      <stop
         id="stop20430"
         offset="0.0000000"
         style="stop-color:#a3a3a3;stop-opacity:1.0000000;" />
      <stop
         id="stop20432"
         offset="1"
         style="stop-color:#b5b5b5;stop-opacity:0;" />
    </linearGradient>
    <linearGradient
       id="linearGradient20393">
      <stop
         id="stop20395"
         offset="0"
         style="stop-color:#ffffff;stop-opacity:1;" />
      <stop
         style="stop-color:#ffffff;stop-opacity:0.44117647;"
         offset="0.41176471"
         id="stop2427" />
      <stop
         id="stop20397"
         offset="1.0000000"
         style="stop-color:#000000;stop-opacity:0.48039216;" />
    </linearGradient>
    <linearGradient
       id="linearGradient3175"
       inkscape:collect="always">
      <stop
         id="stop3177"
         offset="0"
         style="stop-color:#f1f3ff;stop-opacity:1;" />
      <stop
         id="stop3179"
         offset="1"
         style="stop-color:#f1f3ff;stop-opacity:0;" />
    </linearGradient>
    <radialGradient
       gradientUnits="userSpaceOnUse"
       fy="11.4873"
       fx="17.8335"
       r="22.7093"
       cy="11.4873"
       cx="17.8335"
       id="aigrd7">
      <stop
         id="stop19512"
         style="stop-color:#ffffff;stop-opacity:0.17525773;"
         offset="0.0000000" />
      <stop
         id="stop19514"
         style="stop-color:#709ac8;stop-opacity:1.0000000;"
         offset="0.88200003" />
      <stop
         id="stop19516"
         style="stop-color:#6f96dd;stop-opacity:1.0000000;"
         offset="1.0000000" />
    </radialGradient>
    <linearGradient
       id="linearGradient3265">
      <stop
         id="stop3267"
         offset="0"
         style="stop-color:#929470;stop-opacity:1;" />
      <stop
         style="stop-color:#60614a;stop-opacity:1.0000000;"
         offset="0.26470590"
         id="stop3269" />
      <stop
         id="stop3271"
         offset="0.63235295"
         style="stop-color:#f3f5ba;stop-opacity:1.0000000;" />
      <stop
         id="stop3273"
         offset="1.0000000"
         style="stop-color:#929470;stop-opacity:1.0000000;" />
    </linearGradient>
    <linearGradient
       id="linearGradient3311">
      <stop
         id="stop3313"
         offset="0"
         style="stop-color:#d6d7a5;stop-opacity:1;" />
      <stop
         id="stop3315"
         offset="1.0000000"
         style="stop-color:#8e8f6d;stop-opacity:1.0000000;" />
    </linearGradient>
    <linearGradient
       inkscape:collect="always"
       xlink:href="#linearGradient2399"
       id="linearGradient4118"
       gradientUnits="userSpaceOnUse"
       gradientTransform="matrix(0.618682,-0.132027,6.262726e-2,0.741184,31.12021,8.30041)"
       x1="-10.480865"
       y1="39.033951"
       x2="-23.851389"
       y2="39.142845" />
    <linearGradient
       inkscape:collect="always"
       xlink:href="#linearGradient19894"
       id="linearGradient4116"
       gradientUnits="userSpaceOnUse"
       gradientTransform="matrix(0.618682,-0.132027,6.262726e-2,0.741184,31.12021,8.30041)"
       x1="-22.874170"
       y1="38.675991"
       x2="-4.3908315"
       y2="38.675991" />
    <linearGradient
       inkscape:collect="always"
       xlink:href="#linearGradient2399"
       id="linearGradient4114"
       gradientUnits="userSpaceOnUse"
       gradientTransform="scale(1.02645,0.974232)"
       x1="-10.480865"
       y1="39.033951"
       x2="-23.851389"
       y2="39.142845" />
    <linearGradient
       inkscape:collect="always"
       xlink:href="#linearGradient19894"
       id="linearGradient4112"
       gradientUnits="userSpaceOnUse"
       gradientTransform="scale(1.02645,0.974232)"
       x1="-22.874170"
       y1="38.675991"
       x2="-4.3908315"
       y2="38.675991" />
    <linearGradient
       inkscape:collect="always"
       xlink:href="#linearGradient2399"
       id="linearGradient4110"
       gradientUnits="userSpaceOnUse"
       gradientTransform="scale(1.02645,0.974232)"
       x1="-10.480865"
       y1="39.033951"
       x2="-23.851389"
       y2="39.142845" />
    <linearGradient
       inkscape:collect="always"
       xlink:href="#linearGradient19894"
       id="linearGradient4108"
       gradientUnits="userSpaceOnUse"
       gradientTransform="scale(1.02645,0.974232)"
       x1="-22.874170"
       y1="38.675991"
       x2="-4.3908315"
       y2="38.675991" />
    <linearGradient
       id="linearGradient2399">
      <stop
         style="stop-color:#929470;stop-opacity:1;"
         offset="0"
         id="stop2401" />
      <stop
         id="stop2407"
         offset="0.26470590"
         style="stop-color:#fcffc1;stop-opacity:1.0000000;" />
      <stop
         style="stop-color:#f3f5ba;stop-opacity:1.0000000;"
         offset="0.63235295"
         id="stop2409" />
      <stop
         style="stop-color:#929470;stop-opacity:1.0000000;"
         offset="1.0000000"
         id="stop2403" />
    </linearGradient>
    <linearGradient
       inkscape:collect="always"
       xlink:href="#linearGradient2399"
       id="linearGradient4106"
       gradientUnits="userSpaceOnUse"
       gradientTransform="matrix(0.566621,2.988977e-2,-0.118557,0.656541,36.18544,20.08311)"
       x1="-10.480865"
       y1="39.033951"
       x2="-23.851389"
       y2="39.142845" />
    <linearGradient
       id="linearGradient19894"
       gradientUnits="userSpaceOnUse"
       x1="18.995100"
       y1="37.226601"
       x2="30.169901"
       y2="37.226601">
      <stop
         offset="5.618000e-003"
         style="stop-color:#A3A349"
         id="stop19896" />
      <stop
         offset="2.078677e-002"
         style="stop-color:#ACAC54"
         id="stop19898" />
      <stop
         offset="6.600059e-002"
         style="stop-color:#C1C172"
         id="stop19900" />
      <stop
         offset="0.1148"
         style="stop-color:#D4D68E"
         id="stop19902" />
      <stop
         offset="0.1677"
         style="stop-color:#E2E4A6"
         id="stop19904" />
      <stop
         offset="0.2265"
         style="stop-color:#EDF0B8"
         id="stop19906" />
      <stop
         offset="0.2963"
         style="stop-color:#F3F6C3"
         id="stop19908" />
      <stop
         offset="0.4045"
         style="stop-color:#F5F8C7"
         id="stop19910" />
      <stop
         offset="0.5239"
         style="stop-color:#EEF0BE"
         id="stop19912" />
      <stop
         offset="0.6666"
         style="stop-color:#DBDDA9"
         id="stop19914" />
      <stop
         offset="0.8211"
         style="stop-color:#BEBD88"
         id="stop19916" />
      <stop
         offset="0.9832"
         style="stop-color:#989564"
         id="stop19918" />
      <stop
         offset="1"
         style="stop-color:#949160"
         id="stop19920" />
    </linearGradient>
    <linearGradient
       inkscape:collect="always"
       xlink:href="#linearGradient19894"
       id="linearGradient4104"
       gradientUnits="userSpaceOnUse"
       gradientTransform="matrix(0.566621,2.988977e-2,-0.118557,0.656541,36.18544,20.08311)"
       x1="-22.874170"
       y1="38.675991"
       x2="-4.3908315"
       y2="38.675991" />
    <linearGradient
       inkscape:collect="always"
       id="linearGradient3300">
      <stop
         style="stop-color:#4c4c28;stop-opacity:1;"
         offset="0"
         id="stop3302" />
      <stop
         style="stop-color:#4c4c28;stop-opacity:0;"
         offset="1"
         id="stop3304" />
    </linearGradient>
    <linearGradient
       inkscape:collect="always"
       xlink:href="#linearGradient3300"
       id="linearGradient4102"
       gradientUnits="userSpaceOnUse"
       gradientTransform="scale(1.002656,0.997352)"
       x1="24.613028"
       y1="31.146202"
       x2="24.613028"
       y2="26.739624" />
    <linearGradient
       y2="43.165"
       x2="26.4785"
       y1="43.165"
       x1="23.124"
       gradientUnits="userSpaceOnUse"
       id="aigrd1">
      <stop
         id="stop19415"
         style="stop-color:#686868"
         offset="5.618000e-003" />
      <stop
         id="stop19417"
         style="stop-color:#777777"
         offset="3.012137e-002" />
      <stop
         id="stop19419"
         style="stop-color:#929292"
         offset="8.366583e-002" />
      <stop
         id="stop19421"
         style="stop-color:#A7A7A7"
         offset="0.1422" />
      <stop
         id="stop19423"
         style="stop-color:#B6B6B6"
         offset="0.2074" />
      <stop
         id="stop19425"
         style="stop-color:#BEBEBE"
         offset="0.2846" />
      <stop
         id="stop19427"
         style="stop-color:#C1C1C1"
         offset="0.4045" />
      <stop
         id="stop19429"
         style="stop-color:#BCBCBC"
         offset="0.4962" />
      <stop
         id="stop19431"
         style="stop-color:#ADADAD"
         offset="0.6057" />
      <stop
         id="stop19433"
         style="stop-color:#959595"
         offset="0.7245" />
      <stop
         id="stop19435"
         style="stop-color:#747474"
         offset="0.8497" />
      <stop
         id="stop19437"
         style="stop-color:#494949"
         offset="0.9789" />
      <stop
         id="stop19439"
         style="stop-color:#414141"
         offset="1" />
    </linearGradient>
    <linearGradient
       id="linearGradient3957">
      <stop
         style="stop-color:#fffeff;stop-opacity:0.33333334;"
         offset="0"
         id="stop3959" />
      <stop
         style="stop-color:#fffeff;stop-opacity:0.21568628;"
         offset="1"
         id="stop3961" />
    </linearGradient>
    <linearGradient
       id="linearGradient2479">
      <stop
         style="stop-color:#ffe69b;stop-opacity:1;"
         offset="0"
         id="stop2481" />
      <stop
         style="stop-color:#ffffff;stop-opacity:1;"
         offset="1"
         id="stop2483" />
    </linearGradient>
    <linearGradient
       id="linearGradient2536">
      <stop
         style="stop-color:#a40000;stop-opacity:1;"
         offset="0"
         id="stop2538" />
      <stop
         style="stop-color:#ff1717;stop-opacity:1;"
         offset="1"
         id="stop2540" />
    </linearGradient>
    <linearGradient
       id="linearGradient2102">
      <stop
         style="stop-color:#000000;stop-opacity:1;"
         offset="0"
         id="stop2104" />
      <stop
         style="stop-color:#000000;stop-opacity:0.83974361;"
         offset="1"
         id="stop2106" />
    </linearGradient>
    <linearGradient
       id="linearGradient3068">
      <stop
         style="stop-color:#cccccc;stop-opacity:1.0000000;"
         offset="0.0000000"
         id="stop3070" />
      <stop
         id="stop3076"
         offset="0.34579438"
         style="stop-color:#ffffff;stop-opacity:1.0000000;" />
      <stop
         style="stop-color:#ffffff;stop-opacity:1.0000000;"
         offset="0.72486681"
         id="stop3078" />
      <stop
         style="stop-color:#cecece;stop-opacity:1.0000000;"
         offset="1.0000000"
         id="stop3072" />
    </linearGradient>
    <linearGradient
       id="linearGradient2291">
      <stop
         style="stop-color:#ffa107;stop-opacity:1;"
         offset="0"
         id="stop2293" />
      <stop
         style="stop-color:#6b511c;stop-opacity:1;"
         offset="1"
         id="stop2295" />
    </linearGradient>
    <linearGradient
       id="linearGradient8650"
       inkscape:collect="always">
      <stop
         id="stop8652"
         offset="0"
         style="stop-color:#ffffff;stop-opacity:1;" />
      <stop
         id="stop8654"
         offset="1"
         style="stop-color:#ffffff;stop-opacity:0;" />
    </linearGradient>
    <radialGradient
       inkscape:collect="always"
       xlink:href="#linearGradient8650"
       id="radialGradient2346"
       gradientUnits="userSpaceOnUse"
       gradientTransform="matrix(0.6527956,-0.134968,-0.6544091,-1.0088161,-12.066844,13.91704)"
       cx="27.524414"
       cy="-4.8309631"
       fx="27.524414"
       fy="-4.8309631"
       r="17.171415" />
    <radialGradient
       inkscape:collect="always"
       xlink:href="#linearGradient8650"
       id="radialGradient2412"
       gradientUnits="userSpaceOnUse"
       gradientTransform="matrix(0.402672,-0.3668821,-0.7248088,-0.4910705,-22.379852,16.8144)"
       cx="25.003445"
       cy="14.860912"
       fx="25.003445"
       fy="14.860912"
       r="17.171415" />
    <linearGradient
       inkscape:collect="always"
       xlink:href="#aigrd1"
       id="linearGradient2665"
       gradientUnits="userSpaceOnUse"
       gradientTransform="matrix(0.7177589,0,0,0.6220723,0.1995682,-7.1843846)"
       x1="23.124"
       y1="43.165"
       x2="26.4785"
       y2="43.165" />
    <linearGradient
       inkscape:collect="always"
       xlink:href="#linearGradient6339"
       id="linearGradient2684"
       gradientUnits="userSpaceOnUse"
       gradientTransform="matrix(0.443064,0,0,0.3009588,8.5612473,1.8011858)"
       x1="16.998856"
       y1="10.061084"
       x2="32.096882"
       y2="36.726292" />
    <linearGradient
       inkscape:collect="always"
       xlink:href="#linearGradient3175"
       id="linearGradient2703"
       gradientUnits="userSpaceOnUse"
       gradientTransform="matrix(0.3092977,0,0,0.3627378,9.9870797,3.7813911)"
       x1="37.940434"
       y1="16.651863"
       x2="-5.2517161"
       y2="3.8557322" />
    <radialGradient
       inkscape:collect="always"
       xlink:href="#aigrd7"
       id="radialGradient2706"
       gradientUnits="userSpaceOnUse"
       gradientTransform="matrix(0.2141675,0,0,0.306963,4.3381631,4.5564094)"
       cx="68.137589"
       cy="29.869318"
       fx="68.137589"
       fy="29.869318"
       r="33.934090" />
    <linearGradient
       inkscape:collect="always"
       xlink:href="#linearGradient3311"
       id="linearGradient2709"
       gradientUnits="userSpaceOnUse"
       gradientTransform="matrix(0.6229112,0,0,0.2201524,8.6507955,3.157981)"
       x1="17.879995"
       y1="55.362793"
       x2="11.906206"
       y2="54.863026" />
    <linearGradient
       inkscape:collect="always"
       xlink:href="#linearGradient3265"
       id="linearGradient2711"
       gradientUnits="userSpaceOnUse"
       gradientTransform="matrix(-0.3518611,-1.7576081e-2,7.3621652e-2,-0.3860658,8.6507955,3.157981)"
       x1="-29.007195"
       y1="-29.799353"
       x2="-37.641232"
       y2="-29.598314" />
    <linearGradient
       inkscape:collect="always"
       xlink:href="#linearGradient8547"
       id="linearGradient8545"
       x1="18.84375"
       y1="20.5625"
       x2="17.625"
       y2="10.8125"
       gradientUnits="userSpaceOnUse"
       gradientTransform="matrix(0.9786437,0,0,0.9772903,0.4836088,-2.5157889)" />
    <linearGradient
       inkscape:collect="always"
       xlink:href="#linearGradient3311"
       id="linearGradient5907"
       gradientUnits="userSpaceOnUse"
       gradientTransform="matrix(0.6229112,0,0,0.2201524,20.119546,6.314231)"
       x1="17.879995"
       y1="55.362793"
       x2="11.906206"
       y2="54.863026" />
    <linearGradient
       inkscape:collect="always"
       xlink:href="#linearGradient3265"
       id="linearGradient5909"
       gradientUnits="userSpaceOnUse"
       gradientTransform="matrix(-0.3518611,-1.7576081e-2,7.3621652e-2,-0.3860658,20.119546,6.314231)"
       x1="-29.007195"
       y1="-29.799353"
       x2="-37.641232"
       y2="-29.598314" />
  </defs>
  <sodipodi:namedview
     inkscape:cy="14.841112"
     inkscape:cx="19.334838"
     inkscape:zoom="1"
     inkscape:window-height="873"
     inkscape:window-width="990"
     inkscape:pageshadow="2"
     inkscape:pageopacity="0.0"
     guidetolerance="10.0"
     gridtolerance="10.0"
     objecttolerance="10.0"
     borderopacity="1.0"
     bordercolor="#666666"
     pagecolor="#ffffff"
     id="base"
     width="24px"
     height="24px"
     showgrid="true"
     inkscape:window-x="284"
     inkscape:window-y="32"
     inkscape:current-layer="layer2"
     inkscape:object-paths="false"
     inkscape:grid-bbox="false"
     inkscape:guide-bbox="true"
     showguides="true" />
  <path
     style="fill:none;fill-opacity:0.75;fill-rule:evenodd;stroke:#000000;stroke-width:0.25pt;stroke-linecap:butt;stroke-linejoin:miter;stroke-opacity:1"
     d="M -6.84375,-38.732787 L -6.84375,-38.732787 z "
     id="path2230" />
  <g
     inkscape:groupmode="layer"
     id="layer1"
     inkscape:label="arrow">
    <path
       style="opacity:1;color:#000000;fill:#3465a4;fill-opacity:1;fill-rule:evenodd;stroke:#616471;stroke-width:1.00000024;stroke-linecap:round;stroke-linejoin:round;marker:none;marker-start:none;marker-mid:none;marker-end:none;stroke-miterlimit:10;stroke-dasharray:none;stroke-dashoffset:0;stroke-opacity:1;visibility:visible;display:inline;overflow:visible"
       d="M 2.5269517,7.5000003 L 2.4658081,11.595356 L 0.50000016,11.595356 L 0.53068787,17.54186 L 2.5269517,17.604873 L 2.5269517,21.5 L 12.500001,14.531686 L 2.5269517,7.5000003 z "
       id="path18242"
       sodipodi:nodetypes="cccccccc" />
    <path
       style="opacity:0.48128339;color:#000000;fill:#3465a4;fill-opacity:1;fill-rule:evenodd;stroke:#ffffff;stroke-width:1.00000024;stroke-linecap:butt;stroke-linejoin:miter;marker:none;marker-start:none;marker-mid:none;marker-end:none;stroke-miterlimit:10;stroke-dasharray:none;stroke-dashoffset:0;stroke-opacity:1;visibility:visible;display:inline;overflow:visible"
       d="M 1.5737235,12.632352 L 1.5522211,16.603477 L 3.6028451,16.575469 L 3.5715951,19.512609 L 10.819717,14.537368 L 3.5277444,9.427437 L 3.5421657,12.601262 L 1.5737235,12.632352 z "
       id="path8658"
       sodipodi:nodetypes="cccccccc" />
    <path
       sodipodi:nodetypes="cccccc"
       id="path8645"
       d="M 3.1032838,8.629458 L 2.9997443,12.059851 L 1.1703663,12.268696 L 1.2763632,14.423064 C 6.6319742,13.53734 7.9251506,14.806059 11.405454,14.480813 L 3.1032838,8.629458 z "
       style="opacity:0.5080214;color:#000000;fill:url(#radialGradient3364);fill-opacity:1;fill-rule:evenodd;stroke:none;stroke-width:1;stroke-linecap:round;stroke-linejoin:round;marker:none;marker-start:none;marker-mid:none;marker-end:none;stroke-miterlimit:10;stroke-dasharray:none;stroke-dashoffset:0;stroke-opacity:1;visibility:visible;display:inline;overflow:visible" />
  </g>
  <g
     inkscape:groupmode="layer"
     id="layer2"
     inkscape:label="bulb">
    <path
       style="fill:url(#linearGradient2665);fill-rule:nonzero;stroke:#565656;stroke-width:1.00427914;stroke-miterlimit:4;stroke-opacity:1"
       d="M 16.779808,18.880471 L 16.779808,19.440336 C 16.779808,20.000201 17.354016,20.49786 17.999999,20.49786 C 18.645983,20.49786 19.22019,20.000201 19.22019,19.440336 L 19.22019,18.880471 L 16.779808,18.880471 z "
       id="path19509"
       inkscape:r_cx="true"
       inkscape:r_cy="true" />
    <g
       id="g3173"
       transform="matrix(0.4025812,0,0,0.4022097,8.0649387,2.892335)"
       inkscape:r_cx="true"
       inkscape:r_cy="true">
      <path
         style="color:#000000;fill:#aeae57;fill-opacity:1;fill-rule:nonzero;stroke:url(#linearGradient4102);stroke-width:4.97023773;stroke-linecap:round;stroke-linejoin:round;marker:none;marker-start:none;marker-mid:none;marker-end:none;stroke-miterlimit:4;stroke-dashoffset:0;stroke-opacity:1;visibility:visible;display:inline;overflow:visible"
         d="M 24.511725,27.668867 C 21.208844,27.660897 17.463275,28.632054 19.492913,30.467931 C 18.98969,30.670934 18.270371,31.124313 18.355167,32.185222 C 18.401983,32.739286 18.989243,33.079394 19.79236,33.32911 C 18.881908,33.967722 18.302581,34.642557 18.355167,35.264921 C 18.401438,35.812525 18.976334,36.187531 19.76303,36.43814 C 18.875519,37.069403 18.303301,37.760121 18.355167,38.373951 C 18.434436,39.312088 20.457743,40.362928 24.838928,40.2419 C 27.993329,40.155914 30.776913,39.590514 30.996599,38.373951 C 31.082862,37.896248 30.691907,37.450531 30.087355,37.05408 C 30.539926,36.597918 30.85698,36.135242 30.820616,35.704878 C 30.774128,35.154694 30.205993,34.781923 29.412754,34.53166 C 30.300265,33.900397 30.872482,33.209679 30.820616,32.595849 C 30.774128,32.045664 30.205993,31.702225 29.412754,31.45196 C 30.310848,30.817288 30.872816,30.133928 30.820616,29.516149 C 30.762593,28.829446 27.61599,27.676358 24.511725,27.668867 z "
         id="path3209"
         sodipodi:nodetypes="cccccccscccccccs"
         inkscape:r_cx="true"
         inkscape:r_cy="true" />
      <path
         style="color:#000000;fill:url(#linearGradient4104);fill-opacity:1;fill-rule:nonzero;stroke:url(#linearGradient4106);stroke-width:0.21940865;stroke-linecap:round;stroke-linejoin:round;marker:none;marker-start:none;marker-mid:none;marker-end:none;stroke-miterlimit:4;stroke-dashoffset:0;stroke-opacity:1;visibility:visible;display:inline;overflow:visible"
         d="M 30.920208,38.329767 C 30.700522,39.546331 27.591422,40.232861 22.615132,39.983673 C 19.463507,39.825856 19.283163,38.944055 19.502848,37.727491 C 19.722534,36.510926 22.458318,35.65848 25.609509,35.824708 C 28.7607,35.990936 31.139893,37.113203 30.920208,38.329767 z "
         id="path3183"
         sodipodi:nodetypes="csccc"
         inkscape:r_cx="true"
         inkscape:r_cy="true" />
      <path
         transform="matrix(0.60274,-0.128625,6.428372e-2,0.760788,31.12021,14.49141)"
         d="M -3.5355339 27.228739 A 10.341436 3.2703688 0 1 1  -24.218407,27.228739 A 10.341436 3.2703688 0 1 1  -3.5355339 27.228739 z"
         sodipodi:ry="3.2703688"
         sodipodi:rx="10.341436"
         sodipodi:cy="27.228739"
         sodipodi:cx="-13.87697"
         id="path1603"
         style="color:#000000;fill:url(#linearGradient4108);fill-opacity:1;fill-rule:nonzero;stroke:url(#linearGradient4110);stroke-width:0.32112673;stroke-linecap:round;stroke-linejoin:round;marker:none;marker-start:none;marker-mid:none;marker-end:none;stroke-miterlimit:4;stroke-dashoffset:0;stroke-opacity:1;visibility:visible;display:inline;overflow:visible"
         sodipodi:type="arc"
         inkscape:r_cx="true"
         inkscape:r_cy="true" />
      <path
         sodipodi:type="arc"
         style="color:#000000;fill:url(#linearGradient4112);fill-opacity:1;fill-rule:nonzero;stroke:url(#linearGradient4114);stroke-width:0.32112673;stroke-linecap:round;stroke-linejoin:round;marker:none;marker-start:none;marker-mid:none;marker-end:none;stroke-miterlimit:4;stroke-dashoffset:0;stroke-opacity:1;visibility:visible;display:inline;overflow:visible"
         id="path2364"
         sodipodi:cx="-13.87697"
         sodipodi:cy="27.228739"
         sodipodi:rx="10.341436"
         sodipodi:ry="3.2703688"
         d="M -3.5355339 27.228739 A 10.341436 3.2703688 0 1 1  -24.218407,27.228739 A 10.341436 3.2703688 0 1 1  -3.5355339 27.228739 z"
         transform="matrix(0.60274,-0.128625,6.428372e-2,0.760788,31.12021,11.39591)"
         inkscape:r_cx="true"
         inkscape:r_cy="true" />
      <path
         style="color:#000000;fill:url(#linearGradient4116);fill-opacity:1;fill-rule:nonzero;stroke:url(#linearGradient4118);stroke-width:0.21940875;stroke-linecap:round;stroke-linejoin:round;marker:none;marker-start:none;marker-mid:none;marker-end:none;stroke-miterlimit:4;stroke-dashoffset:0;stroke-opacity:1;visibility:visible;display:inline;overflow:visible"
         d="M 30.698087,29.636386 C 30.698087,31.014688 28.157326,32.55444 24.716601,33.288693 C 21.275876,34.022945 18.38922,33.50421 18.273172,32.130802 C 18.157124,30.757395 20.509679,29.155466 23.952388,28.968827 C 27.422379,28.780711 30.698087,28.924901 30.698087,29.636386 z "
         id="path2366"
         sodipodi:nodetypes="cccss"
         inkscape:r_cx="true"
         inkscape:r_cy="true" />
      <path
         sodipodi:type="arc"
         style="color:#000000;fill:#ffffff;fill-opacity:1;fill-rule:nonzero;stroke:none;stroke-width:2;stroke-linecap:butt;stroke-linejoin:round;marker:none;marker-start:none;marker-mid:none;marker-end:none;stroke-miterlimit:4;stroke-dashoffset:0;stroke-opacity:1;visibility:visible;display:inline;overflow:visible"
         id="path20372"
         sodipodi:cx="27.75"
         sodipodi:cy="22.375"
         sodipodi:rx="3.25"
         sodipodi:ry="3.25"
         d="M 31 22.375 A 3.25 3.25 0 1 1  24.5,22.375 A 3.25 3.25 0 1 1  31 22.375 z"
         transform="matrix(0.335464,0,0,0.335464,11.74678,27.2261)"
         inkscape:r_cx="true"
         inkscape:r_cy="true" />
      <path
         style="fill:#000000;fill-opacity:0.23391807;fill-rule:evenodd;stroke:none;stroke-width:1px;stroke-linecap:butt;stroke-linejoin:miter;stroke-opacity:1"
         d="M 19.342183,33.378865 C 22.736592,33.883533 26.320992,33.346192 29.214315,31.470807 C 30.025582,30.944962 30.147604,30.343945 30.520921,29.873844 C 29.09679,31.000705 25.494982,34.035625 19.342183,33.378865 z "
         id="path3241"
         sodipodi:nodetypes="cscc"
         inkscape:r_cx="true"
         inkscape:r_cy="true" />
      <path
         transform="matrix(0.335464,0,0,0.335464,11.74678,30.23376)"
         d="M 31 22.375 A 3.25 3.25 0 1 1  24.5,22.375 A 3.25 3.25 0 1 1  31 22.375 z"
         sodipodi:ry="3.25"
         sodipodi:rx="3.25"
         sodipodi:cy="22.375"
         sodipodi:cx="27.75"
         id="path2435"
         style="color:#000000;fill:#ffffff;fill-opacity:1;fill-rule:nonzero;stroke:none;stroke-width:2;stroke-linecap:butt;stroke-linejoin:round;marker:none;marker-start:none;marker-mid:none;marker-end:none;stroke-miterlimit:4;stroke-dashoffset:0;stroke-opacity:1;visibility:visible;display:inline;overflow:visible"
         sodipodi:type="arc"
         inkscape:r_cx="true"
         inkscape:r_cy="true" />
      <path
         style="fill:#000000;fill-opacity:0.23391807;fill-rule:evenodd;stroke:none;stroke-width:1px;stroke-linecap:butt;stroke-linejoin:miter;stroke-opacity:1"
         d="M 19.466621,39.517838 C 22.86103,40.022506 26.44543,39.485165 29.338753,37.60978 C 30.15002,37.083935 30.272043,36.482919 30.645359,36.012817 C 29.221228,37.139678 25.61942,40.174598 19.466621,39.517838 z "
         id="path3237"
         sodipodi:nodetypes="cscc"
         inkscape:r_cx="true"
         inkscape:r_cy="true" />
      <path
         sodipodi:nodetypes="cscc"
         id="path3239"
         d="M 19.487361,36.406872 C 22.88177,36.91154 26.46617,36.374199 29.359492,34.498814 C 30.17076,33.972969 30.292782,33.371953 30.666099,32.901851 C 29.241968,34.028712 25.64016,37.063632 19.487361,36.406872 z "
         style="fill:#000000;fill-opacity:0.23391807;fill-rule:evenodd;stroke:none;stroke-width:1px;stroke-linecap:butt;stroke-linejoin:miter;stroke-opacity:1"
         inkscape:r_cx="true"
         inkscape:r_cy="true" />
    </g>
    <path
       inkscape:r_cy="true"
       inkscape:r_cx="true"
       style="color:#000000;fill:url(#radialGradient2706);fill-opacity:1;fill-rule:nonzero;stroke:#616471;stroke-width:0.98750019;stroke-linecap:round;stroke-linejoin:round;marker:none;marker-start:none;marker-mid:none;marker-end:none;stroke-miterlimit:4;stroke-dashoffset:0;stroke-opacity:1;visibility:visible;display:inline;overflow:visible"
       d="M 18,3.4937001 C 14.961271,3.4937001 12.493717,5.8879729 12.493717,8.8364591 C 12.493717,11.858893 14.724226,12.193639 14.724226,13.307544 C 14.724226,14.616312 16.156971,15.194169 18.307312,15.140596 C 20.593872,15.08363 21.412508,14.699098 21.412508,13.307544 C 21.412508,12.117842 23.506283,12.086116 23.506283,8.8364591 C 23.506283,5.8879729 21.038731,3.4937001 18,3.4937001 z "
       id="path6305"
       sodipodi:nodetypes="csssssc" />
    <path
       inkscape:r_cy="true"
       inkscape:r_cx="true"
       sodipodi:nodetypes="csssssc"
       id="path2429"
       d="M 18.000001,4.482109 C 15.478232,4.482109 13.17868,6.5449174 13.430468,9.0571274 C 13.680468,11.551496 15.516086,11.675186 15.584266,12.626586 C 15.678016,13.934787 16.460026,14.248748 18.245048,14.2314 C 20.017609,14.213869 20.466709,14.036927 20.529209,12.626586 C 20.574311,11.608841 22.569535,11.839817 22.569535,9.0571274 C 22.569535,6.5323311 20.521771,4.482109 18.000001,4.482109 z "
       style="color:#000000;fill:none;fill-opacity:1;fill-rule:nonzero;stroke:url(#linearGradient2703);stroke-width:0.92033792;stroke-linecap:round;stroke-linejoin:round;marker:none;marker-start:none;marker-mid:none;marker-end:none;stroke-miterlimit:4;stroke-dashoffset:0;stroke-opacity:1;visibility:visible;display:inline;overflow:visible" />
    <path
       inkscape:r_cy="true"
       inkscape:r_cx="true"
       style="opacity:0.5977654;color:#000000;fill:url(#linearGradient2684);fill-opacity:1;fill-rule:nonzero;stroke:none;stroke-width:0.98750001;stroke-linecap:round;stroke-linejoin:round;marker:none;marker-start:none;marker-mid:none;marker-end:none;stroke-miterlimit:4;stroke-dashoffset:0;stroke-opacity:1;visibility:visible;display:inline;overflow:visible"
       d="M 18.168007,4.0150165 C 15.734716,4.0150165 13.760343,5.323372 13.760343,6.9347038 C 13.760343,7.5782579 14.140109,8.1417589 14.673533,8.6244865 C 15.276718,8.829847 15.933705,8.9774162 16.658199,8.9774162 C 19.09149,8.9774162 21.065862,7.6690607 21.065863,6.0577278 C 21.065863,5.4102934 20.679786,4.8415238 20.140497,4.357251 C 19.540125,4.1543242 18.887901,4.0150164 18.168007,4.0150165 z "
       id="path6334" />
    <path
       style="fill:none;fill-opacity:1;fill-rule:evenodd;stroke:url(#linearGradient8545);stroke-width:0.99999994;stroke-linecap:round;stroke-linejoin:round;stroke-miterlimit:4;stroke-dasharray:none;stroke-opacity:1"
       d="M 16.965636,13.683379 L 15.927829,9.8225014 C 17.589484,10.504568 18.761818,10.087183 19.995316,9.3949364 L 19.041249,13.688347"
       id="path3682"
       sodipodi:nodetypes="cccc" />
  </g>
</svg>
