<?xml version="1.0" encoding="UTF-8" standalone="no"?>
<!-- Created with Inkscape (http://www.inkscape.org/) -->
<svg
   xmlns:dc="http://purl.org/dc/elements/1.1/"
   xmlns:cc="http://web.resource.org/cc/"
   xmlns:rdf="http://www.w3.org/1999/02/22-rdf-syntax-ns#"
   xmlns:svg="http://www.w3.org/2000/svg"
   xmlns="http://www.w3.org/2000/svg"
   xmlns:xlink="http://www.w3.org/1999/xlink"
   xmlns:sodipodi="http://sodipodi.sourceforge.net/DTD/sodipodi-0.dtd"
   xmlns:inkscape="http://www.inkscape.org/namespaces/inkscape"
   width="24"
   height="24"
   id="svg2239"
   sodipodi:version="0.32"
   inkscape:version="0.45.1"
   sodipodi:docbase="/home/maker/icons/anjuta-new2/smallsvg"
   sodipodi:docname="anjuta-complete.svg"
   inkscape:output_extension="org.inkscape.output.svg.inkscape"
   version="1.0"
   inkscape:export-filename="/home/maker/icons/anjuta-new2/smallsvg/anjuta-complete-16.png"
   inkscape:export-xdpi="60"
   inkscape:export-ydpi="60">
  <defs
     id="defs2241">
    <linearGradient
       id="linearGradient5157">
      <stop
         style="stop-color:#555753"
         offset="0"
         id="stop5159" />
      <stop
         style="stop-color:#555753;stop-opacity:0;"
         offset="1"
         id="stop5161" />
    </linearGradient>
    <linearGradient
       id="linearGradient8650"
       inkscape:collect="always">
      <stop
         id="stop8652"
         offset="0"
         style="stop-color:#ffffff;stop-opacity:1;" />
      <stop
         id="stop8654"
         offset="1"
         style="stop-color:#ffffff;stop-opacity:0;" />
    </linearGradient>
    <linearGradient
       id="linearGradient12512">
      <stop
         id="stop12513"
         offset="0.0000000"
         style="stop-color:#ffffff;stop-opacity:1.0000000;" />
      <stop
         id="stop12517"
         offset="0.50000000"
         style="stop-color:#fff520;stop-opacity:0.89108908;" />
      <stop
         id="stop12514"
         offset="1.0000000"
         style="stop-color:#fff300;stop-opacity:0.0000000;" />
    </linearGradient>
    <linearGradient
       id="linearGradient15662">
      <stop
         id="stop15664"
         offset="0.0000000"
         style="stop-color:#ffffff;stop-opacity:1.0000000;" />
      <stop
         id="stop15666"
         offset="1.0000000"
         style="stop-color:#f8f8f8;stop-opacity:1.0000000;" />
    </linearGradient>
    <linearGradient
       id="linearGradient259">
      <stop
         id="stop260"
         offset="0.0000000"
         style="stop-color:#fafafa;stop-opacity:1.0000000;" />
      <stop
         id="stop261"
         offset="1.0000000"
         style="stop-color:#bbbbbb;stop-opacity:1.0000000;" />
    </linearGradient>
    <linearGradient
       id="linearGradient2896">
      <stop
         style="stop-color:#000000;stop-opacity:1;"
         offset="0"
         id="stop2898" />
      <stop
         style="stop-color:#000000;stop-opacity:0;"
         offset="1"
         id="stop2900" />
    </linearGradient>
    <linearGradient
       inkscape:collect="always"
       xlink:href="#linearGradient2896"
       id="linearGradient2512"
       gradientUnits="userSpaceOnUse"
       gradientTransform="matrix(0.3527177,0,0,0.3968935,-0.5823082,0.599503)"
       x1="14.584077"
       y1="1.6392649"
       x2="14.331437"
       y2="4.5285392" />
    <linearGradient
       inkscape:collect="always"
       id="linearGradient2906">
      <stop
         style="stop-color:#ffffff;stop-opacity:1;"
         offset="0"
         id="stop2908" />
      <stop
         style="stop-color:#ffffff;stop-opacity:0;"
         offset="1"
         id="stop2910" />
    </linearGradient>
    <linearGradient
       inkscape:collect="always"
       xlink:href="#linearGradient2906"
       id="linearGradient2510"
       gradientUnits="userSpaceOnUse"
       gradientTransform="matrix(0.5,0,0,0.4723736,-2.6820192,-6.5701006e-3)"
       x1="13.354311"
       y1="1.4866425"
       x2="14.075844"
       y2="2.4017651" />
    <linearGradient
       id="linearGradient2590">
      <stop
         style="stop-color:#ffffff;stop-opacity:1;"
         offset="0"
         id="stop2592" />
      <stop
         style="stop-color:#ffffff;stop-opacity:0;"
         offset="1"
         id="stop2594" />
    </linearGradient>
    <linearGradient
       inkscape:collect="always"
       xlink:href="#linearGradient2590"
       id="linearGradient2508"
       gradientUnits="userSpaceOnUse"
       gradientTransform="matrix(0.5250247,0,0,0.4723945,-2.9619942,0.4411996)"
       x1="19.970377"
       y1="6.1167107"
       x2="19.970377"
       y2="2.53125" />
    <linearGradient
       id="linearGradient5897">
      <stop
         style="stop-color:#000000;stop-opacity:0.0000000;"
         offset="0.0000000"
         id="stop5899" />
      <stop
         id="stop5905"
         offset="0.50000000"
         style="stop-color:#000000;stop-opacity:0.56701028;" />
      <stop
         style="stop-color:#000000;stop-opacity:0.0000000;"
         offset="1.0000000"
         id="stop5901" />
    </linearGradient>
    <linearGradient
       inkscape:collect="always"
       xlink:href="#linearGradient5897"
       id="linearGradient2506"
       gradientUnits="userSpaceOnUse"
       gradientTransform="matrix(0.6652988,0,0,0.8507738,-5.1693306,-6.566651)"
       x1="19"
       y1="9.7738247"
       x2="19"
       y2="15.635596" />
    <linearGradient
       inkscape:collect="always"
       id="linearGradient4404">
      <stop
         style="stop-color:#ffffff;stop-opacity:1;"
         offset="0"
         id="stop4406" />
      <stop
         style="stop-color:#ffffff;stop-opacity:0;"
         offset="1"
         id="stop4408" />
    </linearGradient>
    <linearGradient
       inkscape:collect="always"
       xlink:href="#linearGradient4404"
       id="linearGradient2504"
       gradientUnits="userSpaceOnUse"
       gradientTransform="matrix(-0.6597745,0,0,0.543039,17.468052,0.13928)"
       x1="16.8125"
       y1="1.875"
       x2="16.8125"
       y2="4.71875" />
    <linearGradient
       id="linearGradient2598">
      <stop
         style="stop-color:#a9382d;stop-opacity:1;"
         offset="0"
         id="stop2600" />
      <stop
         style="stop-color:#f04646;stop-opacity:1;"
         offset="1"
         id="stop2602" />
    </linearGradient>
    <linearGradient
       inkscape:collect="always"
       xlink:href="#linearGradient2598"
       id="linearGradient2502"
       gradientUnits="userSpaceOnUse"
       gradientTransform="matrix(0.6597745,0,0,0.5179028,-4.2351199,-0.249086)"
       x1="18.431311"
       y1="19.119474"
       x2="18.402472"
       y2="4.2702327" />
    <linearGradient
       inkscape:collect="always"
       id="linearGradient5866">
      <stop
         style="stop-color:#000000;stop-opacity:1;"
         offset="0"
         id="stop5868" />
      <stop
         style="stop-color:#000000;stop-opacity:0;"
         offset="1"
         id="stop5870" />
    </linearGradient>
    <linearGradient
       inkscape:collect="always"
       xlink:href="#linearGradient5866"
       id="linearGradient2500"
       gradientUnits="userSpaceOnUse"
       gradientTransform="matrix(0.6121275,0,0,0.4819191,-2.4962352,1.098222)"
       x1="19.452349"
       y1="13.174174"
       x2="19.685436"
       y2="27.095339" />
    <radialGradient
       inkscape:collect="always"
       xlink:href="#linearGradient8650"
       id="radialGradient2669"
       gradientUnits="userSpaceOnUse"
       gradientTransform="matrix(0.2936405,0.1109764,-6.9704362e-2,-0.2160035,4.5725205,14.888519)"
       cx="17.421288"
       cy="8.2095308"
       fx="17.421288"
       fy="8.2095308"
       r="17.171415" />
    <radialGradient
       inkscape:collect="always"
       xlink:href="#linearGradient12512"
       id="radialGradient2678"
       gradientUnits="userSpaceOnUse"
       gradientTransform="matrix(-1.1340151,-1.193205e-6,-7.9650437e-8,-1.1992054,117.37084,274.90072)"
       cx="55"
       cy="125"
       fx="55"
       fy="125"
       r="14.375" />
  </defs>
  <sodipodi:namedview
     id="base"
     pagecolor="#ffffff"
     bordercolor="#666666"
     borderopacity="1.0"
     inkscape:pageopacity="0.0"
     inkscape:pageshadow="2"
     inkscape:zoom="16"
     inkscape:cx="22.09375"
     inkscape:cy="8.3896716"
     inkscape:current-layer="layer1"
     showgrid="true"
     inkscape:grid-bbox="false"
     inkscape:document-units="px"
     inkscape:window-width="1027"
     inkscape:window-height="830"
     inkscape:window-x="86"
     inkscape:window-y="166"
     width="24px"
     height="24px"
     showguides="true"
     inkscape:guide-bbox="false"
     inkscape:object-paths="false" />
  <metadata
     id="metadata2244">
    <rdf:RDF>
      <cc:Work
         rdf:about="">
        <dc:format>image/svg+xml</dc:format>
        <dc:type
           rdf:resource="http://purl.org/dc/dcmitype/StillImage" />
        <cc:license
           rdf:resource="http://creativecommons.org/licenses/LGPL/2.1/" />
      </cc:Work>
      <cc:License
         rdf:about="http://creativecommons.org/licenses/LGPL/2.1/">
        <cc:permits
           rdf:resource="http://web.resource.org/cc/Reproduction" />
        <cc:permits
           rdf:resource="http://web.resource.org/cc/Distribution" />
        <cc:requires
           rdf:resource="http://web.resource.org/cc/Notice" />
        <cc:permits
           rdf:resource="http://web.resource.org/cc/DerivativeWorks" />
        <cc:requires
           rdf:resource="http://web.resource.org/cc/ShareAlike" />
        <cc:requires
           rdf:resource="http://web.resource.org/cc/SourceCode" />
      </cc:License>
    </rdf:RDF>
  </metadata>
  <g
     id="layer1"
     inkscape:label="base"
     inkscape:groupmode="layer">
    <path
       style="fill:none;fill-opacity:0.75;fill-rule:evenodd;stroke:#5c3566;stroke-width:3.00000024;stroke-linecap:square;stroke-linejoin:miter;stroke-miterlimit:4;stroke-dasharray:none;stroke-opacity:1"
       d="M 1.4739704,12.518306 L 1.5316609,12.518306"
       id="path4286"
       sodipodi:nodetypes="cc" />
    <path
       style="fill:#5c3566;fill-opacity:1;fill-rule:evenodd;stroke:#050401;stroke-width:0;stroke-linecap:butt;stroke-linejoin:miter;stroke-miterlimit:4;stroke-dasharray:none;stroke-opacity:1"
       d="M 15.009023,18.021828 L 24.038071,12.570721 L 14.973192,7.0147842 L 15.009023,18.021828 z "
       id="path2190"
       sodipodi:nodetypes="cccc" />
    <path
       sodipodi:nodetypes="cc"
       id="path4292"
       d="M 11.517018,12.518306 L 11.817933,12.518306"
       style="fill:none;fill-opacity:0.75;fill-rule:evenodd;stroke:#5c3566;stroke-width:3.00000024;stroke-linecap:square;stroke-linejoin:miter;stroke-miterlimit:4;stroke-dasharray:none;stroke-opacity:1" />
    <path
       sodipodi:nodetypes="cc"
       id="path4294"
       d="M 6.4679121,12.518306 L 6.5256026,12.518306"
       style="fill:none;fill-opacity:0.75;fill-rule:evenodd;stroke:#5c3566;stroke-width:3.00000024;stroke-linecap:square;stroke-linejoin:miter;stroke-miterlimit:4;stroke-dasharray:none;stroke-opacity:1" />
  </g>
</svg>
