<?xml version="1.0" encoding="UTF-8" standalone="no"?>
<!-- Created with Inkscape (http://www.inkscape.org/) -->
<svg
   xmlns:dc="http://purl.org/dc/elements/1.1/"
   xmlns:cc="http://web.resource.org/cc/"
   xmlns:rdf="http://www.w3.org/1999/02/22-rdf-syntax-ns#"
   xmlns:svg="http://www.w3.org/2000/svg"
   xmlns="http://www.w3.org/2000/svg"
   xmlns:xlink="http://www.w3.org/1999/xlink"
   xmlns:sodipodi="http://sodipodi.sourceforge.net/DTD/sodipodi-0.dtd"
   xmlns:inkscape="http://www.inkscape.org/namespaces/inkscape"
   version="1.0"
   width="42"
   height="50"
   id="svg2"
   sodipodi:version="0.32"
   inkscape:version="0.45"
   sodipodi:docname="background.svg"
   sodipodi:docbase="/home/aseigo/kde4/KDE/kdebase/workspace/plasma/desktoptheme/widgets"
   inkscape:output_extension="org.inkscape.output.svg.inkscape"
   sodipodi:modified="true">
  <metadata
     id="metadata2480">
    <rdf:RDF>
      <cc:Work
         rdf:about="">
        <dc:format>image/svg+xml</dc:format>
        <dc:type
           rdf:resource="http://purl.org/dc/dcmitype/StillImage" />
      </cc:Work>
    </rdf:RDF>
  </metadata>
  <sodipodi:namedview
     inkscape:window-height="572"
     inkscape:window-width="748"
     inkscape:pageshadow="2"
     inkscape:pageopacity="0.0"
     guidetolerance="10.0"
     gridtolerance="10.0"
     objecttolerance="10.0"
     borderopacity="1.0"
     bordercolor="#666666"
     pagecolor="#ffffff"
     id="base"
     inkscape:zoom="5.6568542"
     inkscape:cx="21"
     inkscape:cy="25"
     inkscape:window-x="461"
     inkscape:window-y="189"
     inkscape:current-layer="svg2" />
  <defs
     id="defs5" />
  <image
     xlink:href="data:image/png;base64,iVBORw0KGgoAAAANSUhEUgAAABQAAAAZCAYAAAAxFw7TAAAABHNCSVQICAgIfAhkiAAAAAlwSFlz AAAN1wAADdcBQiibeAAAABl0RVh0U29mdHdhcmUAd3d3Lmlua3NjYXBlLm9yZ5vuPBoAAAJ3SURB VDiNrZS7ThwxFIb/Yx/PhdVILJEiVgRBwUpQUESR8gIU2TegpEtPmZ5HoKGkSZsUiZR3QLRRlDQp aDYbCFp2ZmfnYqdYG5xhACFi6dfcfD7/5xx7CICBN8IwrPb3978kSXIRRdGUmSsiMkRkhBCamasw DIu9vb13RPQKwBhACmAKIBdojKWlpbT57jHjFnB7e3v434Cbm5uX/X7/8ilAVkqZbrdbbm1tXW1s bJwD0ESkicg8GN0G3N3d/W0BJRFpIUT9FKCwwbUQopRSFsxc2M5qItKPdkhEpRCiZOYpM2dKqSkz F1LKmoge7ZCVUhMpZaGUyuI4HkdRlCmlZhbYmnYQBGyMqVuBCwsLF1LKIgiCaRRFaRRFqVKqFEJo AKYNurKy8nwymfxsBSZJMpJSlkqpwuk+d0Rker3ei+Fw+BU3p8y4e5EkyZ9OpzOO4zgNwzBn5koI oY25zSMi0+12O2tra6+Pj48/NGEAwEEQzGxHYV0ZG3wLtri4GO/s7Lw5PT39eHBw8AOAbrgEM3PV DHT3xhhiZrG6uvpsfX291+/3X56cnHweDAbvLcwXABiq67psq5W/xng8/nV2dvb96Ojo0+Hh4TfM /yxXACZWGYAcQMHLy8tv74GZLMvqNE1LABWA0qqwzxWA2koDAI9Go/wumJVLqbKgwgM7qKulYTuh Deau2jpwznKrmefUOTRs6/GQw9pzltuY3AO6LAxj/vu+C+gmOoeldeYc+mlfp3x1T8o+0AU261h7 2bQC/SPi7zMf2tbheZcx30d3pdyso7s6uW83Rw8PN8U59Wuq8e9i8wBjDGNe3DaYP7T3vqlrGAD8 BSHzOdR7PMREAAAAAElFTkSuQmCC "
     x="22"
     y="25"
     width="20"
     height="25"
     id="bottomright"
     inkscape:label="#bottomright" />
  <image
     xlink:href="data:image/png;base64,iVBORw0KGgoAAAANSUhEUgAAABQAAAAXCAYAAAALHW+jAAAABHNCSVQICAgIfAhkiAAAAAlwSFlz AAAN1wAADdcBQiibeAAAABl0RVh0U29mdHdhcmUAd3d3Lmlua3NjYXBlLm9yZ5vuPBoAAAIKSURB VDiNrdU9j9NAEAbg2fXa+Wi5q5DoKE4prkEnfg8VDQUdEjU1NTXKf4CGwq2j9DRpSKSksKJYdrIf Mzs03mjjODk4nSUr63jz6J1ZryOYGZ7zkM+qAYD6n8lCCPFk8JEfX7x3BvZAogNcGp+CHSggYrVa vb69vX2fJMlbKeUEANIryUEwcxeTACAmk4ksiuLDcDj8jIi/rLW/D4fDH0S0zHyc770/SdktRwaw ruuPo9Ho3Xa7/dY0TYmIkogEEQkAAGYWMXxWcoTJ+Xx+Nx6PP63X6y+73W7nnBsE0HsvvffQh8UJ ZXSmdV1/BYAXi8Xih9ZaWWsTRJSImBCRZOYTMB6rCBXttcqy7GGz2fysqmpgjEmNMSqA3vtQqujb ZTGYtNeZUupuuVx+b5pmoLVOrbUqpPPey0v9i0EZg0KItKoq2O/3mTEmc86pkC6A3VKvgSkAgNY6 NcZk1lplrU2JKGFm0T4mj4IBPYLWWuWcO2JElASssyBnIEQJQ0pAxKTtW8BknC4kZGaYzWYv8zy/ L8vyprvKAQYiku0jItre9aUT0+n0oSiKN5dKDieE5kepTsr03suiKF7FWCgVoskBjrfWWc+YWXrv kzzP77uLEr+xz/oTf0ZjwczCOZeWZXlzCYyx3i0Vf0dEiXNuoLUeXkv4TwczAxEliJj13X8KKJlZ ImLv38dfxGKNNs8wC5gAAAAASUVORK5CYII= "
     x="0"
     y="0"
     width="20"
     height="23"
     id="topleft" />
  <image
     xlink:href="data:image/png;base64,iVBORw0KGgoAAAANSUhEUgAAABQAAAAZCAYAAAAxFw7TAAAABHNCSVQICAgIfAhkiAAAAAlwSFlz AAAN1wAADdcBQiibeAAAABl0RVh0U29mdHdhcmUAd3d3Lmlua3NjYXBlLm9yZ5vuPBoAAAJrSURB VDiNrZS7ThtBFIb/Mzdsb2wkKwIhLOgsF9Q0lLFEhCKavEIkGt4jJc9Ax3PQpw0mVYJonEQCicXs rmfmpGAmGS9rpIQc6ddqj8585zIXAtAKagPIAPSY+dPp6enHsiyNtVZ57wUzEzOTtVYVRdG+u7vr n5ycvC3LUiExgRdYv9+/r/teBNzZ2Zn+V+BwOLwdjUa3qU8tC37OiIiJyAPwe3t739fX193FxUX3 5uZGvwgohHBE5Le3tx+2trYsM4u/BhKRJyKvlLJKqUpKWQkh5t57AfxDy0QEKaVTSlVa6wel1Mw5 p6y18N43t8zMzhijyrJsbFdK6bTWZavVmnnvFQAIIaxzzjQC8zz/urm5uTaZTH7WYcwMIYTXWs+Z +T7AXFVVRQrkIADg6XT6eWNjY3B5efmjqWUALKV0xpiSiFgpVc3n83vnnJZ4nGOUAbCyurp6e3h4 +OHq6moym80sMwsAFJmhShZCsJTSSSmtUmpujCkjUALQQeb8/Dw/ODjIdnd331xfX38risIyM/0p khYqTsBeBlgKNQDM2dnZl/39/dfj8fh9t9sFEfk8zwvvfTyHsX0QEYeKPUUAHl+cDoBXQV0A7ePj 49HR0dG7wWAw7PV6a8msGy0CFYCVAMwCMAv/rVC5yrJMdzodmcyzEaiTDWkFUFQ7+GJSEUTLoLIW IJYs4kQ+yCXf31K1IAugSoARZkOV9QKeWATGRYSnMBfGUiXANGYpMC6eJ7BYdTz4KRBN0Hj1fM0f YTFBHZa+9AvQ9HGIkJggAm0A1OfX2DIx8+Jden7X01aXAwHUodSgmAy1uAX7BQ0eBlSo9ueJAAAA AElFTkSuQmCC "
     x="0"
     y="25"
     width="20"
     height="25"
     id="bottomleft" />
  <image
     xlink:href="data:image/png;base64,iVBORw0KGgoAAAANSUhEUgAAAAIAAAAZCAYAAAAbp/98AAAABHNCSVQICAgIfAhkiAAAAAlwSFlz AAAN1wAADdcBQiibeAAAABl0RVh0U29mdHdhcmUAd3d3Lmlua3NjYXBlLm9yZ5vuPBoAAABqSURB VAiZfce7EoIwFEDBDbkFFJR8HKXfH4fGB44QsSGVM55qT8IBnbM/iHmerxA55w9E13UbUkTEEymG YViO40gxjmNpWCD6vl8hImKHVGvdIE3TdIEopbwg8G5YGx4Ntx/cIZ+zZyTUL8puIaBwGexNAAAA AElFTkSuQmCC "
     x="20"
     y="25"
     width="2"
     height="25"
     id="bottom" />
  <image
     xlink:href="data:image/png;base64,iVBORw0KGgoAAAANSUhEUgAAABQAAAAXCAYAAAALHW+jAAAABHNCSVQICAgIfAhkiAAAAAlwSFlz AAAN1wAADdcBQiibeAAAABl0RVh0U29mdHdhcmUAd3d3Lmlua3NjYXBlLm9yZ5vuPBoAAAJeSURB VDiNrdW/axRBFAfw75t5t5eYGAgnJHCI2ESshHDBLoWNrX+ChWJhZRmsrS1sBMEq+SOshFSGQMBi sTDVcTbGcHeSXO52Zt6zyOwxt7k7CWRg4H7NZ77v3ewuqSpucpgb1QBQnHOHXqMMwvyUM6FZmxCA 2n+g6usJqAqTqo7mJAQAJyJ5COHbycnJx2az+TOBx1gJU6fTeZGuNsaMf0REyszZ4uLi3SzLHjDz k+Fw+G5ra+tDnucSQUlRyvP8ZTUSESkRKQBYa9Vaq8wsS0tLjdXV1VcXFxefl5eX3yfgGOV+v1+f VicRqTEGxhgpwcFg0C+K4tP6+vrbo6OjL5ubmz+SJQIA3Ov1bqVIJSWstcLMgZkly7LgnPu7srLy dWNj4zWANwBcivLZ2dnClHQAoDGllmC9XvdFUbhut3u8trb2FADHsh3imebBYHAFTPsYSxZmDs45 6703nU7nd7PZfAggS/qoAIhHo1E2DUv6KGXKEIIVEQJQEFEtgiFOAaDsvedZIAA1xigRaQjBlGc4 OVq1WK4vUQ4hmAo2AYuIlkBRFIh/VEhAxuXle9nDnZ2d541G48/29vb3Vqv1i4jGCVWVULkivPfi vbfxLQOwcRoAMOfn57fb7fb93d3dZ3t7e49VldIJgESERIRUlUIIJqnKpukA0ES5h4eHrYODg3tp v8rqS1hVSUTKdSaZV0EA2N/ffyQiVlUn0DJtkhwJVG569V54enp6xzlXS4EKivSzpNzxDhNjOBwu OOfqIQRbWTiBpqlSdOrd2nufRXDa13PHLJBjD6/9EPsHVMljBvA4PAYAAAAASUVORK5CYII= "
     x="22"
     y="0"
     width="20"
     height="23"
     id="topright" />
  <image
     xlink:href="data:image/png;base64,iVBORw0KGgoAAAANSUhEUgAAABQAAAACCAYAAABYBvyLAAAABHNCSVQICAgIfAhkiAAAAAlwSFlz AAAN1wAADdcBQiibeAAAABl0RVh0U29mdHdhcmUAd3d3Lmlua3NjYXBlLm9yZ5vuPBoAAABLSURB VAiZpczBDYAgEEXB9zebwIVqLIg2sC/r8mBiIIa43rk6BYyAYNFaO0opZ865u/uUFJLCzF53nyml p9a6S9qAC7iBDgxbs78+tHsRDDSrU6UAAAAASUVORK5CYII= "
     x="22"
     y="23"
     width="20"
     height="2"
     id="right" />
  <image
     xlink:href="data:image/png;base64,iVBORw0KGgoAAAANSUhEUgAAABQAAAACCAYAAABYBvyLAAAABHNCSVQICAgIfAhkiAAAAAlwSFlz AAAN1wAADdcBQiibeAAAABl0RVh0U29mdHdhcmUAd3d3Lmlua3NjYXBlLm9yZ5vuPBoAAABMSURB VAiZpcgxCoAwEETR2RDEELDwXN7LXCMH8jRpdmHI2Fil9cFvvgHYvwqACuCQ9PTe74jYSOY5Z5Jk koxkdvcyxjhbaxcWaR1/vSI1IAOvb27vAAAAAElFTkSuQmCC "
     x="0"
     y="23"
     width="20"
     height="2"
     id="left" />
  <image
     xlink:href="data:image/png;base64,iVBORw0KGgoAAAANSUhEUgAAAAIAAAAXCAYAAAAhrZ4MAAAABHNCSVQICAgIfAhkiAAAAAlwSFlz AAAN1wAADdcBQiibeAAAABl0RVh0U29mdHdhcmUAd3d3Lmlua3NjYXBlLm9yZ5vuPBoAAABdSURB VAiZlc5BCsIwFATQl/jR4jk9eg+QQCkEUr4LW9ClAwNvN1MyE1RnylnxjRuUzBxQ1nV9QfTey4UH RGvtCbFt2wKx7/sHY4w7xJwzII7jqFBqrfNaz58/f+ENRUIjftJV2bAAAAAASUVORK5CYII= "
     x="20"
     y="0"
     width="2"
     height="23"
     id="top" />
  <rect
     width="2"
     height="2"
     x="20"
     y="23"
     id="rect2309"
     style="opacity:1;fill:#000000;fill-opacity:1;stroke:none;stroke-width:5.19999981;stroke-linecap:round;stroke-linejoin:round;stroke-miterlimit:4;stroke-dasharray:none;stroke-dashoffset:1.08779998;stroke-opacity:1" />
  <rect
     style="opacity:0.875;fill:#000000"
     id="center"
     width="6.7175145"
     height="6.3639612"
     x="17.67767"
     y="19.417631" />
</svg>
