#FIG 3.2  Produced by xfig version 3.2.5
Landscape
Center
Metric
A4      
100.00
Single
-2
1200 2
5 1 0 1 0 7 50 -1 -1 4.000 0 0 0 0 -6.127 447.087 225 450 221 490 195 561
5 1 0 1 0 7 50 -1 -1 0.000 0 0 0 0 3373.794 453.199 3575 449 3534 575 3230 594
5 1 0 1 0 7 50 -1 -1 0.000 0 1 0 0 3378.294 452.281 3089 456 3111 563 3159 641
5 1 0 1 0 7 50 -1 -1 0.000 0 1 0 0 2001.518 1612.958 2188 1453 1965 1370 1786 1495
5 1 0 1 0 7 50 -1 -1 4.000 0 1 0 0 1991.996 1616.177 2246 1758 2264 1513 2218 1433
2 3 0 2 0 7 50 -1 -1 0.000 0 0 -1 0 0 4
	 0 450 3375 450 2000 1616 0 450
2 1 1 1 0 7 50 -1 -1 4.000 0 0 -1 0 0 2
	 4050 450 3150 450
2 1 1 1 0 7 50 -1 -1 4.000 0 0 -1 0 0 3
	 2003 1614 2001 1615 2629 1982
4 0 0 50 -1 0 11 0.0000 2 165 555 360 630 $\\beta$\001
4 0 0 50 -1 0 11 0.0000 10 165 600 3675 630 $\\delta$\001
4 2 0 50 -1 0 11 0.0000 2 195 765 2994 630 $\\gamma$\001
4 1 0 50 -1 0 11 0.0000 2 195 450 1773 378 $s_1$\001
4 0 0 50 -1 0 11 0.0000 10 195 450 2743 1170 $s_2$\001
4 2 0 50 -1 0 11 0.0000 10 195 450 1031 1260 $s_3$\001
4 1 0 50 -1 0 12 0.0000 6 195 720 1978 1308 $\\alpha$\001
4 1 0 50 -1 0 11 0.0000 2 195 420 3378 270 $t_1$\001
4 1 0 50 -1 0 11 0.0000 2 165 285 75 252 $T$\001
4 1 0 50 -1 0 12 0.0000 2 180 480 2001 1872 $t_2$\001
4 0 0 50 -1 0 12 0.0000 10 195 1125 2358 1687 $\\varepsilon$\001
