%!PS-Adobe-3.0 EPSF-3.0
%%Creator: ansi2ps, written by S.Fourmanoit, 2005.
%%LanguageLevel: 2
%%BoundingBox: 0 176 360 789
%%Pages: 1 0

%-------------------------------------------------
% Headers
%-------------------------------------------------
/Times-Roman findfont
%/System findfont
12 scalefont
setfont

/cr {
   currentpoint
   12 sub
   exch pop 0 exch
   moveto
} def
%-------------------------------------------------
% Content
%-------------------------------------------------

%%Page: 1 1
0 780 moveto
0 0 0 setrgbcolor
(Total 251 MB) show
() show
cr
(Python-2.4.tar.bz2, X11R6.8.2-src.tar.bz2, autoconf-2.13.tar.gz,) show
cr
(autoconf-2.59.tar.bz2, automake-1.4-p6.tar.gz, automake-1.5.tar.gz,) show
cr
(automake-1.6.3.tar.bz2, automake-1.7.9.tar.bz2, automake-1.8.5.tar.bz2,) show
cr
(automake-1.9.4.tar.bz2, bash-2.05b.tar.gz, bash-3.0-gentoo.diff.bz2,) show
cr
(bash-3.0.tar.gz, bash205b-006, bash30-001, bash30-002,) show
cr
(bash30-003, bash30-004, bash30-005, bash30-006, bash30-007,) show
cr
(bash30-008, bash30-009, bash30-010, bash30-011, bash30-012,) show
cr
(bash30-013, bash30-014, bash30-015, bash30-016, bc-1.06.tar.gz,) show
cr
(bin86-0.16.16.tar.gz, binutils-2.15-uclibc-patches-1.0.tar.bz2,) show
cr
(binutils-2.15.92.0.2-patches-1.2.tar.bz2,) show
cr
(binutils-2.15.92.0.2.tar.bz2, bison-1.875d.tar.bz2, bzip2-1.0.2.tar.gz,) show
cr
(coreutils-5.2.1-i18n-0.2.patch.bz2, coreutils-5.2.1-patches-0.9.tar.bz2,) show
cr
(coreutils-5.2.1.tar.bz2, cpio-2.6.tar.bz2, cracklib,2.7.tar.gz,) show
cr
(debianutils_1.16.7.tar.gz, devfsd-v1.3.25.tar.gz,) show
cr
(diffutils-2.8.7.tar.gz, e2fsprogs-1.35.tar.gz, ed-0.2.tar.gz,) show
cr
(eurofonts-X11.tar.bz2, expat-1.95.8.tar.gz, file-4.12.tar.gz,) show
cr
(findutils-4.1.20.tar.gz, flex-2.5.4a.tar.gz, fluxbox-0.9.12.tar.bz2,) show
cr
(fontconfig-2.2.3.tar.gz, freetype-2.1.9.tar.bz2, gawk-3.1.3.tar.gz,) show
cr
(gcc-3.4.3-branch-update-20050110.patch.bz2, gcc-3.4.3-manpages.tar.bz2,) show
cr
(gcc-3.4.3-patches-1.1.tar.bz2, gcc-3.4.3-piepatches-v8.7.7.tar.bz2,) show
cr
(gcc-3.4.3.tar.bz2, gemini-koi8-u.tar.bz2,) show
cr
(gentoo-cursors-tad-0.3.1.tar.bz2, gettext-0.14.1.tar.gz,) show
cr
(gettext-1.01.tar.gz, glext.h-26.bz2, glibc-2.3.4-patches-1.2.tar.bz2,) show
cr
(glibc-2.3.4.tar.bz2, glibc-infopages-2.3.4-r1.tar.bz2,) show
cr
(glibc-linuxthreads-2.3.4.tar.bz2, glibc-manpages-2.3.4-r1.tar.bz2,) show
cr
(glxext.h-10.bz2, gnuconfig-20050223.tar.bz2,) show
cr
(grep-2.5.1.tar.gz, groff-1.19.1.tar.gz, gzip-1.3.5-deb.patch.bz2,) show
cr
(gzip_1.3.5.orig.tar.gz, hdparm-5.7.tar.gz, help2man-1.33.1.tar.gz,) show
cr
(hotplug-2004_04_01.tar.gz, iputils-ss021109-try.tar.bz2, kbd-1.12.tar.gz,) show
cr
(less-382.tar.gz, libol-0.3.14.tar.gz, libpng-1.2.8.tar.bz2,) show
cr
(libtool-1.5.10.tar.gz, linux-2.6.8.1-sh-headers.patch.bz2,) show
cr
(linux-2.6.8.1.tar.bz2, m4-1.4.1.tar.gz, make-3.80.tar.bz2,) show
cr
(man-1.5p.tar.gz, man-pages-2.01.tar.bz2, miscfiles-1.3.tar.gz,) show
cr
(module-init-tools-3.0.tar.bz2, modutils-2.4.27.tar.bz2,) show
cr
(nano-1.3.4.tar.gz, ncompress-4.2.4.tar.gz, ncompress_4.2.4-15.diff.gz,) show
cr
(ncurses-5.4.tar.gz, net-tools-1.60-patches-1.0.tar.bz2,) show
cr
(net-tools-1.60.tar.bz2, openssh-3.9p1.tar.gz, openssl-0.9.6m.tar.gz,) show
cr
(openssl-0.9.7e.tar.gz, patch-2.5.9.tar.gz, perl-5.8.5.tar.gz,) show
cr
(popt-1.7.tar.gz, portage-2.0.51.19.tar.bz2, procps-3.2.4.tar.gz,) show
cr
(protector-3.4.3.20050110-0.tar.gz, psmisc-21.5.tar.gz, pwdb-0.62.tar.gz,) show
cr
(python-fchksum-1.7.1.tar.gz, readline-4.3.tar.gz, readline43-001,) show
cr
(readline43-002, readline43-003, readline43-004, readline43-005,) show
cr
(rpm2targz-9.0.tar.gz, rsync-2.5.6-proxy-auth-1.patch,) show
cr
(rsync-2.6.0.tar.gz, sash-3.7.tar.gz, sed-4.0.9.tar.gz,) show
cr
(shadow-4.0.5.tar.bz2, svorakln.tar.gz, syslog-ng-1.6.5.tar.gz,) show
cr
(tar-1.14.tar.bz2, tcp-wrappers-7.6-r8-patches.tar.bz2,) show
cr
(tcp_wrappers_7.6.tar.gz, texinfo-4.7.tar.bz2, ttmkfdir-3.0.9.tar.bz2,) show
cr
(udev-045.tar.bz2, utempter-0.5.5-5.src.rpm, util-linux-2.12i.tar.gz,) show
cr
(wget-1.9.1.tar.gz, which-2.16.tar.gz, xorg-x11-6.8.2-files-0.1.tar.bz2,) show
cr
(xorg-x11-6.8.2-patches-0.1.2.tar.bz2, xterm-197.tgz, zlib-1.2.2.tar.bz2) show
cr
() show

%%EOF
