%!PS-Adobe-3.0 EPSF-3.0
%%Creator: ansi2ps, written by S.Fourmanoit, 2005.
%%LanguageLevel: 2
%%BoundingBox: 0 32 621 789
%%Pages: 1 0

%-------------------------------------------------
% Headers
%-------------------------------------------------
/Times-Roman findfont
%/System findfont
12 scalefont
setfont

/cr {
   currentpoint
   12 sub
   exch pop 0 exch
   moveto
} def
%-------------------------------------------------
% Content
%-------------------------------------------------

%%Page: 1 1
0 780 moveto
0 0 0 setrgbcolor
() show
() show
0 1 0 setrgbcolor
(These are the packages that I would merge, in reverse order:) show
0 0 0 setrgbcolor
() show
cr
() show
cr
(Calculating dependencies    ...done!) show
cr
([ebuild  ) show
0 1 0 setrgbcolor
(N) show
0 0 0 setrgbcolor
(    ] ) show
0 1 0 setrgbcolor
(gnome-extra/gdesklets-core-0.33.1) show
0 0 0 setrgbcolor
(  ) show
0 0 1 setrgbcolor
(-debug) show
0 0 0 setrgbcolor
( ) show
0 0 1 setrgbcolor
(-doc) show
0 0 0 setrgbcolor
( 1,109 kB ) show
cr
([ebuild  ) show
0 1 0 setrgbcolor
(N) show
0 0 0 setrgbcolor
(    ]  ) show
0 1 0 setrgbcolor
(gnome-base/libgtop-2.8.3) show
0 0 0 setrgbcolor
(  ) show
0 0 1 setrgbcolor
(-debug) show
0 0 0 setrgbcolor
( 1,022 kB ) show
cr
([ebuild  ) show
0 1 0 setrgbcolor
(N) show
0 0 0 setrgbcolor
(    ]  ) show
0 1 0 setrgbcolor
(dev-python/gnome-python-2.6.1) show
0 0 0 setrgbcolor
(  ) show
0 0 1 setrgbcolor
(-debug) show
0 0 0 setrgbcolor
( ) show
0 0 1 setrgbcolor
(-gtkhtml) show
0 0 0 setrgbcolor
( 358 kB ) show
cr
([ebuild  ) show
0 1 0 setrgbcolor
(N) show
0 0 0 setrgbcolor
(    ]   ) show
0 1 0 setrgbcolor
(gnome-base/libgnomeprintui-2.8.2) show
0 0 0 setrgbcolor
(  ) show
0 0 1 setrgbcolor
(-debug) show
0 0 0 setrgbcolor
( ) show
0 0 1 setrgbcolor
(-doc) show
0 0 0 setrgbcolor
( 569 kB ) show
cr
([ebuild  ) show
0 1 0 setrgbcolor
(N) show
0 0 0 setrgbcolor
(    ]   ) show
0 1 0 setrgbcolor
(x11-libs/libzvt-2.0.1-r2) show
0 0 0 setrgbcolor
(  ) show
0 0 1 setrgbcolor
(-debug) show
0 0 0 setrgbcolor
( 244 kB ) show
cr
([ebuild  ) show
0 1 0 setrgbcolor
(N) show
0 0 0 setrgbcolor
(    ]   ) show
0 1 0 setrgbcolor
(dev-python/pyorbit-2.0.1) show
0 0 0 setrgbcolor
(  ) show
0 0 1 setrgbcolor
(-debug) show
0 0 0 setrgbcolor
( 237 kB ) show
cr
([ebuild  ) show
0 1 0 setrgbcolor
(N) show
0 0 0 setrgbcolor
(    ]   ) show
0 1 0 setrgbcolor
(gnome-base/libgnomeprint-2.8.2) show
0 0 0 setrgbcolor
(  ) show
0 0 1 setrgbcolor
(-cups) show
0 0 0 setrgbcolor
( ) show
0 0 1 setrgbcolor
(-debug) show
0 0 0 setrgbcolor
( ) show
0 0 1 setrgbcolor
(-doc) show
0 0 0 setrgbcolor
( 748 kB ) show
cr
([ebuild  ) show
0 1 0 setrgbcolor
(N) show
0 0 0 setrgbcolor
(    ]   ) show
0 1 0 setrgbcolor
(gnome-base/nautilus-2.8.2-r1) show
0 0 0 setrgbcolor
(  ) show
0 0 1 setrgbcolor
(-cups) show
0 0 0 setrgbcolor
( ) show
0 0 1 setrgbcolor
(-debug) show
0 0 0 setrgbcolor
( ) show
0 0 1 setrgbcolor
(-flac) show
0 0 0 setrgbcolor
( ) show
0 0 1 setrgbcolor
(-gstreamer) show
0 0 0 setrgbcolor
( ) show
0 0 1 setrgbcolor
(-mad) show
0 0 0 setrgbcolor
( ) show
0 0 1 setrgbcolor
(-oggvorbis) show
0 0 0 setrgbcolor
( 5,672 kB ) show
cr
([ebuild  ) show
0 1 0 setrgbcolor
(N) show
0 0 0 setrgbcolor
(    ]    ) show
0 1 0 setrgbcolor
(gnome-base/librsvg-2.8.1-r1) show
0 0 0 setrgbcolor
(  ) show
0 0 1 setrgbcolor
(-debug) show
0 0 0 setrgbcolor
( ) show
0 0 1 setrgbcolor
(-doc) show
0 0 0 setrgbcolor
( ) show
0 0 1 setrgbcolor
(-gnome) show
0 0 0 setrgbcolor
( ) show
1 0 0 setrgbcolor
(+zlib) show
0 0 0 setrgbcolor
( 352 kB ) show
cr
([ebuild  ) show
0 1 0 setrgbcolor
(N) show
0 0 0 setrgbcolor
(    ]     ) show
0 1 0 setrgbcolor
(gnome-extra/libgsf-1.10.0) show
0 0 0 setrgbcolor
(  ) show
0 0 1 setrgbcolor
(-debug) show
0 0 0 setrgbcolor
( ) show
0 0 1 setrgbcolor
(-doc) show
0 0 0 setrgbcolor
( ) show
0 0 1 setrgbcolor
(-gnome) show
0 0 0 setrgbcolor
( 389 kB ) show
cr
([ebuild  ) show
0 1 0 setrgbcolor
(N) show
0 0 0 setrgbcolor
(    ]     ) show
0 1 0 setrgbcolor
(dev-libs/libcroco-0.6.0) show
0 0 0 setrgbcolor
(  ) show
0 0 1 setrgbcolor
(-debug) show
0 0 0 setrgbcolor
( 349 kB ) show
cr
([ebuild  ) show
0 1 0 setrgbcolor
(N) show
0 0 0 setrgbcolor
(    ]    ) show
0 1 0 setrgbcolor
(gnome-base/eel-2.8.2) show
0 0 0 setrgbcolor
(  ) show
0 0 1 setrgbcolor
(-debug) show
0 0 0 setrgbcolor
( 606 kB ) show
cr
([ebuild  ) show
0 1 0 setrgbcolor
(N) show
0 0 0 setrgbcolor
(    ]     ) show
0 1 0 setrgbcolor
(gnome-base/gail-1.8.2-r1) show
0 0 0 setrgbcolor
(  ) show
0 0 1 setrgbcolor
(-debug) show
0 0 0 setrgbcolor
( ) show
0 0 1 setrgbcolor
(-doc) show
0 0 0 setrgbcolor
( ) show
0 0 1 setrgbcolor
(-static) show
0 0 0 setrgbcolor
( 539 kB ) show
cr
([ebuild  ) show
0 1 0 setrgbcolor
(N) show
0 0 0 setrgbcolor
(    ]     ) show
0 1 0 setrgbcolor
(dev-util/desktop-file-utils-0.9) show
0 0 0 setrgbcolor
(  414 kB ) show
cr
([ebuild  ) show
0 1 0 setrgbcolor
(N) show
0 0 0 setrgbcolor
(    ]    ) show
0 1 0 setrgbcolor
(sys-apps/eject-2.0.13-r1) show
0 0 0 setrgbcolor
(  ) show
1 0 0 setrgbcolor
(+nls) show
0 0 0 setrgbcolor
( 58 kB ) show
cr
([ebuild  ) show
0 1 0 setrgbcolor
(N) show
0 0 0 setrgbcolor
(    ]   ) show
0 1 0 setrgbcolor
(gnome-base/gnome-panel-2.8.3) show
0 0 0 setrgbcolor
(  ) show
0 0 1 setrgbcolor
(-debug) show
0 0 0 setrgbcolor
( ) show
0 0 1 setrgbcolor
(-doc) show
0 0 0 setrgbcolor
( ) show
0 0 1 setrgbcolor
(-eds) show
0 0 0 setrgbcolor
( 3,031 kB ) show
cr
([ebuild  ) show
0 1 0 setrgbcolor
(N) show
0 0 0 setrgbcolor
(    ]    ) show
0 1 0 setrgbcolor
(x11-libs/libwnck-2.8.1-r1) show
0 0 0 setrgbcolor
(  ) show
0 0 1 setrgbcolor
(-debug) show
0 0 0 setrgbcolor
( ) show
0 0 1 setrgbcolor
(-doc) show
0 0 0 setrgbcolor
( 386 kB ) show
cr
([ebuild  ) show
0 1 0 setrgbcolor
(N) show
0 0 0 setrgbcolor
(    ]    ) show
0 1 0 setrgbcolor
(gnome-base/gnome-desktop-2.8.3) show
0 0 0 setrgbcolor
(  ) show
0 0 1 setrgbcolor
(-debug) show
0 0 0 setrgbcolor
( 1,115 kB ) show
cr
([ebuild  ) show
0 1 0 setrgbcolor
(N) show
0 0 0 setrgbcolor
(    ]     ) show
0 1 0 setrgbcolor
(app-text/scrollkeeper-0.3.14) show
0 0 0 setrgbcolor
(  ) show
1 0 0 setrgbcolor
(+nls) show
0 0 0 setrgbcolor
( 663 kB ) show
cr
([ebuild  ) show
0 1 0 setrgbcolor
(N) show
0 0 0 setrgbcolor
(    ]      ) show
0 1 0 setrgbcolor
(dev-libs/libxslt-1.1.12) show
0 0 0 setrgbcolor
(  ) show
0 0 1 setrgbcolor
(-crypt) show
0 0 0 setrgbcolor
( ) show
1 0 0 setrgbcolor
(+python) show
0 0 0 setrgbcolor
( 1,736 kB ) show
cr
([ebuild  ) show
0 1 0 setrgbcolor
(N) show
0 0 0 setrgbcolor
(    ]      ) show
0 1 0 setrgbcolor
(app-text/docbook-xml-dtd-4.1.2-r5) show
0 0 0 setrgbcolor
(  73 kB ) show
cr
([ebuild  ) show
0 1 0 setrgbcolor
(N) show
0 0 0 setrgbcolor
(    ]      ) show
0 1 0 setrgbcolor
(app-text/docbook-sgml-utils-0.6.14) show
0 0 0 setrgbcolor
(  ) show
0 0 1 setrgbcolor
(-tetex) show
0 0 0 setrgbcolor
( 122 kB ) show
cr
([ebuild  ) show
0 1 0 setrgbcolor
(N) show
0 0 0 setrgbcolor
(    ]       ) show
0 1 0 setrgbcolor
(app-text/docbook-xml-dtd-4.3) show
0 0 0 setrgbcolor
(  81 kB ) show
cr
([ebuild  ) show
0 1 0 setrgbcolor
(N) show
0 0 0 setrgbcolor
(    ]        ) show
0 1 0 setrgbcolor
(app-text/docbook-xsl-stylesheets-1.66.1) show
0 0 0 setrgbcolor
(  1,514 kB ) show
cr
([ebuild  ) show
0 1 0 setrgbcolor
(N) show
0 0 0 setrgbcolor
(    ]         ) show
0 1 0 setrgbcolor
(app-text/build-docbook-catalog-1.2) show
0 0 0 setrgbcolor
(  3 kB ) show
cr
([ebuild  ) show
0 1 0 setrgbcolor
(N) show
0 0 0 setrgbcolor
(    ]       ) show
0 1 0 setrgbcolor
(www-client/links-2.1_pre15) show
0 0 0 setrgbcolor
(  ) show
1 0 0 setrgbcolor
(+X) show
0 0 0 setrgbcolor
( ) show
0 0 1 setrgbcolor
(-directfb) show
0 0 0 setrgbcolor
( ) show
0 0 1 setrgbcolor
(-fbcon) show
0 0 0 setrgbcolor
( ) show
0 0 1 setrgbcolor
(-gpm) show
0 0 0 setrgbcolor
( ) show
0 0 1 setrgbcolor
(-javascript) show
0 0 0 setrgbcolor
( ) show
0 0 1 setrgbcolor
(-jpeg) show
0 0 0 setrgbcolor
( ) show
0 0 1 setrgbcolor
(-png) show
0 0 0 setrgbcolor
( ) show
1 0 0 setrgbcolor
(+ssl) show
0 0 0 setrgbcolor
( ) show
0 0 1 setrgbcolor
(-svga) show
0 0 0 setrgbcolor
( ) show
0 0 1 setrgbcolor
(-tiff) show
0 0 0 setrgbcolor
( ) show
0 0 1 setrgbcolor
(-unicode) show
0 0 0 setrgbcolor
( 3,700 kB ) show
cr
([ebuild  ) show
0 1 0 setrgbcolor
(N) show
0 0 0 setrgbcolor
(    ]       ) show
0 1 0 setrgbcolor
(app-text/docbook-xml-simple-dtd-1.0) show
0 0 0 setrgbcolor
(  30 kB ) show
cr
([ebuild  ) show
0 1 0 setrgbcolor
(N) show
0 0 0 setrgbcolor
(    ]       ) show
0 1 0 setrgbcolor
(app-text/docbook-xml-simple-dtd-4.1.2.4-r2) show
0 0 0 setrgbcolor
(  34 kB ) show
cr
([ebuild  ) show
0 1 0 setrgbcolor
(N) show
0 0 0 setrgbcolor
(    ]       ) show
0 1 0 setrgbcolor
(app-text/docbook-sgml-dtd-3.1-r2) show
0 0 0 setrgbcolor
(  54 kB ) show
cr
([ebuild  ) show
0 1 0 setrgbcolor
(N) show
0 0 0 setrgbcolor
(    ]       ) show
0 1 0 setrgbcolor
(app-text/docbook-sgml-dtd-3.0-r2) show
0 0 0 setrgbcolor
(  42 kB ) show
cr
([ebuild  ) show
0 1 0 setrgbcolor
(N) show
0 0 0 setrgbcolor
(    ]       ) show
0 1 0 setrgbcolor
(app-text/docbook-dsssl-stylesheets-1.77-r2) show
0 0 0 setrgbcolor
(  385 kB ) show
cr
([ebuild  ) show
0 1 0 setrgbcolor
(N) show
0 0 0 setrgbcolor
(    ]       ) show
0 1 0 setrgbcolor
(dev-perl/SGMLSpm-1.03-r5) show
0 0 0 setrgbcolor
(  91 kB ) show
cr
([ebuild  ) show
0 1 0 setrgbcolor
(N) show
0 0 0 setrgbcolor
(    ]       ) show
0 1 0 setrgbcolor
(app-text/docbook-sgml-dtd-4.0-r2) show
0 0 0 setrgbcolor
(  54 kB ) show
cr
([ebuild  ) show
0 1 0 setrgbcolor
(N) show
0 0 0 setrgbcolor
(    ]       ) show
0 1 0 setrgbcolor
(app-text/docbook-sgml-dtd-4.1-r2) show
0 0 0 setrgbcolor
(  55 kB ) show
cr
([ebuild  ) show
0 1 0 setrgbcolor
(N) show
0 0 0 setrgbcolor
(    ]        ) show
0 1 0 setrgbcolor
(app-arch/unzip-5.52) show
0 0 0 setrgbcolor
(  1,113 kB ) show
cr
([ebuild  ) show
0 1 0 setrgbcolor
(N) show
0 0 0 setrgbcolor
(    ]       ) show
0 1 0 setrgbcolor
(app-text/openjade-1.3.2-r1) show
0 0 0 setrgbcolor
(  ) show
0 0 1 setrgbcolor
(-debug) show
0 0 0 setrgbcolor
( 873 kB ) show
cr
([ebuild  ) show
0 1 0 setrgbcolor
(N) show
0 0 0 setrgbcolor
(    ]        ) show
0 1 0 setrgbcolor
(app-text/opensp-1.5.1) show
0 0 0 setrgbcolor
(  ) show
1 0 0 setrgbcolor
(+nls) show
0 0 0 setrgbcolor
( 1,385 kB ) show
cr
([ebuild  ) show
0 1 0 setrgbcolor
(N) show
0 0 0 setrgbcolor
(    ]        ) show
0 1 0 setrgbcolor
(app-text/sgml-common-0.6.3-r4) show
0 0 0 setrgbcolor
(  74 kB ) show
cr
([ebuild  ) show
0 1 0 setrgbcolor
(N) show
0 0 0 setrgbcolor
(    ]     ) show
0 1 0 setrgbcolor
(x11-libs/startup-notification-0.8) show
0 0 0 setrgbcolor
(  230 kB ) show
cr
([ebuild  ) show
0 1 0 setrgbcolor
(N) show
0 0 0 setrgbcolor
(    ] ) show
0 1 0 setrgbcolor
(x11-themes/gnome-themes-2.8.2) show
0 0 0 setrgbcolor
(  ) show
0 0 1 setrgbcolor
(-accessibility) show
0 0 0 setrgbcolor
( ) show
0 0 1 setrgbcolor
(-debug) show
0 0 0 setrgbcolor
( 2,652 kB ) show
cr
([ebuild  ) show
0 1 0 setrgbcolor
(N) show
0 0 0 setrgbcolor
(    ]  ) show
0 1 0 setrgbcolor
(x11-themes/gtk-engines-2.2.0) show
0 0 0 setrgbcolor
(  1,072 kB ) show
cr
([ebuild  ) show
0 1 0 setrgbcolor
(N) show
0 0 0 setrgbcolor
(    ]   ) show
0 1 0 setrgbcolor
(media-libs/imlib-1.9.14-r3) show
0 0 0 setrgbcolor
(  574 kB ) show
cr
([ebuild  ) show
0 1 0 setrgbcolor
(N) show
0 0 0 setrgbcolor
(    ]    ) show
0 1 0 setrgbcolor
(media-libs/tiff-3.7.1-r1) show
0 0 0 setrgbcolor
(  1,224 kB ) show
cr
([ebuild  ) show
0 1 0 setrgbcolor
(N) show
0 0 0 setrgbcolor
(    ]    ) show
0 1 0 setrgbcolor
(x11-libs/gtk+-1.2.10-r11) show
0 0 0 setrgbcolor
(  ) show
0 0 1 setrgbcolor
(-debug) show
0 0 0 setrgbcolor
( ) show
1 0 0 setrgbcolor
(+nls) show
0 0 0 setrgbcolor
( 2,880 kB ) show
cr
([ebuild  ) show
0 1 0 setrgbcolor
(N) show
0 0 0 setrgbcolor
(    ]     ) show
0 1 0 setrgbcolor
(dev-libs/glib-1.2.10-r5) show
0 0 0 setrgbcolor
(  ) show
0 0 1 setrgbcolor
(-debug) show
0 0 0 setrgbcolor
( 411 kB ) show
cr
([ebuild  ) show
0 1 0 setrgbcolor
(N) show
0 0 0 setrgbcolor
(    ]    ) show
0 1 0 setrgbcolor
(media-libs/giflib-4.1.3) show
0 0 0 setrgbcolor
(  ) show
1 0 0 setrgbcolor
(+X) show
0 0 0 setrgbcolor
( ) show
0 0 1 setrgbcolor
(-gif) show
0 0 0 setrgbcolor
( 556 kB ) show
cr
([ebuild  ) show
0 1 0 setrgbcolor
(N) show
0 0 0 setrgbcolor
(    ]    ) show
0 1 0 setrgbcolor
(media-libs/jpeg-6b-r4) show
0 0 0 setrgbcolor
(  ) show
0 0 1 setrgbcolor
(-debug) show
0 0 0 setrgbcolor
( 598 kB ) show
cr
([ebuild  ) show
0 1 0 setrgbcolor
(N) show
0 0 0 setrgbcolor
(    ] ) show
0 1 0 setrgbcolor
(x11-themes/gnome-icon-theme-2.8.0) show
0 0 0 setrgbcolor
(  ) show
0 0 1 setrgbcolor
(-debug) show
0 0 0 setrgbcolor
( 2,800 kB ) show
cr
([ebuild  ) show
0 1 0 setrgbcolor
(N) show
0 0 0 setrgbcolor
(    ]  ) show
0 1 0 setrgbcolor
(x11-themes/hicolor-icon-theme-0.5) show
0 0 0 setrgbcolor
(  30 kB ) show
cr
([ebuild  ) show
0 1 0 setrgbcolor
(N) show
0 0 0 setrgbcolor
(    ]     ) show
0 1 0 setrgbcolor
(gnome-base/libgnomeui-2.8.1-r1) show
0 0 0 setrgbcolor
(  ) show
0 0 1 setrgbcolor
(-debug) show
0 0 0 setrgbcolor
( ) show
0 0 1 setrgbcolor
(-doc) show
0 0 0 setrgbcolor
( ) show
0 0 1 setrgbcolor
(-jpeg) show
0 0 0 setrgbcolor
( 1,422 kB ) show
cr
([ebuild  ) show
0 1 0 setrgbcolor
(N) show
0 0 0 setrgbcolor
(    ]      ) show
0 1 0 setrgbcolor
(gnome-base/gnome-keyring-0.4.1) show
0 0 0 setrgbcolor
(  ) show
0 0 1 setrgbcolor
(-debug) show
0 0 0 setrgbcolor
( 359 kB ) show
cr
([ebuild  ) show
0 1 0 setrgbcolor
(N) show
0 0 0 setrgbcolor
(    ]   ) show
0 1 0 setrgbcolor
(gnome-base/libbonoboui-2.8.1) show
0 0 0 setrgbcolor
(  ) show
0 0 1 setrgbcolor
(-debug) show
0 0 0 setrgbcolor
( ) show
0 0 1 setrgbcolor
(-doc) show
0 0 0 setrgbcolor
( 997 kB ) show
cr
([ebuild  ) show
0 1 0 setrgbcolor
(N) show
0 0 0 setrgbcolor
(    ]    ) show
0 1 0 setrgbcolor
(gnome-base/libgnome-2.8.1) show
0 0 0 setrgbcolor
(  ) show
0 0 1 setrgbcolor
(-debug) show
0 0 0 setrgbcolor
( ) show
0 0 1 setrgbcolor
(-doc) show
0 0 0 setrgbcolor
( 1,150 kB ) show
cr
([ebuild  ) show
0 1 0 setrgbcolor
(N) show
0 0 0 setrgbcolor
(    ]     ) show
0 1 0 setrgbcolor
(gnome-base/gnome-vfs-2.8.4) show
0 0 0 setrgbcolor
(  ) show
0 0 1 setrgbcolor
(-debug) show
0 0 0 setrgbcolor
( ) show
0 0 1 setrgbcolor
(-doc) show
0 0 0 setrgbcolor
( ) show
0 0 1 setrgbcolor
(-gnutls) show
0 0 0 setrgbcolor
( ) show
0 0 1 setrgbcolor
(-hal) show
0 0 0 setrgbcolor
( ) show
0 0 1 setrgbcolor
(-howl) show
0 0 0 setrgbcolor
( ) show
0 0 1 setrgbcolor
(-ipv6) show
0 0 0 setrgbcolor
( ) show
0 0 1 setrgbcolor
(-samba) show
0 0 0 setrgbcolor
( ) show
1 0 0 setrgbcolor
(+ssl) show
0 0 0 setrgbcolor
( 1,921 kB ) show
cr
([ebuild  ) show
0 1 0 setrgbcolor
(N) show
0 0 0 setrgbcolor
(    ]      ) show
0 1 0 setrgbcolor
(app-admin/fam-2.7.0-r2) show
0 0 0 setrgbcolor
(  294 kB ) show
cr
([ebuild  ) show
0 1 0 setrgbcolor
(N) show
0 0 0 setrgbcolor
(    ]       ) show
0 1 0 setrgbcolor
(net-nds/portmap-5b-r9) show
0 0 0 setrgbcolor
(  ) show
0 0 1 setrgbcolor
(-debug) show
0 0 0 setrgbcolor
( ) show
0 0 1 setrgbcolor
((-selinux)) show
0 0 0 setrgbcolor
( ) show
1 0 0 setrgbcolor
(+tcpd) show
0 0 0 setrgbcolor
( 18 kB ) show
cr
([ebuild  ) show
0 1 0 setrgbcolor
(N) show
0 0 0 setrgbcolor
(    ]      ) show
0 1 0 setrgbcolor
(gnome-base/gnome-mime-data-2.4.2) show
0 0 0 setrgbcolor
(  ) show
0 0 1 setrgbcolor
(-debug) show
0 0 0 setrgbcolor
( 829 kB ) show
cr
([ebuild  ) show
0 1 0 setrgbcolor
(N) show
0 0 0 setrgbcolor
(    ]      ) show
0 1 0 setrgbcolor
(gnome-base/gconf-2.8.1-r1) show
0 0 0 setrgbcolor
(  ) show
0 0 1 setrgbcolor
(-debug) show
0 0 0 setrgbcolor
( ) show
0 0 1 setrgbcolor
(-doc) show
0 0 0 setrgbcolor
( 1,690 kB ) show
cr
([ebuild  ) show
0 1 0 setrgbcolor
(N) show
0 0 0 setrgbcolor
(    ]     ) show
0 1 0 setrgbcolor
(media-sound/esound-0.2.34) show
0 0 0 setrgbcolor
(  ) show
0 0 1 setrgbcolor
(-alsa) show
0 0 0 setrgbcolor
( ) show
0 0 1 setrgbcolor
(-ipv6) show
0 0 0 setrgbcolor
( ) show
1 0 0 setrgbcolor
(+tcpd) show
0 0 0 setrgbcolor
( 310 kB ) show
cr
([ebuild  ) show
0 1 0 setrgbcolor
(N) show
0 0 0 setrgbcolor
(    ]      ) show
0 1 0 setrgbcolor
(media-libs/audiofile-0.2.6-r1) show
0 0 0 setrgbcolor
(  365 kB ) show

%%EOF
