%!PS-Adobe-3.0 EPSF-3.0
%%Creator: inkscape 0.43
%%Pages: 1
%%Orientation: Portrait
%%BoundingBox: 3 1 45 47
%%HiResBoundingBox: 3.9450479 1.3858232 44.863746 46.896437
%%EndComments
%%Page: 1 1
0 48 translate
0.8 -0.8 scale
gsave [1 0 0 1 0 0] concat
gsave
0 0 0 setrgbcolor
newpath
19.892947 8.8486789 moveto
18.930334 8.8486789 18.155375 9.623637 18.155375 10.58625 curveto
7.1853097 45.465244 lineto
8.1944444 47.384924 lineto
42.643607 52.878909 lineto
43.60622 52.878909 44.381178 52.103951 44.381178 51.141339 curveto
56.079682 16.080233 lineto
56.079682 15.11762 55.304724 14.342662 54.342111 14.342662 curveto
19.892947 8.8486789 lineto
closepath
eofill
grestore
gsave
<<
/ShadingType 2
/ColorSpace /DeviceRGB
/Coords [6.0691859 28.433588 37.50606 28.296462]
/Extend [true true]
/Domain [0 1]
/Function <<
/FunctionType 3
/Functions
[
<<
/FunctionType 2
/Domain [0 1]
/C0 [0.8509804 0.80000001 0.90196079]
/C1 [0.4509804 0.40000001 0.49803922]
/N 1
>>
]
/Domain [0 1]
/Bounds [ ]
/Encode [ 0 1 ]
>>
>>
newpath
19.127448 7.4351967 moveto
18.20929 7.4351967 17.470122 8.1743634 17.470122 9.09252 curveto
7.0066859 42.360699 lineto
7.9692167 44.191723 lineto
40.827414 49.431979 lineto
41.745571 49.431979 42.484739 48.692812 42.484739 47.774655 curveto
53.642971 14.332775 lineto
53.642971 13.414617 52.903804 12.675451 51.985646 12.675451 curveto
19.127448 7.4351967 lineto
closepath
eoclip
shfill
grestore
0 0 0 setrgbcolor
[] 0 setdash
1.875 setlinewidth
0 setlinejoin
0 setlinecap
newpath
19.127448 7.4351967 moveto
18.20929 7.4351967 17.470122 8.1743634 17.470122 9.09252 curveto
7.0066859 42.360699 lineto
7.9692167 44.191723 lineto
40.827414 49.431979 lineto
41.745571 49.431979 42.484739 48.692812 42.484739 47.774655 curveto
53.642971 14.332775 lineto
53.642971 13.414617 52.903804 12.675451 51.985646 12.675451 curveto
19.127448 7.4351967 lineto
closepath
stroke
gsave
1 1 1 setrgbcolor
newpath
20.729416 6.3557927 moveto
19.811258 6.3557927 19.072089 7.0949611 19.072089 8.0131179 curveto
7.9138567 41.454998 lineto
7.9138567 42.373157 8.6530245 43.112324 9.571182 43.112324 curveto
38.172876 46.615591 lineto
39.091034 46.615591 39.830202 45.876424 39.830202 44.958266 curveto
50.988434 11.516385 lineto
50.988434 10.598227 50.249267 9.85906 49.331108 9.85906 curveto
20.729416 6.3557927 lineto
closepath
eofill
grestore
0 0 0 setrgbcolor
[] 0 setdash
0.98454994 setlinewidth
0 setlinejoin
0 setlinecap
newpath
20.729416 6.3557927 moveto
19.811258 6.3557927 19.072089 7.0949611 19.072089 8.0131179 curveto
7.9138567 41.454998 lineto
7.9138567 42.373157 8.6530245 43.112324 9.571182 43.112324 curveto
38.172876 46.615591 lineto
39.091034 46.615591 39.830202 45.876424 39.830202 44.958266 curveto
50.988434 11.516385 lineto
50.988434 10.598227 50.249267 9.85906 49.331108 9.85906 curveto
20.729416 6.3557927 lineto
closepath
stroke
gsave
<<
/ShadingType 2
/ColorSpace /DeviceRGB
/Coords [20.597731 31.839693 21.078689 51.466123]
/Extend [true true]
/Domain [0 1]
/Function <<
/FunctionType 3
/Functions
[
<<
/FunctionType 2
/Domain [0 1]
/C0 [0.96078432 0 0]
/C1 [0.65882355 0 0]
/N 1
>>
]
/Domain [0 1]
/Bounds [ ]
/Encode [ 0 1 ]
>>
>>
newpath
14.675278 34.102215 moveto
11.903005 35.824473 10.954143 41.759824 10.954143 45.58863 curveto
10.954143 49.417437 12.956987 55.26806 14.675278 57.075046 curveto
15.418362 57.856488 16.820327 53.353912 18.338267 53.353912 curveto
21.743076 53.353912 28.231568 58.349561 29.443526 57.075046 curveto
30.692943 55.761135 25.722392 49.417437 25.722392 45.58863 curveto
25.722392 41.759824 31.099915 35.824473 29.443526 34.102215 curveto
27.417544 31.995667 18.066132 31.995667 14.675278 34.102215 curveto
closepath
eoclip
shfill
grestore
0 0 0 setrgbcolor
[] 0 setdash
1.875 setlinewidth
0 setlinejoin
2 setlinecap
newpath
14.675278 34.102215 moveto
11.903005 35.824473 10.954143 41.759824 10.954143 45.58863 curveto
10.954143 49.417437 12.956987 55.26806 14.675278 57.075046 curveto
15.418362 57.856488 16.820327 53.353912 18.338267 53.353912 curveto
21.743076 53.353912 28.231568 58.349561 29.443526 57.075046 curveto
30.692943 55.761135 25.722392 49.417437 25.722392 45.58863 curveto
25.722392 41.759824 31.099915 35.824473 29.443526 34.102215 curveto
27.417544 31.995667 18.066132 31.995667 14.675278 34.102215 curveto
closepath
stroke
gsave [0.99503 0.09958006 -0.09958006 0.99503 0 0] concat
gsave
<<
/ShadingType 2
/ColorSpace /DeviceRGB
/Coords [22.508043 43.923466 22.419896 42.556872]
/Extend [true true]
/Domain [0 1]
/Function <<
/FunctionType 3
/Functions
[
<<
/FunctionType 2
/Domain [0 1]
/C0 [1 1 1]
/C1 [1 1 1]
/N 1
>>
]
/Domain [0 1]
/Bounds [ ]
/Encode [ 0 1 ]
>>
>>
newpath
16.183325 42.854893 moveto
28.654314 42.854893 lineto
29.290663 42.854893 29.802958 43.367188 29.802958 44.003536 curveto
29.802958 44.003536 lineto
29.802958 44.639885 29.290663 45.15218 28.654314 45.15218 curveto
16.183325 45.15218 lineto
15.546976 45.15218 15.034681 44.639885 15.034681 44.003536 curveto
15.034681 44.003536 lineto
15.034681 43.367188 15.546976 42.854893 16.183325 42.854893 curveto
closepath
eoclip
shfill
grestore
grestore
0 0 0 setrgbcolor
[] 0 setdash
1.9690998 setlinewidth
0 setlinejoin
2 setlinecap
newpath
14.675278 34.102215 moveto
11.903005 35.824473 10.954143 41.759824 10.954143 45.58863 curveto
10.954143 49.417437 12.956987 55.26806 14.675278 57.075046 curveto
15.418362 57.856488 16.820327 53.353912 18.338267 53.353912 curveto
21.743076 53.353912 28.231568 58.349561 29.443526 57.075046 curveto
30.692943 55.761135 25.722392 49.417437 25.722392 45.58863 curveto
25.722392 41.759824 31.099915 35.824473 29.443526 34.102215 curveto
27.417544 31.995667 18.066132 31.995667 14.675278 34.102215 curveto
closepath
stroke
gsave
1 1 1 setrgbcolor
newpath
20.635427 5.0182929 moveto
19.717268 5.0182929 18.978101 5.7574602 18.978101 6.6756212 curveto
7.8198693 40.1175 lineto
7.8198693 41.035658 8.559037 41.774827 9.4771941 41.774827 curveto
36.877273 44.453765 lineto
37.79543 44.453765 38.534599 43.714598 38.534599 42.79644 curveto
49.69283 9.35456 lineto
49.69283 8.4363994 48.953663 7.6972327 48.035504 7.6972327 curveto
20.635427 5.0182929 lineto
closepath
eofill
grestore
0 0 0 setrgbcolor
[] 0 setdash
0.98454994 setlinewidth
0 setlinejoin
0 setlinecap
newpath
20.635427 5.0182929 moveto
19.717268 5.0182929 18.978101 5.7574602 18.978101 6.6756212 curveto
7.8198693 40.1175 lineto
7.8198693 41.035658 8.559037 41.774827 9.4771941 41.774827 curveto
36.877273 44.453765 lineto
37.79543 44.453765 38.534599 43.714598 38.534599 42.79644 curveto
49.69283 9.35456 lineto
49.69283 8.4363994 48.953663 7.6972327 48.035504 7.6972327 curveto
20.635427 5.0182929 lineto
closepath
stroke
gsave
1 1 1 setrgbcolor
newpath
20.288028 3.4822657 moveto
19.36987 3.4822657 18.630702 4.2214344 18.630702 5.1395899 curveto
7.4724707 38.581473 lineto
7.4724707 39.499632 8.2116379 40.238798 9.129797 40.238798 curveto
36.182474 42.323186 lineto
37.100634 42.323186 37.8398 41.584019 37.8398 40.66586 curveto
48.998032 7.223978 lineto
48.998032 6.3058219 48.258865 5.5666537 47.340708 5.5666537 curveto
20.288028 3.4822657 lineto
closepath
eofill
grestore
0 0 0 setrgbcolor
[] 0 setdash
0.98455 setlinewidth
0 setlinejoin
0 setlinecap
newpath
20.288028 3.4822657 moveto
19.36987 3.4822657 18.630702 4.2214344 18.630702 5.1395899 curveto
7.4724707 38.581473 lineto
7.4724707 39.499632 8.2116379 40.238798 9.129797 40.238798 curveto
36.182474 42.323186 lineto
37.100634 42.323186 37.8398 41.584019 37.8398 40.66586 curveto
48.998032 7.223978 lineto
48.998032 6.3058219 48.258865 5.5666537 47.340708 5.5666537 curveto
20.288028 3.4822657 lineto
closepath
stroke
gsave
<<
/ShadingType 2
/ColorSpace /DeviceRGB
/Coords [4.9313098 23.542991 51.312115 23.542991]
/Extend [true true]
/Domain [0 1]
/Function <<
/FunctionType 3
/Functions
[
<<
/FunctionType 2
/Domain [0 1]
/C0 [0.8509804 0.80000001 0.90196079]
/C1 [0.4509804 0.40000001 0.49803922]
/N 1
>>
]
/Domain [0 1]
/Bounds [ ]
/Encode [ 0 1 ]
>>
>>
newpath
18.900362 2.3169532 moveto
17.982206 2.3169532 17.232852 3.0315654 17.232852 3.9497235 curveto
6.2203372 36.987267 lineto
5.5224122 39.081043 6.057393 41.388468 6.1854409 43.280752 curveto
6.2098357 44.103204 7.9844685 44.775588 8.9300414 44.768981 curveto
8.8431913 41.839285 lineto
8.7386452 38.312622 9.3452458 38.887748 12.695343 38.909588 curveto
37.555631 39.071655 lineto
38.473789 39.071653 39.223141 38.322302 39.223141 37.404145 curveto
50.374615 3.9497235 lineto
50.374616 3.0315653 49.660001 2.3169532 48.741844 2.3169532 curveto
18.900362 2.3169532 lineto
closepath
eoclip
shfill
grestore
0 0 0 setrgbcolor
[] 0 setdash
1.875 setlinewidth
0 setlinejoin
0 setlinecap
newpath
18.900362 2.3169532 moveto
17.982206 2.3169532 17.232852 3.0315654 17.232852 3.9497235 curveto
6.2203372 36.987267 lineto
5.5224122 39.081043 6.057393 41.388468 6.1854409 43.280752 curveto
6.2098357 44.103204 7.9844685 44.775588 8.9300414 44.768981 curveto
8.8431913 41.839285 lineto
8.7386452 38.312622 9.3452458 38.887748 12.695343 38.909588 curveto
37.555631 39.071655 lineto
38.473789 39.071653 39.223141 38.322302 39.223141 37.404145 curveto
50.374615 3.9497235 lineto
50.374616 3.0315653 49.660001 2.3169532 48.741844 2.3169532 curveto
18.900362 2.3169532 lineto
closepath
stroke
gsave
<<
/ShadingType 2
/ColorSpace /DeviceRGB
/Coords [-1.7455475 -5.4191448 38.031096 26.015569]
/Extend [true true]
/Domain [0 1]
/Function <<
/FunctionType 3
/Functions
[
<<
/FunctionType 2
/Domain [0 1]
/C0 [1 1 1]
/C1 [1 1 1]
/N 1
>>
]
/Domain [0 1]
/Bounds [ ]
/Encode [ 0 1 ]
>>
>>
newpath
10.115772 32.582391 moveto
11.784899 29.145036 16.751262 11.335833 22.987203 7.3806871 curveto
27.132753 4.8668436 42.98183 4.9869041 45.560502 4.1612944 curveto
46.357957 3.9439579 28.561542 3.5729559 20.092033 4.9186941 curveto
18.04056 6.7975774 9.0740695 34.76597 10.115772 32.582391 curveto
closepath
eoclip
shfill
grestore
gsave
<<
/ShadingType 2
/ColorSpace /DeviceRGB
/Coords [-3.6347146 32.28855 36.980527 42.428431]
/Extend [true true]
/Domain [0 1]
/Function <<
/FunctionType 3
/Functions
[
<<
/FunctionType 2
/Domain [0 1]
/C0 [1 1 1]
/C1 [1 1 1]
/N 1
>>
]
/Domain [0 1]
/Bounds [ ]
/Encode [ 0 1 ]
>>
>>
newpath
7.2997398 42.620052 moveto
7.4585688 42.524755 7.6344225 38.347633 8.8506869 37.82843 curveto
15.621162 35.621927 37.277712 37.583353 37.277712 37.265186 curveto
37.277712 36.946456 9.1788295 35.347305 7.9647343 36.50717 curveto
7.0965021 37.424454 7.0384013 42.776854 7.2997398 42.620052 curveto
closepath
eoclip
shfill
grestore
grestore
showpage
