%!PS-Adobe-3.0 EPSF-3.0
%%Creator: inkscape 0.43
%%Pages: 1
%%Orientation: Portrait
%%BoundingBox: 1 1 48 47
%%HiResBoundingBox: 1.2240779 1.1946199 47.366375 46.253516
%%EndComments
%%Page: 1 1
0 48 translate
0.8 -0.8 scale
gsave [1 0 0 1 0 0] concat
gsave
0 0 0 setrgbcolor
newpath
4.7106983 22.84369 moveto
7.6318846 19.956735 7.1733586 20.085458 9.8330406 18.90338 curveto
11.162875 18.312416 11.659467 18.052135 12.971656 18.045274 curveto
14.28386 18.038263 16.137462 18.216059 17.439375 18.637879 curveto
20.043153 19.481518 18.908656 19.395901 20.386217 19.001973 curveto
21.863776 18.607898 21.65391 18.312416 21.752355 17.228782 curveto
21.850799 16.145209 21.949393 9.446772 22.737395 7.9691683 curveto
23.525397 6.4915623 23.426954 6.0975313 24.411993 7.7721453 curveto
25.397033 9.446757 25.791109 13.584046 26.382223 14.96313 curveto
26.973188 16.342231 27.170225 17.130278 27.465707 17.327286 curveto
27.76119 17.524309 27.564301 17.721317 29.041861 17.425805 curveto
30.51942 17.130278 32.095575 17.228782 33.376097 17.327286 curveto
34.656769 17.425805 35.247733 17.524309 35.838847 17.425805 curveto
36.429811 17.327286 36.528404 17.524309 36.922331 16.834751 curveto
37.316406 16.145209 38.399891 13.387022 38.498485 12.007936 curveto
38.596929 10.628835 38.301448 5.8020043 37.710483 4.7184303 curveto
37.119369 3.6348663 37.710483 3.1423274 38.991005 4.7184303 curveto
40.271527 6.2945543 41.436737 8.7572293 41.929257 10.037796 curveto
42.421777 11.318378 42.228189 11.063624 42.499902 12.935245 curveto
42.302865 14.80688 42.06865 16.306287 41.335891 17.260077 curveto
40.989682 18.103338 40.468565 18.965999 41.650643 18.90338 curveto
42.832721 18.509305 43.325241 17.721317 44.507319 16.93327 curveto
45.689397 16.145209 48.644666 14.569114 51.008822 14.273588 curveto
53.372979 13.978061 53.865499 14.175084 54.850538 14.569114 curveto
55.835579 14.96313 55.835579 14.470596 57.116251 15.455665 curveto
58.396773 16.440735 59.972925 17.524309 58.790849 19.001973 curveto
57.608771 20.479534 56.131209 20.184052 55.441652 20.972054 curveto
54.752094 21.760056 52.978902 22.351169 51.993863 22.548208 curveto
51.008822 22.745097 45.985028 22.942134 45.295471 22.745097 curveto
44.605912 22.548208 43.029759 21.267537 43.817762 23.139172 curveto
44.605912 25.010809 45.590952 29.542082 45.787991 31.315274 curveto
45.985028 33.088317 46.674586 38.900261 47.068513 41.461455 curveto
47.462588 44.022649 47.758071 46.288212 47.955108 48.947999 curveto
48.152147 51.607637 47.462588 51.90312 47.265551 53.085197 curveto
47.068513 53.77009 47.167106 53.774755 45.787991 54.759795 curveto
44.408875 55.744836 44.267174 55.025446 42.494132 55.61641 curveto
40.720941 56.207523 40.468565 56.040466 38.793968 56.926914 curveto
37.119369 57.813509 33.868617 59.192625 32.588095 58.108991 curveto
31.307424 57.025507 29.534381 54.562757 27.564301 52.888159 curveto
25.594071 51.213562 22.934434 47.371845 22.343319 41.067379 curveto
21.752355 34.762914 20.27047 28.133135 19.39685 26.060135 curveto
18.523231 23.987137 19.250825 23.704631 16.827005 25.109253 curveto
14.403201 26.514023 12.591228 26.586961 10.818111 26.586961 curveto
9.0449786 26.586961 6.2867916 25.404883 4.8092023 24.616733 curveto
3.3315993 23.82873 3.5286113 24.025768 4.7106983 22.84369 curveto
closepath
fill
grestore
0.14901961 0.098039217 0.2 setrgbcolor
[] 0 setdash
0 setlinewidth
0 setlinejoin
0 setlinecap
newpath
4.7106983 22.84369 moveto
7.6318846 19.956735 7.1733586 20.085458 9.8330406 18.90338 curveto
11.162875 18.312416 11.659467 18.052135 12.971656 18.045274 curveto
14.28386 18.038263 16.137462 18.216059 17.439375 18.637879 curveto
20.043153 19.481518 18.908656 19.395901 20.386217 19.001973 curveto
21.863776 18.607898 21.65391 18.312416 21.752355 17.228782 curveto
21.850799 16.145209 21.949393 9.446772 22.737395 7.9691683 curveto
23.525397 6.4915623 23.426954 6.0975313 24.411993 7.7721453 curveto
25.397033 9.446757 25.791109 13.584046 26.382223 14.96313 curveto
26.973188 16.342231 27.170225 17.130278 27.465707 17.327286 curveto
27.76119 17.524309 27.564301 17.721317 29.041861 17.425805 curveto
30.51942 17.130278 32.095575 17.228782 33.376097 17.327286 curveto
34.656769 17.425805 35.247733 17.524309 35.838847 17.425805 curveto
36.429811 17.327286 36.528404 17.524309 36.922331 16.834751 curveto
37.316406 16.145209 38.399891 13.387022 38.498485 12.007936 curveto
38.596929 10.628835 38.301448 5.8020043 37.710483 4.7184303 curveto
37.119369 3.6348663 37.710483 3.1423274 38.991005 4.7184303 curveto
40.271527 6.2945543 41.436737 8.7572293 41.929257 10.037796 curveto
42.421777 11.318378 42.228189 11.063624 42.499902 12.935245 curveto
42.302865 14.80688 42.06865 16.306287 41.335891 17.260077 curveto
40.989682 18.103338 40.468565 18.965999 41.650643 18.90338 curveto
42.832721 18.509305 43.325241 17.721317 44.507319 16.93327 curveto
45.689397 16.145209 48.644666 14.569114 51.008822 14.273588 curveto
53.372979 13.978061 53.865499 14.175084 54.850538 14.569114 curveto
55.835579 14.96313 55.835579 14.470596 57.116251 15.455665 curveto
58.396773 16.440735 59.972925 17.524309 58.790849 19.001973 curveto
57.608771 20.479534 56.131209 20.184052 55.441652 20.972054 curveto
54.752094 21.760056 52.978902 22.351169 51.993863 22.548208 curveto
51.008822 22.745097 45.985028 22.942134 45.295471 22.745097 curveto
44.605912 22.548208 43.029759 21.267537 43.817762 23.139172 curveto
44.605912 25.010809 45.590952 29.542082 45.787991 31.315274 curveto
45.985028 33.088317 46.674586 38.900261 47.068513 41.461455 curveto
47.462588 44.022649 47.758071 46.288212 47.955108 48.947999 curveto
48.152147 51.607637 47.462588 51.90312 47.265551 53.085197 curveto
47.068513 53.77009 47.167106 53.774755 45.787991 54.759795 curveto
44.408875 55.744836 44.267174 55.025446 42.494132 55.61641 curveto
40.720941 56.207523 40.468565 56.040466 38.793968 56.926914 curveto
37.119369 57.813509 33.868617 59.192625 32.588095 58.108991 curveto
31.307424 57.025507 29.534381 54.562757 27.564301 52.888159 curveto
25.594071 51.213562 22.934434 47.371845 22.343319 41.067379 curveto
21.752355 34.762914 20.27047 28.133135 19.39685 26.060135 curveto
18.523231 23.987137 19.250825 23.704631 16.827005 25.109253 curveto
14.403201 26.514023 12.591228 26.586961 10.818111 26.586961 curveto
9.0449786 26.586961 6.2867916 25.404883 4.8092023 24.616733 curveto
3.3315993 23.82873 3.5286113 24.025768 4.7106983 22.84369 curveto
closepath
stroke
gsave
0.14901961 0.098039217 0.2 setrgbcolor
newpath
2.4785706 21.31415 moveto
5.3997572 18.427195 4.9412304 18.555918 7.6009132 17.37384 curveto
8.930747 16.782876 9.4273392 16.522595 10.739528 16.515734 curveto
12.051732 16.508723 13.905334 16.686519 15.207247 17.108339 curveto
17.811025 17.951978 16.676528 17.866361 18.154089 17.472433 curveto
19.631648 17.078358 19.421782 16.782876 19.520227 15.699242 curveto
19.618671 14.615669 19.717265 7.9172318 20.505267 6.4396275 curveto
21.293269 4.9620222 21.194826 4.567991 22.179865 6.2426046 curveto
23.164905 7.9172172 23.558981 12.054506 24.150095 13.43359 curveto
24.74106 14.812691 24.938097 15.600738 25.233579 15.797746 curveto
25.529062 15.994769 25.332173 16.191777 26.809733 15.896265 curveto
28.287292 15.600738 29.863447 15.699242 31.143969 15.797746 curveto
32.424641 15.896265 33.015605 15.994769 33.606719 15.896265 curveto
34.197683 15.797746 34.296276 15.994769 34.690203 15.305211 curveto
35.084278 14.615669 36.167763 11.857482 36.266357 10.478396 curveto
36.364801 9.0992954 36.06932 4.2724639 35.478355 3.1888899 curveto
34.887241 2.1053255 35.478355 1.6127872 36.758877 3.1888899 curveto
38.039399 4.7650139 39.204609 7.227689 39.697129 8.5082558 curveto
40.189649 9.7888382 39.996061 9.534084 40.267774 11.405705 curveto
40.070737 13.27734 39.836522 14.776747 39.103763 15.730537 curveto
38.757554 16.573798 38.236437 17.436459 39.418515 17.37384 curveto
40.600593 16.979765 41.093113 16.191777 42.275191 15.40373 curveto
43.457269 14.615669 46.412538 13.039574 48.776694 12.744048 curveto
51.140851 12.448521 51.633371 12.645544 52.61841 13.039574 curveto
53.603451 13.43359 53.603451 12.941056 54.884123 13.926125 curveto
56.164645 14.911195 57.740797 15.994769 56.558721 17.472433 curveto
55.376643 18.949994 53.899081 18.654512 53.209524 19.442514 curveto
52.519966 20.230516 50.746774 20.821629 49.761735 21.018668 curveto
48.776694 21.215557 43.7529 21.412594 43.063343 21.215557 curveto
42.373784 21.018668 40.797631 19.737997 41.585634 21.609632 curveto
42.373784 23.481269 43.358824 28.012542 43.555863 29.785734 curveto
43.7529 31.558777 44.442458 37.370721 44.836385 39.931915 curveto
45.23046 42.493109 45.525943 44.758672 45.72298 47.418459 curveto
45.920019 50.078097 45.23046 50.37358 45.033423 51.555657 curveto
44.836385 52.24055 44.934978 52.245215 43.555863 53.230255 curveto
42.176747 54.215296 42.035046 53.495906 40.262004 54.08687 curveto
38.488813 54.677983 38.236437 54.510926 36.56184 55.397374 curveto
34.887241 56.283969 31.636489 57.663085 30.355967 56.579451 curveto
29.075296 55.495967 27.302253 53.033217 25.332173 51.358619 curveto
23.361943 49.684022 20.702306 45.842305 20.111191 39.537839 curveto
19.520227 33.233374 18.038342 26.603595 17.164722 24.530595 curveto
16.291103 22.457597 17.018697 22.175091 14.594877 23.579713 curveto
12.171073 24.984483 10.3591 25.057421 8.5859832 25.057421 curveto
6.8128511 25.057421 4.0546643 23.875343 2.5770746 23.087193 curveto
1.0994716 22.29919 1.2964836 22.496228 2.4785706 21.31415 curveto
closepath
fill
grestore
0.14901961 0.098039217 0.2 setrgbcolor
[] 0 setdash
0 setlinewidth
0 setlinejoin
0 setlinecap
newpath
2.4785706 21.31415 moveto
5.3997572 18.427195 4.9412304 18.555918 7.6009132 17.37384 curveto
8.930747 16.782876 9.4273392 16.522595 10.739528 16.515734 curveto
12.051732 16.508723 13.905334 16.686519 15.207247 17.108339 curveto
17.811025 17.951978 16.676528 17.866361 18.154089 17.472433 curveto
19.631648 17.078358 19.421782 16.782876 19.520227 15.699242 curveto
19.618671 14.615669 19.717265 7.9172318 20.505267 6.4396275 curveto
21.293269 4.9620222 21.194826 4.567991 22.179865 6.2426046 curveto
23.164905 7.9172172 23.558981 12.054506 24.150095 13.43359 curveto
24.74106 14.812691 24.938097 15.600738 25.233579 15.797746 curveto
25.529062 15.994769 25.332173 16.191777 26.809733 15.896265 curveto
28.287292 15.600738 29.863447 15.699242 31.143969 15.797746 curveto
32.424641 15.896265 33.015605 15.994769 33.606719 15.896265 curveto
34.197683 15.797746 34.296276 15.994769 34.690203 15.305211 curveto
35.084278 14.615669 36.167763 11.857482 36.266357 10.478396 curveto
36.364801 9.0992954 36.06932 4.2724639 35.478355 3.1888899 curveto
34.887241 2.1053255 35.478355 1.6127872 36.758877 3.1888899 curveto
38.039399 4.7650139 39.204609 7.227689 39.697129 8.5082558 curveto
40.189649 9.7888382 39.996061 9.534084 40.267774 11.405705 curveto
40.070737 13.27734 39.836522 14.776747 39.103763 15.730537 curveto
38.757554 16.573798 38.236437 17.436459 39.418515 17.37384 curveto
40.600593 16.979765 41.093113 16.191777 42.275191 15.40373 curveto
43.457269 14.615669 46.412538 13.039574 48.776694 12.744048 curveto
51.140851 12.448521 51.633371 12.645544 52.61841 13.039574 curveto
53.603451 13.43359 53.603451 12.941056 54.884123 13.926125 curveto
56.164645 14.911195 57.740797 15.994769 56.558721 17.472433 curveto
55.376643 18.949994 53.899081 18.654512 53.209524 19.442514 curveto
52.519966 20.230516 50.746774 20.821629 49.761735 21.018668 curveto
48.776694 21.215557 43.7529 21.412594 43.063343 21.215557 curveto
42.373784 21.018668 40.797631 19.737997 41.585634 21.609632 curveto
42.373784 23.481269 43.358824 28.012542 43.555863 29.785734 curveto
43.7529 31.558777 44.442458 37.370721 44.836385 39.931915 curveto
45.23046 42.493109 45.525943 44.758672 45.72298 47.418459 curveto
45.920019 50.078097 45.23046 50.37358 45.033423 51.555657 curveto
44.836385 52.24055 44.934978 52.245215 43.555863 53.230255 curveto
42.176747 54.215296 42.035046 53.495906 40.262004 54.08687 curveto
38.488813 54.677983 38.236437 54.510926 36.56184 55.397374 curveto
34.887241 56.283969 31.636489 57.663085 30.355967 56.579451 curveto
29.075296 55.495967 27.302253 53.033217 25.332173 51.358619 curveto
23.361943 49.684022 20.702306 45.842305 20.111191 39.537839 curveto
19.520227 33.233374 18.038342 26.603595 17.164722 24.530595 curveto
16.291103 22.457597 17.018697 22.175091 14.594877 23.579713 curveto
12.171073 24.984483 10.3591 25.057421 8.5859832 25.057421 curveto
6.8128511 25.057421 4.0546643 23.875343 2.5770746 23.087193 curveto
1.0994716 22.29919 1.2964836 22.496228 2.4785706 21.31415 curveto
closepath
stroke
gsave
<<
/ShadingType 2
/ColorSpace /DeviceRGB
/Coords [43.460997 14.618987 53.331417 16.71396]
/Extend [true true]
/Domain [0 1]
/Function <<
/FunctionType 3
/Functions
[
<<
/FunctionType 2
/Domain [0 1]
/C0 [1 1 1]
/C1 [0.8509804 0.80000001 0.90196079]
/N 1
>>
]
/Domain [0 1]
/Bounds [ ]
/Encode [ 0 1 ]
>>
>>
newpath
44.761526 15.526345 moveto
46.250344 15.148311 46.561941 15.113941 47.185131 14.804642 curveto
47.808322 14.495343 48.293044 14.529711 49.678048 14.564079 curveto
51.063053 14.598449 51.616933 14.770274 52.240124 15.04522 curveto
52.863466 15.32015 53.140407 15.388872 52.240124 15.526345 curveto
51.339993 15.663817 49.089511 15.870011 47.669853 15.973101 curveto
46.250344 16.076205 45.073122 16.213709 44.38062 16.55739 curveto
43.688117 16.901071 43.099582 16.935322 43.480487 16.55739 curveto
43.861243 16.17931 44.207494 15.698185 44.761526 15.526345 curveto
closepath
clip
gsave [0.961222 0 0 1.040342 0 0] concat
shfill
grestore
grestore
0.14901961 0.098039217 0.2 setrgbcolor
[] 0 setdash
0 setlinewidth
0 setlinejoin
0 setlinecap
newpath
44.761526 15.526345 moveto
46.250344 15.148311 46.561941 15.113941 47.185131 14.804642 curveto
47.808322 14.495343 48.293044 14.529711 49.678048 14.564079 curveto
51.063053 14.598449 51.616933 14.770274 52.240124 15.04522 curveto
52.863466 15.32015 53.140407 15.388872 52.240124 15.526345 curveto
51.339993 15.663817 49.089511 15.870011 47.669853 15.973101 curveto
46.250344 16.076205 45.073122 16.213709 44.38062 16.55739 curveto
43.688117 16.901071 43.099582 16.935322 43.480487 16.55739 curveto
43.861243 16.17931 44.207494 15.698185 44.761526 15.526345 curveto
closepath
stroke
gsave
<<
/ShadingType 2
/ColorSpace /DeviceRGB
/Coords [42.907138 16.896408 53.593632 19.608632]
/Extend [true true]
/Domain [0 1]
/Function <<
/FunctionType 3
/Functions
[
<<
/FunctionType 2
/Domain [0 1]
/C0 [1 1 1]
/C1 [0.8509804 0.80000001 0.90196079]
/N 1
>>
]
/Domain [0 1]
/Bounds [ ]
/Encode [ 0 1 ]
>>
>>
newpath
47.458966 17.382197 moveto
49.294035 17.244603 50.367292 17.14156 51.232921 16.901071 curveto
52.098546 16.660434 51.925421 16.832275 52.825553 16.797879 curveto
53.725836 16.763479 53.82965 16.866674 53.691182 17.107161 curveto
53.55271 17.347798 52.894865 17.931967 52.237017 18.138207 curveto
51.579172 18.344447 51.094449 18.310048 50.263477 18.894216 curveto
49.432505 19.478537 48.151468 19.719024 46.731809 19.684626 curveto
45.3123 19.650377 44.308203 19.890865 43.581044 19.547183 curveto
42.854038 19.203501 42.611603 18.997413 43.20029 18.447491 curveto
43.788826 17.897571 44.239043 17.931967 45.3123 17.725879 curveto
46.385559 17.519639 46.870279 17.416446 47.458966 17.382197 curveto
closepath
clip
shfill
grestore
0.14901961 0.098039217 0.2 setrgbcolor
[] 0 setdash
0 setlinewidth
0 setlinejoin
0 setlinecap
newpath
47.458966 17.382197 moveto
49.294035 17.244603 50.367292 17.14156 51.232921 16.901071 curveto
52.098546 16.660434 51.925421 16.832275 52.825553 16.797879 curveto
53.725836 16.763479 53.82965 16.866674 53.691182 17.107161 curveto
53.55271 17.347798 52.894865 17.931967 52.237017 18.138207 curveto
51.579172 18.344447 51.094449 18.310048 50.263477 18.894216 curveto
49.432505 19.478537 48.151468 19.719024 46.731809 19.684626 curveto
45.3123 19.650377 44.308203 19.890865 43.581044 19.547183 curveto
42.854038 19.203501 42.611603 18.997413 43.20029 18.447491 curveto
43.788826 17.897571 44.239043 17.931967 45.3123 17.725879 curveto
46.385559 17.519639 46.870279 17.416446 47.458966 17.382197 curveto
closepath
stroke
gsave
<<
/ShadingType 2
/ColorSpace /DeviceRGB
/Coords [20.727566 9.9755754 21.731556 25.218849]
/Extend [true true]
/Domain [0 1]
/Function <<
/FunctionType 3
/Functions
[
<<
/FunctionType 2
/Domain [0 1]
/C0 [1 1 1]
/C1 [0.8509804 0.80000001 0.90196079]
/N 1
>>
]
/Domain [0 1]
/Bounds [ ]
/Encode [ 0 1 ]
>>
>>
newpath
20.736032 13.830826 moveto
20.772962 11.931359 20.995356 11.200789 21.217749 10.47022 curveto
21.440142 9.7396501 21.40305 9.885772 21.699466 10.47022 curveto
21.995883 11.054669 22.403577 12.588869 22.551786 13.100257 curveto
22.699994 13.611661 23.107687 14.634455 23.292989 15.03627 curveto
23.478289 15.438068 23.700683 15.839931 22.996572 15.912896 curveto
22.292462 15.986019 21.995883 16.095546 21.514165 16.095546 curveto
21.032448 16.095546 20.624755 15.766808 20.661847 15.10933 curveto
20.698939 14.451805 20.698939 14.013476 20.736032 13.830826 curveto
closepath
clip
gsave [2.510355 0 0 0.39835 0 0] concat
shfill
grestore
grestore
0.14901961 0.098039217 0.2 setrgbcolor
[] 0 setdash
0 setlinewidth
0 setlinejoin
0 setlinecap
newpath
20.736032 13.830826 moveto
20.772962 11.931359 20.995356 11.200789 21.217749 10.47022 curveto
21.440142 9.7396501 21.40305 9.885772 21.699466 10.47022 curveto
21.995883 11.054669 22.403577 12.588869 22.551786 13.100257 curveto
22.699994 13.611661 23.107687 14.634455 23.292989 15.03627 curveto
23.478289 15.438068 23.700683 15.839931 22.996572 15.912896 curveto
22.292462 15.986019 21.995883 16.095546 21.514165 16.095546 curveto
21.032448 16.095546 20.624755 15.766808 20.661847 15.10933 curveto
20.698939 14.451805 20.698939 14.013476 20.736032 13.830826 curveto
closepath
stroke
gsave
<<
/ShadingType 2
/ColorSpace /DeviceRGB
/Coords [35.648363 6.5457744 36.739459 34.460417]
/Extend [true true]
/Domain [0 1]
/Function <<
/FunctionType 3
/Functions
[
<<
/FunctionType 2
/Domain [0 1]
/C0 [1 1 1]
/C1 [0.8509804 0.80000001 0.90196079]
/N 1
>>
]
/Domain [0 1]
/Bounds [ ]
/Encode [ 0 1 ]
>>
>>
newpath
37.459144 11.412117 moveto
37.559057 10.526575 37.499613 9.7722168 37.499613 9.4442368 curveto
37.499613 9.116271 37.504547 8.7157005 37.504547 8.4861188 curveto
37.504547 8.2565371 37.525752 7.837136 37.525752 7.5091559 curveto
37.525752 7.1811901 37.302894 5.3610879 37.668952 6.4106269 curveto
38.035011 7.4601517 38.700316 8.8158688 38.822815 10.076022 curveto
39.055656 11.059948 38.737737 12.105753 38.737737 12.532117 curveto
38.737737 12.958495 38.490711 13.642364 38.191261 14.527906 curveto
37.891811 15.413462 37.804948 16.263251 37.305818 16.29605 curveto
36.806831 16.328849 36.394418 16.069422 35.928591 16.069422 curveto
35.462764 16.069422 35.496069 16.003823 35.828823 15.577445 curveto
36.161577 15.151066 37.226303 13.183215 37.459144 11.412117 curveto
closepath
clip
gsave [2.868297 0 0 0.348639 0 0] concat
shfill
grestore
grestore
0.14901961 0.098039217 0.2 setrgbcolor
[] 0 setdash
0 setlinewidth
0 setlinejoin
0 setlinecap
newpath
37.459144 11.412117 moveto
37.559057 10.526575 37.499613 9.7722168 37.499613 9.4442368 curveto
37.499613 9.116271 37.504547 8.7157005 37.504547 8.4861188 curveto
37.504547 8.2565371 37.525752 7.837136 37.525752 7.5091559 curveto
37.525752 7.1811901 37.302894 5.3610879 37.668952 6.4106269 curveto
38.035011 7.4601517 38.700316 8.8158688 38.822815 10.076022 curveto
39.055656 11.059948 38.737737 12.105753 38.737737 12.532117 curveto
38.737737 12.958495 38.490711 13.642364 38.191261 14.527906 curveto
37.891811 15.413462 37.804948 16.263251 37.305818 16.29605 curveto
36.806831 16.328849 36.394418 16.069422 35.928591 16.069422 curveto
35.462764 16.069422 35.496069 16.003823 35.828823 15.577445 curveto
36.161577 15.151066 37.226303 13.183215 37.459144 11.412117 curveto
closepath
stroke
gsave
<<
/ShadingType 2
/ColorSpace /DeviceRGB
/Coords [18.252333 34.333952 43.612446 34.333952]
/Extend [true true]
/Domain [0 1]
/Function <<
/FunctionType 3
/Functions
[
<<
/FunctionType 2
/Domain [0 1]
/C0 [1 1 1]
/C1 [0.8509804 0.80000001 0.90196079]
/N 1
>>
]
/Domain [0 1]
/Bounds [ ]
/Encode [ 0 1 ]
>>
>>
newpath
22.084966 33.556261 moveto
21.731894 30.87304 21.661372 29.390231 21.096427 27.624873 curveto
20.531635 25.859669 18.978151 21.693639 18.483881 20.563748 curveto
17.989612 19.434011 18.272007 19.151615 19.47242 18.869066 curveto
20.672833 18.58667 25.191935 17.174383 27.875156 17.315735 curveto
30.558377 17.456933 32.535455 16.468394 35.359875 18.021725 curveto
38.184294 19.575209 39.102311 18.798544 39.8083 21.764161 curveto
40.514444 24.729778 41.361785 31.649705 41.785532 33.838657 curveto
42.209126 36.027609 43.127143 43.583003 43.409539 44.571542 curveto
43.691935 45.560081 43.974484 45.842477 42.067928 45.771955 curveto
40.161372 45.701279 37.690024 45.560081 34.724407 46.972368 curveto
31.75879 48.384501 29.287289 50.220381 28.581299 51.067722 curveto
27.875156 51.915063 27.875156 51.491469 26.957139 50.71465 curveto
26.039276 49.937985 24.203396 47.254764 23.779648 44.924614 curveto
23.356054 42.594464 22.367515 37.934165 22.29684 36.733752 curveto
22.226164 35.533339 22.084966 34.474124 22.084966 33.556261 curveto
closepath
clip
shfill
grestore
0.14901961 0.098039217 0.2 setrgbcolor
[] 0 setdash
0 setlinewidth
0 setlinejoin
0 setlinecap
newpath
22.084966 33.556261 moveto
21.731894 30.87304 21.661372 29.390231 21.096427 27.624873 curveto
20.531635 25.859669 18.978151 21.693639 18.483881 20.563748 curveto
17.989612 19.434011 18.272007 19.151615 19.47242 18.869066 curveto
20.672833 18.58667 25.191935 17.174383 27.875156 17.315735 curveto
30.558377 17.456933 32.535455 16.468394 35.359875 18.021725 curveto
38.184294 19.575209 39.102311 18.798544 39.8083 21.764161 curveto
40.514444 24.729778 41.361785 31.649705 41.785532 33.838657 curveto
42.209126 36.027609 43.127143 43.583003 43.409539 44.571542 curveto
43.691935 45.560081 43.974484 45.842477 42.067928 45.771955 curveto
40.161372 45.701279 37.690024 45.560081 34.724407 46.972368 curveto
31.75879 48.384501 29.287289 50.220381 28.581299 51.067722 curveto
27.875156 51.915063 27.875156 51.491469 26.957139 50.71465 curveto
26.039276 49.937985 24.203396 47.254764 23.779648 44.924614 curveto
23.356054 42.594464 22.367515 37.934165 22.29684 36.733752 curveto
22.226164 35.533339 22.084966 34.474124 22.084966 33.556261 curveto
closepath
stroke
gsave
0.14901961 0.098039217 0.2 setrgbcolor
newpath
25.385484 29.639542 moveto
26.97995 28.987311 27.487258 28.914928 28.21203 29.56716 curveto
28.936802 30.219391 29.661573 31.324684 28.936802 32.049298 curveto
28.21203 32.774069 27.849644 32.755934 27.05249 33.335783 curveto
26.255178 33.915632 25.385484 33.625629 24.878175 33.335783 curveto
24.370866 33.045938 24.225944 32.611012 24.081021 31.95878 curveto
23.936098 31.306549 24.443407 30.291932 25.385484 29.639542 curveto
closepath
fill
grestore
0.14901961 0.098039217 0.2 setrgbcolor
[] 0 setdash
0 setlinewidth
0 setlinejoin
0 setlinecap
newpath
25.385484 29.639542 moveto
26.97995 28.987311 27.487258 28.914928 28.21203 29.56716 curveto
28.936802 30.219391 29.661573 31.324684 28.936802 32.049298 curveto
28.21203 32.774069 27.849644 32.755934 27.05249 33.335783 curveto
26.255178 33.915632 25.385484 33.625629 24.878175 33.335783 curveto
24.370866 33.045938 24.225944 32.611012 24.081021 31.95878 curveto
23.936098 31.306549 24.443407 30.291932 25.385484 29.639542 curveto
closepath
stroke
gsave
0.14901961 0.098039217 0.2 setrgbcolor
newpath
35.728856 25.073775 moveto
37.029493 25.120068 37.470789 25.445328 37.470789 26.374412 curveto
37.470789 27.303295 36.40222 27.884074 35.751901 27.884074 curveto
35.101582 27.884074 34.404972 27.326543 34.218993 26.583436 curveto
34.033217 25.840128 34.311982 25.050527 35.728856 25.073775 curveto
closepath
fill
grestore
0.14901961 0.098039217 0.2 setrgbcolor
[] 0 setdash
0 setlinewidth
0 setlinejoin
0 setlinecap
newpath
35.728856 25.073775 moveto
37.029493 25.120068 37.470789 25.445328 37.470789 26.374412 curveto
37.470789 27.303295 36.40222 27.884074 35.751901 27.884074 curveto
35.101582 27.884074 34.404972 27.326543 34.218993 26.583436 curveto
34.033217 25.840128 34.311982 25.050527 35.728856 25.073775 curveto
closepath
stroke
gsave
<<
/ShadingType 2
/ColorSpace /DeviceRGB
/Coords [5.7863411 20.952224 8.7707713 28.271649]
/Extend [true true]
/Domain [0 1]
/Function <<
/FunctionType 3
/Functions
[
<<
/FunctionType 2
/Domain [0 1]
/C0 [1 1 1]
/C1 [0.8509804 0.80000001 0.90196079]
/N 1
>>
]
/Domain [0 1]
/Bounds [ ]
/Encode [ 0 1 ]
>>
>>
newpath
14.139202 20.835913 moveto
14.742777 20.863369 14.697703 20.940553 14.697702 21.297281 curveto
14.697702 21.653891 14.76931 21.566558 14.357745 21.758652 curveto
13.946239 21.950747 11.738935 22.725891 10.861042 22.972785 curveto
9.9831498 23.219676 9.2233469 23.479544 8.8941471 23.507003 curveto
8.564936 23.534342 7.7827156 23.345158 6.4658823 22.851372 curveto
5.7251673 22.659276 5.3807684 22.524 5.7374025 22.414285 curveto
6.0940479 22.304567 6.1379707 22.245195 6.8786883 22.025762 curveto
7.6194033 21.806326 10.341096 21.267655 11.273848 21.10302 curveto
12.206611 20.938385 13.535649 20.808452 14.139202 20.835913 curveto
closepath
clip
gsave [2.868297 0 0 0.348639 0 0] concat
shfill
grestore
grestore
gsave
<<
/ShadingType 2
/ColorSpace /DeviceRGB
/Coords [6.936962 19.025401 14.22927 19.981283]
/Extend [true true]
/Domain [0 1]
/Function <<
/FunctionType 3
/Functions
[
<<
/FunctionType 2
/Domain [0 1]
/C0 [1 1 1]
/C1 [0.8509804 0.80000001 0.90196079]
/N 1
>>
]
/Domain [0 1]
/Bounds [ ]
/Encode [ 0 1 ]
>>
>>
newpath
9.812632 18.99043 moveto
12.192522 19.092081 12.659756 19.405194 13.472245 19.709839 curveto
14.284749 20.014487 13.67462 20.093002 12.658998 19.991348 curveto
11.643375 19.889852 8.3105098 19.96007 7.4980037 19.96007 curveto
6.6855188 19.96007 6.6619605 19.732978 7.3728917 19.428331 curveto
8.0838196 19.123532 8.8985682 18.99043 9.812632 18.99043 curveto
closepath
clip
gsave [0.961222 0 0 1.040342 0 0] concat
shfill
grestore
grestore
grestore
showpage
