%!PS-Adobe-3.0 EPSF-3.0
%%Creator: inkscape 0.43
%%Pages: 1
%%Orientation: Portrait
%%BoundingBox: 90 699 193 754
%%HiResBoundingBox: 90.28678 699.24493 192.99307 753.78306
%%EndComments
%%Page: 1 1
0 842 translate
0.8 -0.8 scale
gsave [1 0 0 1 0 0] concat
0 0 0 setrgbcolor
[] 0 setdash
1.1253539 setlinewidth
1 setlinejoin
1 setlinecap
newpath
144.43921 110.69603 moveto
140.98601 112.76016 137.94564 115.08657 135.39276 117.58705 curveto
135.39276 155.48759 lineto
138.12184 158.15965 141.42252 160.61618 145.17361 162.78613 curveto
231.66558 162.78613 lineto
235.07337 160.81479 238.10709 158.61864 240.67866 156.22855 curveto
240.67866 116.88312 lineto
238.2873 114.6581 235.52018 112.56113 232.39999 110.69603 curveto
144.43921 110.69603 lineto
closepath
stroke
gsave [1 0 0 1 112.8573 119.5053] concat
gsave [0.71493 0 0 0.71493 0.782619 1.419875] concat
gsave
0 0 0 setrgbcolor
newpath
26.400436 2.0632268 moveto
25.751132 1.7023578 24.883453 2.0461558 23.650436 3.5944768 curveto
19.968329 8.2181598 20.271094 12.510853 21.150436 13.719477 curveto
21.129865 13.728715 21.141844 13.708475 21.119186 13.719477 curveto
18.883586 14.805055 13.801855 2.6326748 12.150436 10.375727 curveto
10.961238 15.951558 12.942019 19.534434 14.275436 20.406977 curveto
11.913691 21.11125 3.236247 14.47131 5.306686 21.563227 curveto
6.893468 26.998462 10.297615 29.180295 11.900436 29.344477 curveto
10.039867 30.972906 -0.60879795 28.659199 4.275436 34.188227 curveto
8.1509 38.575309 12.38884 39.066146 13.775436 38.438227 curveto
12.539772 40.729315 2.599319 43.626993 9.369186 46.156977 curveto
14.858716 48.208481 18.821713 46.64499 19.744186 45.438227 curveto
20.553131 47.65124 11.82195 55.547676 19.369186 54.688227 curveto
26.032456 53.929438 28.772471 49.849627 28.244186 48.813227 curveto
30.637019 49.484587 26.370636 61.947524 32.744186 57.250727 curveto
38.002942 53.375442 38.467511 48.64632 37.587936 47.813227 curveto
37.649444 47.827642 37.64402 47.882269 37.806686 47.844477 curveto
40.227443 47.282061 42.478196 60.246768 45.806686 53.063227 curveto
48.427106 47.407849 46.820646 43.180531 45.650436 42.531977 curveto
45.693136 42.501562 45.688126 42.551101 45.744186 42.500727 curveto
47.592726 40.839624 55.796846 51.117361 55.244186 43.219477 curveto
54.836706 37.396272 51.794016 34.452916 50.306686 34.094477 curveto
51.852796 32.327271 62.826246 37.191482 58.931686 30.594477 curveto
56.196056 25.960581 52.658766 24.619624 50.931686 24.688227 curveto
52.632726 22.647402 62.702646 21.348436 56.462936 17.813227 curveto
51.458756 14.978029 47.405456 15.822716 46.212936 16.844477 curveto
47.339616 14.238807 55.534926 9.2850818 48.587936 8.5007268 curveto
42.687526 7.8345348 39.15122 10.430617 38.619186 11.813227 curveto
37.606424 9.5986667 43.451556 0.20314974 36.556686 2.9694768 curveto
31.501695 4.9976128 29.645242 8.3671658 29.494186 10.063227 curveto
28.309108 8.4485318 28.061669 2.9865038 26.400436 2.0632268 curveto
closepath
29.869186 11.094477 moveto
29.96994 11.09808 30.053347 11.153804 30.181686 11.094477 curveto
30.181686 11.094477 31.077353 11.293839 31.306686 11.344477 curveto
30.361854 11.354125 29.463202 11.449662 28.556686 11.594477 curveto
29.006007 11.42279 29.565049 11.235869 29.869186 11.094477 curveto
closepath
38.056686 12.563227 moveto
38.497156 12.606515 38.864452 12.613454 38.994186 12.563227 curveto
39.046679 12.576068 39.05568 12.62185 39.119186 12.625727 curveto
39.119186 12.625727 39.949208 13.305243 40.212936 13.531977 curveto
39.516507 13.163917 38.801535 12.842584 38.056686 12.563227 curveto
closepath
22.712936 13.594477 moveto
21.977668 13.988736 21.260432 14.390305 20.587936 14.875727 curveto
20.946109 14.466606 21.261099 14.081907 21.369186 13.875727 curveto
21.619005 14.064647 21.886232 14.107552 22.119186 13.781977 curveto
22.119186 13.781977 22.642781 13.615973 22.712936 13.594477 curveto
closepath
45.650436 17.875727 moveto
46.045276 18.11823 46.210556 18.115446 46.181686 17.938227 curveto
46.191786 17.959003 46.724196 18.987148 46.931686 19.406977 curveto
46.554216 18.860993 46.082266 18.377608 45.650436 17.875727 curveto
closepath
15.962936 19.594477 moveto
15.513937 20.260997 15.168506 20.995922 14.806686 21.719477 curveto
14.896258 21.342067 15.018324 20.882521 15.056686 20.625727 curveto
15.179905 20.549045 15.302467 20.409879 15.337936 20.188227 curveto
15.337936 20.188227 15.863739 19.688879 15.962936 19.594477 curveto
closepath
48.931686 23.250727 moveto
49.285756 23.893193 49.627306 24.517 49.900436 24.938227 curveto
49.812696 25.094039 49.811376 25.303028 49.962936 25.531977 curveto
49.962936 25.531977 49.913956 26.389598 49.900436 26.594477 curveto
49.684256 25.431421 49.352276 24.327777 48.931686 23.250727 curveto
closepath
12.994186 27.938227 moveto
12.929831 28.509271 12.818445 29.071626 12.806686 29.656977 curveto
12.777397 29.537064 12.741378 29.350427 12.712936 29.250727 curveto
12.814467 29.121604 12.827978 28.928535 12.744186 28.688227 curveto
12.744186 28.688227 12.957983 28.048856 12.994186 27.938227 curveto
closepath
13.869186 36.125727 moveto
14.069142 36.704869 14.24057 37.292589 14.494186 37.844477 curveto
14.286476 37.627689 14.158857 37.479304 14.056686 37.438227 curveto
14.054711 37.421937 13.908783 36.439079 13.869186 36.125727 curveto
closepath
19.337936 44.156977 moveto
19.6308 44.409692 19.904697 44.672498 20.212936 44.906977 curveto
20.089967 44.863347 20.05771 44.870307 19.962936 44.844477 curveto
19.928477 44.67433 19.811862 44.550145 19.556686 44.469477 curveto
19.556686 44.469477 19.354086 44.180019 19.337936 44.156977 curveto
closepath
26.962936 48.156977 moveto
27.409187 48.269214 27.848397 48.389934 28.306686 48.469477 curveto
28.168333 48.508394 27.973173 48.552252 27.931686 48.594477 curveto
27.845231 48.576105 27.798415 48.512559 27.681686 48.531977 curveto
27.681686 48.531977 27.070165 48.213739 26.962936 48.156977 curveto
closepath
fill
grestore
grestore
gsave [0.71493 0 0 0.71493 0.782619 1.419875] concat
gsave
<<
/ShadingType 2
/ColorSpace /DeviceRGB
/Coords [14.096885 1.8433709 22.512959 1.8433709]
/Extend [true true]
/Domain [0 1]
/Function <<
/FunctionType 3
/Functions
[
<<
/FunctionType 2
/Domain [0 1]
/C0 [1 0.95294118 0]
/C1 [0.84313726 0.65098041 0]
/N 1
>>
]
/Domain [0 1]
/Bounds [ ]
/Encode [ 0 1 ]
>>
>>
newpath
44.006898 16.259864 moveto
42.186198 15.348671 47.4374 12.284913 54.325837 16.187668 curveto
61.214272 20.090422 48.102371 21.269234 48.465666 23.727769 curveto
48.828962 26.186303 44.006898 16.259864 44.006898 16.259864 curveto
closepath
eoclip
gsave [0.05139415 1.175002 -1.491665 0.06524472 51.88463 -2.536118] concat
shfill
grestore
grestore
0.2 0.2 0 setrgbcolor
[] 0 setdash
1.2331064 setlinewidth
0 setlinejoin
0 setlinecap
newpath
44.006898 16.259864 moveto
42.186198 15.348671 47.4374 12.284913 54.325837 16.187668 curveto
61.214272 20.090422 48.102371 21.269234 48.465666 23.727769 curveto
48.828962 26.186303 44.006898 16.259864 44.006898 16.259864 curveto
closepath
stroke
grestore
gsave [0.71493 0 0 0.71493 0.782619 1.419875] concat
gsave
<<
/ShadingType 2
/ColorSpace /DeviceRGB
/Coords [14.096885 1.8433709 22.512959 1.8433709]
/Extend [true true]
/Domain [0 1]
/Function <<
/FunctionType 3
/Functions
[
<<
/FunctionType 2
/Domain [0 1]
/C0 [1 0.95294118 0]
/C1 [0.84313726 0.65098041 0]
/N 1
>>
]
/Domain [0 1]
/Bounds [ ]
/Encode [ 0 1 ]
>>
>>
newpath
47.812676 23.901707 moveto
46.688834 22.204003 52.768334 22.166764 56.793229 28.984557 curveto
60.818124 35.802345 48.864801 30.28604 47.953786 32.598275 curveto
47.042773 34.91051 47.812676 23.901707 47.812676 23.901707 curveto
closepath
eoclip
gsave [-0.541354 1.044131 -1.325524 -0.687247 64.01358 11.53734] concat
shfill
grestore
grestore
0.2 0.2 0 setrgbcolor
[] 0 setdash
1.2331064 setlinewidth
0 setlinejoin
0 setlinecap
newpath
47.812676 23.901707 moveto
46.688834 22.204003 52.768334 22.166764 56.793229 28.984557 curveto
60.818124 35.802345 48.864801 30.28604 47.953786 32.598275 curveto
47.042773 34.91051 47.812676 23.901707 47.812676 23.901707 curveto
closepath
stroke
grestore
gsave [0.71493 0 0 0.71493 0.782619 1.419875] concat
gsave
<<
/ShadingType 2
/ColorSpace /DeviceRGB
/Coords [14.096885 1.8433709 22.512959 1.8433709]
/Extend [true true]
/Domain [0 1]
/Function <<
/FunctionType 3
/Functions
[
<<
/FunctionType 2
/Domain [0 1]
/C0 [1 0.95294118 0]
/C1 [0.84313726 0.65098041 0]
/N 1
>>
]
/Domain [0 1]
/Bounds [ ]
/Encode [ 0 1 ]
>>
>>
newpath
47.348958 33.057619 moveto
47.102566 31.036602 52.557467 33.720963 53.110123 41.618851 curveto
53.66278 49.516737 45.43617 39.238875 43.587627 40.899978 curveto
41.739084 42.561083 47.348958 33.057619 47.348958 33.057619 curveto
closepath
eoclip
gsave [-0.951002 0.692003 -0.878497 -1.207298 67.36817 29.2396] concat
shfill
grestore
grestore
0.2 0.2 0 setrgbcolor
[] 0 setdash
1.2331064 setlinewidth
0 setlinejoin
0 setlinecap
newpath
47.348958 33.057619 moveto
47.102566 31.036602 52.557467 33.720963 53.110123 41.618851 curveto
53.66278 49.516737 45.43617 39.238875 43.587627 40.899978 curveto
41.739084 42.561083 47.348958 33.057619 47.348958 33.057619 curveto
closepath
stroke
grestore
gsave [0.71493 0 0 0.71493 0.782619 1.419875] concat
gsave
<<
/ShadingType 2
/ColorSpace /DeviceRGB
/Coords [14.096885 1.8433709 22.512959 1.8433709]
/Extend [true true]
/Domain [0 1]
/Function <<
/FunctionType 3
/Functions
[
<<
/FunctionType 2
/Domain [0 1]
/C0 [1 0.95294118 0]
/C1 [0.84313726 0.65098041 0]
/N 1
>>
]
/Domain [0 1]
/Bounds [ ]
/Encode [ 0 1 ]
>>
>>
newpath
42.740109 41.178293 moveto
43.499915 39.289402 46.981371 44.273498 43.652884 51.457036 curveto
40.324398 58.640574 38.081109 45.668327 35.660352 46.230743 curveto
33.239595 46.79316 42.740109 41.178293 42.740109 41.178293 curveto
closepath
eoclip
gsave [-1.166907 0.146967 -0.186575 -1.481389 62.11548 47.49826] concat
shfill
grestore
grestore
0.2 0.2 0 setrgbcolor
[] 0 setdash
1.2331064 setlinewidth
0 setlinejoin
0 setlinecap
newpath
42.740109 41.178293 moveto
43.499915 39.289402 46.981371 44.273498 43.652884 51.457036 curveto
40.324398 58.640574 38.081109 45.668327 35.660352 46.230743 curveto
33.239595 46.79316 42.740109 41.178293 42.740109 41.178293 curveto
closepath
stroke
grestore
gsave [0.71493 0 0 0.71493 0.782619 1.419875] concat
gsave
<<
/ShadingType 2
/ColorSpace /DeviceRGB
/Coords [14.096885 1.8433709 22.512959 1.8433709]
/Extend [true true]
/Domain [0 1]
/Function <<
/FunctionType 3
/Functions
[
<<
/FunctionType 2
/Domain [0 1]
/C0 [1 0.95294118 0]
/C1 [0.84313726 0.65098041 0]
/N 1
>>
]
/Domain [0 1]
/Bounds [ ]
/Encode [ 0 1 ]
>>
>>
newpath
34.741326 46.187181 moveto
36.316052 44.896656 36.970818 50.940912 30.597269 55.637711 curveto
24.223722 60.33451 28.496937 47.882555 26.104104 47.211195 curveto
23.71127 46.539835 34.741326 46.187181 34.741326 46.187181 curveto
closepath
eoclip
gsave [-1.093733 -0.432461 0.549009 -1.388494 48.68786 61.048] concat
shfill
grestore
grestore
0.2 0.2 0 setrgbcolor
[] 0 setdash
1.2331064 setlinewidth
0 setlinejoin
0 setlinecap
newpath
34.741326 46.187181 moveto
36.316052 44.896656 36.970818 50.940912 30.597269 55.637711 curveto
24.223722 60.33451 28.496937 47.882555 26.104104 47.211195 curveto
23.71127 46.539835 34.741326 46.187181 34.741326 46.187181 curveto
closepath
stroke
grestore
gsave [0.71493 0 0 0.71493 0.782619 1.419875] concat
gsave
<<
/ShadingType 2
/ColorSpace /DeviceRGB
/Coords [14.096885 1.8433709 22.512959 1.8433709]
/Extend [true true]
/Domain [0 1]
/Function <<
/FunctionType 3
/Functions
[
<<
/FunctionType 2
/Domain [0 1]
/C0 [1 0.95294118 0]
/C1 [0.84313726 0.65098041 0]
/N 1
>>
]
/Domain [0 1]
/Bounds [ ]
/Encode [ 0 1 ]
>>
>>
newpath
36.975175 11.00854 moveto
34.942978 10.884471 38.571743 6.0065844 46.438959 6.8948406 curveto
54.30617 7.7830957 42.707256 14.010193 44.005728 16.129238 curveto
45.304198 18.248282 36.975175 11.00854 36.975175 11.00854 curveto
closepath
eoclip
gsave [0.508136 1.060693 -1.346551 0.645078 36.84955 -9.371157] concat
shfill
grestore
grestore
0.2 0.2 0 setrgbcolor
[] 0 setdash
1.2331064 setlinewidth
0 setlinejoin
0 setlinecap
newpath
36.975175 11.00854 moveto
34.942978 10.884471 38.571743 6.0065844 46.438959 6.8948406 curveto
54.30617 7.7830957 42.707256 14.010193 44.005728 16.129238 curveto
45.304198 18.248282 36.975175 11.00854 36.975175 11.00854 curveto
closepath
stroke
grestore
gsave [0.71493 0 0 0.71493 0.782619 1.419875] concat
gsave
<<
/ShadingType 2
/ColorSpace /DeviceRGB
/Coords [14.096885 1.8433709 22.512959 1.8433709]
/Extend [true true]
/Domain [0 1]
/Function <<
/FunctionType 3
/Functions
[
<<
/FunctionType 2
/Domain [0 1]
/C0 [1 0.95294118 0]
/C1 [0.84313726 0.65098041 0]
/N 1
>>
]
/Domain [0 1]
/Bounds [ ]
/Encode [ 0 1 ]
>>
>>
newpath
25.537583 46.930202 moveto
27.545964 46.596104 25.101503 52.162641 17.235143 53.058433 curveto
9.3687853 53.954225 19.27895 45.28819 17.538985 43.513675 curveto
15.799021 41.739164 25.537583 46.930202 25.537583 46.930202 curveto
closepath
eoclip
gsave [-0.732727 -0.91999 1.167928 -0.930197 30.2231 66.76437] concat
shfill
grestore
grestore
0.2 0.2 0 setrgbcolor
[] 0 setdash
1.2331064 setlinewidth
0 setlinejoin
0 setlinecap
newpath
25.537583 46.930202 moveto
27.545964 46.596104 25.101503 52.162641 17.235143 53.058433 curveto
9.3687853 53.954225 19.27895 45.28819 17.538985 43.513675 curveto
15.799021 41.739164 25.537583 46.930202 25.537583 46.930202 curveto
closepath
stroke
grestore
gsave [0.71493 0 0 0.71493 0.782619 1.419875] concat
gsave
<<
/ShadingType 2
/ColorSpace /DeviceRGB
/Coords [14.096885 1.8433709 22.512959 1.8433709]
/Extend [true true]
/Domain [0 1]
/Function <<
/FunctionType 3
/Functions
[
<<
/FunctionType 2
/Domain [0 1]
/C0 [1 0.95294118 0]
/C1 [0.84313726 0.65098041 0]
/N 1
>>
]
/Domain [0 1]
/Bounds [ ]
/Encode [ 0 1 ]
>>
>>
newpath
17.400027 42.848531 moveto
19.341315 43.462224 14.636936 47.313272 7.2206964 44.541733 curveto
-0.19554319 41.770195 12.568098 38.545142 11.822893 36.174267 curveto
11.077687 33.803393 17.400027 42.848531 17.400027 42.848531 curveto
closepath
eoclip
gsave [-0.235439 -1.15232 1.46287 -0.298891 12.57449 62.64906] concat
shfill
grestore
grestore
0.2 0.2 0 setrgbcolor
[] 0 setdash
1.2331064 setlinewidth
0 setlinejoin
0 setlinecap
newpath
17.400027 42.848531 moveto
19.341315 43.462224 14.636936 47.313272 7.2206964 44.541733 curveto
-0.19554319 41.770195 12.568098 38.545142 11.822893 36.174267 curveto
11.077687 33.803393 17.400027 42.848531 17.400027 42.848531 curveto
closepath
stroke
grestore
gsave [0.71493 0 0 0.71493 0.782619 1.419875] concat
gsave
<<
/ShadingType 2
/ColorSpace /DeviceRGB
/Coords [14.096885 1.8433709 22.512959 1.8433709]
/Extend [true true]
/Domain [0 1]
/Function <<
/FunctionType 3
/Functions
[
<<
/FunctionType 2
/Domain [0 1]
/C0 [1 0.95294118 0]
/C1 [0.84313726 0.65098041 0]
/N 1
>>
]
/Domain [0 1]
/Bounds [ ]
/Encode [ 0 1 ]
>>
>>
newpath
11.923305 35.873997 moveto
13.347931 37.328527 7.3851766 38.514827 2.1435575 32.581237 curveto
-3.098061 26.647649 9.6827825 29.803844 10.140078 27.361047 curveto
10.59737 24.91825 11.923305 35.873997 11.923305 35.873997 curveto
closepath
eoclip
gsave [0.334123 -1.127668 1.431574 0.424168 -1.646963 51.07911] concat
shfill
grestore
grestore
0.2 0.2 0 setrgbcolor
[] 0 setdash
1.2331064 setlinewidth
0 setlinejoin
0 setlinecap
newpath
11.923305 35.873997 moveto
13.347931 37.328527 7.3851766 38.514827 2.1435575 32.581237 curveto
-3.098061 26.647649 9.6827825 29.803844 10.140078 27.361047 curveto
10.59737 24.91825 11.923305 35.873997 11.923305 35.873997 curveto
closepath
stroke
grestore
gsave [0.71493 0 0 0.71493 0.782619 1.419875] concat
gsave
<<
/ShadingType 2
/ColorSpace /DeviceRGB
/Coords [14.096885 1.8433709 22.512959 1.8433709]
/Extend [true true]
/Domain [0 1]
/Function <<
/FunctionType 3
/Functions
[
<<
/FunctionType 2
/Domain [0 1]
/C0 [1 0.95294118 0]
/C1 [0.84313726 0.65098041 0]
/N 1
>>
]
/Domain [0 1]
/Bounds [ ]
/Encode [ 0 1 ]
>>
>>
newpath
10.611966 27.081784 moveto
11.282303 29.004247 5.3814795 27.540686 3.1627246 19.94074 curveto
0.94397017 12.340796 11.167195 20.635204 12.620425 18.619142 curveto
14.073653 16.603081 10.611966 27.081784 10.611966 27.081784 curveto
closepath
eoclip
gsave [0.782184 -0.878329 1.115038 0.992981 -8.138277 35.06776] concat
shfill
grestore
grestore
0.2 0.2 0 setrgbcolor
[] 0 setdash
1.2331064 setlinewidth
0 setlinejoin
0 setlinecap
newpath
10.611966 27.081784 moveto
11.282303 29.004247 5.3814795 27.540686 3.1627246 19.94074 curveto
0.94397017 12.340796 11.167195 20.635204 12.620425 18.619142 curveto
14.073653 16.603081 10.611966 27.081784 10.611966 27.081784 curveto
closepath
stroke
grestore
gsave [0.71493 0 0 0.71493 0.782619 1.419875] concat
gsave
<<
/ShadingType 2
/ColorSpace /DeviceRGB
/Coords [14.096885 1.8433709 22.512959 1.8433709]
/Extend [true true]
/Domain [0 1]
/Function <<
/FunctionType 3
/Functions
[
<<
/FunctionType 2
/Domain [0 1]
/C0 [1 0.95294118 0]
/C1 [0.84313726 0.65098041 0]
/N 1
>>
]
/Domain [0 1]
/Bounds [ ]
/Encode [ 0 1 ]
>>
>>
newpath
13.190161 18.586079 moveto
12.868458 20.596483 8.3677926 16.509213 10.01921 8.7661603 curveto
11.670627 1.0231091 16.736627 13.174123 18.972227 12.088545 curveto
21.207822 11.002966 13.190161 18.586079 13.190161 18.586079 curveto
closepath
eoclip
gsave [1.105201 -0.402248 0.510655 1.403052 -7.104596 16.72321] concat
shfill
grestore
grestore
0.2 0.2 0 setrgbcolor
[] 0 setdash
1.2331064 setlinewidth
0 setlinejoin
0 setlinecap
newpath
13.190161 18.586079 moveto
12.868458 20.596483 8.3677926 16.509213 10.01921 8.7661603 curveto
11.670627 1.0231091 16.736627 13.174123 18.972227 12.088545 curveto
21.207822 11.002966 13.190161 18.586079 13.190161 18.586079 curveto
closepath
stroke
grestore
gsave [0.71493 0 0 0.71493 0.782619 1.419875] concat
gsave
<<
/ShadingType 2
/ColorSpace /DeviceRGB
/Coords [14.096885 1.8433709 22.512959 1.8433709]
/Extend [true true]
/Domain [0 1]
/Function <<
/FunctionType 3
/Functions
[
<<
/FunctionType 2
/Domain [0 1]
/C0 [1 0.95294118 0]
/C1 [0.84313726 0.65098041 0]
/N 1
>>
]
/Domain [0 1]
/Bounds [ ]
/Encode [ 0 1 ]
>>
>>
newpath
19.968891 12.170679 moveto
18.784156 13.826463 16.57938 8.1607156 21.51145 1.9674343 curveto
26.443519 -4.225847 25.557141 8.909063 28.04224 8.93475 curveto
30.527339 8.9604359 19.968891 12.170679 19.968891 12.170679 curveto
closepath
eoclip
gsave [1.168581 0.133007 -0.168852 1.483514 2.636284 1.450208] concat
shfill
grestore
grestore
0.2 0.2 0 setrgbcolor
[] 0 setdash
1.2331064 setlinewidth
0 setlinejoin
0 setlinecap
newpath
19.968891 12.170679 moveto
18.784156 13.826463 16.57938 8.1607156 21.51145 1.9674343 curveto
26.443519 -4.225847 25.557141 8.909063 28.04224 8.93475 curveto
30.527339 8.9604359 19.968891 12.170679 19.968891 12.170679 curveto
closepath
stroke
grestore
gsave [0.71493 0 0 0.71493 0.782619 1.419875] concat
gsave
<<
/ShadingType 2
/ColorSpace /DeviceRGB
/Coords [14.096885 1.8433709 22.512959 1.8433709]
/Extend [true true]
/Domain [0 1]
/Function <<
/FunctionType 3
/Functions
[
<<
/FunctionType 2
/Domain [0 1]
/C0 [1 0.95294118 0]
/C1 [0.84313726 0.65098041 0]
/N 1
>>
]
/Domain [0 1]
/Bounds [ ]
/Encode [ 0 1 ]
>>
>>
newpath
28.046156 9.4697434 moveto
26.198081 10.324047 27.080249 4.3087738 34.428103 1.3607074 curveto
41.775956 -1.5873594 34.516168 9.3947643 36.664124 10.644828 curveto
38.812082 11.894893 28.046156 9.4697434 28.046156 9.4697434 curveto
closepath
eoclip
gsave [0.950303 0.692963 -0.879718 1.20641 18.2728 -8.414028] concat
shfill
grestore
grestore
0.2 0.2 0 setrgbcolor
[] 0 setdash
1.2331064 setlinewidth
0 setlinejoin
0 setlinecap
newpath
28.046156 9.4697434 moveto
26.198081 10.324047 27.080249 4.3087738 34.428103 1.3607074 curveto
41.775956 -1.5873594 34.516168 9.3947643 36.664124 10.644828 curveto
38.812082 11.894893 28.046156 9.4697434 28.046156 9.4697434 curveto
closepath
stroke
grestore
gsave [0.680716 0 0 0.680716 5.840012 5.657943] concat
gsave
<<
/ShadingType 3
/ColorSpace /DeviceRGB
/Coords [31.721321 25.189392 0 31.721321 25.189392 41.131844]
/Extend [true true]
/Domain [0 1]
/Function <<
/FunctionType 3
/Functions
[
<<
/FunctionType 2
/Domain [0 1]
/C0 [1 0.95294118 0]
/C1 [0.84313726 0.65098041 0]
/N 1
>>
]
/Domain [0 1]
/Bounds [ ]
/Encode [ 0 1 ]
>>
>>
newpath
43.087587 23.626602 moveto
43.087587 34.487477 34.272965 43.302099 23.41209 43.302099 curveto
12.551216 43.302099 3.7365932 34.487477 3.7365932 23.626602 curveto
3.7365932 12.765728 12.551216 3.9511051 23.41209 3.9511051 curveto
34.272965 3.9511051 43.087587 12.765728 43.087587 23.626602 curveto
closepath
clip
shfill
grestore
0.2 0.2 0 setrgbcolor
[] 0 setdash
1.2950845 setlinewidth
1 setlinejoin
1 setlinecap
newpath
43.087587 23.626602 moveto
43.087587 34.487477 34.272965 43.302099 23.41209 43.302099 curveto
12.551216 43.302099 3.7365932 34.487477 3.7365932 23.626602 curveto
3.7365932 12.765728 12.551216 3.9511051 23.41209 3.9511051 curveto
34.272965 3.9511051 43.087587 12.765728 43.087587 23.626602 curveto
closepath
stroke
grestore
gsave [1 0 0 1 -0.261661 0.354488] concat
gsave
0 0 0 setrgbcolor
newpath
27.443987 56.532508 moveto
33.493446 59.120278 39.476759 59.298506 44.467179 55.733923 curveto
48.569897 55.9133 52.394935 56.17605 55.692175 53.949333 curveto
58.187386 52.701727 61.175727 49.207387 59.994291 44.928996 curveto
57.947324 39.759458 51.596349 38.089226 44.467179 38.623913 curveto
45.001866 35.504901 42.595772 31.583857 38.050924 30.068908 curveto
31.991129 28.019271 26.733367 29.445106 23.079666 34.346411 curveto
19.87154 36.128704 14.792005 34.435525 10.24716 36.485161 curveto
1.2088435 40.029846 1.2373956 51.44149 9.715918 56.456025 curveto
15.263992 59.297359 23.07622 55.111269 27.443987 56.532508 curveto
closepath
eofill
grestore
grestore
gsave [1 0 0 1 -0.261661 0.354488] concat
gsave
0 0 0 setrgbcolor
newpath
6.638872 47.284613 moveto
10.290257 41.905447 18.348107 38.49708 23.86921 38.903471 curveto
33.910775 33.34281 34.451298 32.252035 44.149259 36.466281 curveto
41.35099 32.659952 39.515599 31.020097 33.587975 31.18564 curveto
30.172846 31.862615 30.007431 31.095273 24.786905 36.466281 curveto
12.661074 38.075884 7.0006988 37.266871 6.638872 47.284613 curveto
closepath
eofill
grestore
grestore
gsave [1 0 0 1 -0.261661 0.354488] concat
gsave
<<
/ShadingType 3
/ColorSpace /DeviceRGB
/Coords [22.129175 62.178513 0 22.129173 62.178513 15.50163]
/Extend [true true]
/Domain [0 1]
/Function <<
/FunctionType 3
/Functions
[
<<
/FunctionType 2
/Domain [0 1]
/C0 [1 1 1]
/C1 [0.8509804 0.80000001 0.90196079]
/N 1
>>
]
/Domain [0 1]
/Bounds [ ]
/Encode [ 0 1 ]
>>
>>
newpath
25.270263 53.01208 moveto
31.319723 55.599851 37.303035 55.778079 42.293455 52.213495 curveto
46.396173 52.392872 50.221213 52.655622 53.518452 50.428905 curveto
56.013662 49.1813 59.002004 45.686959 57.820567 41.408568 curveto
55.7736 36.23903 49.422625 34.568798 42.293455 35.103485 curveto
42.828142 31.984473 40.422048 28.06343 35.877201 26.54848 curveto
29.817405 24.498843 24.559643 25.924678 20.905942 30.825983 curveto
17.697816 32.608276 12.618282 30.915097 8.0734365 32.964733 curveto
-0.96488031 36.509418 -0.93632824 47.921062 7.5421941 52.935597 curveto
13.090269 55.776931 20.902496 51.590841 25.270263 53.01208 curveto
closepath
eoclip
gsave [1.904628 0 0 1.04112 -24.49908 -28.66164] concat
shfill
grestore
grestore
0.14901961 0.098039217 0.2 setrgbcolor
[] 0 setdash
1.949625 setlinewidth
1 setlinejoin
0 setlinecap
newpath
25.270263 53.01208 moveto
31.319723 55.599851 37.303035 55.778079 42.293455 52.213495 curveto
46.396173 52.392872 50.221213 52.655622 53.518452 50.428905 curveto
56.013662 49.1813 59.002004 45.686959 57.820567 41.408568 curveto
55.7736 36.23903 49.422625 34.568798 42.293455 35.103485 curveto
42.828142 31.984473 40.422048 28.06343 35.877201 26.54848 curveto
29.817405 24.498843 24.559643 25.924678 20.905942 30.825983 curveto
17.697816 32.608276 12.618282 30.915097 8.0734365 32.964733 curveto
-0.96488031 36.509418 -0.93632824 47.921062 7.5421941 52.935597 curveto
13.090269 55.776931 20.902496 51.590841 25.270263 53.01208 curveto
closepath
stroke
grestore
gsave [1 0 0 1 -0.261661 0.354488] concat
gsave
<<
/ShadingType 2
/ColorSpace /DeviceRGB
/Coords [12.880094 53.321636 31.940351 66.989014]
/Extend [true true]
/Domain [0 1]
/Function <<
/FunctionType 3
/Functions
[
<<
/FunctionType 2
/Domain [0 1]
/C0 [1 1 1]
/C1 [1 1 1]
/N 1
>>
]
/Domain [0 1]
/Bounds [ ]
/Encode [ 0 1 ]
>>
>>
newpath
3.1184442 43.764185 moveto
6.7698291 38.385019 14.827679 34.976652 20.348783 35.383043 curveto
30.390347 29.822382 30.93087 28.731607 40.628831 32.945854 curveto
37.830563 29.139524 35.995172 27.499669 30.067547 27.665212 curveto
26.652419 28.342187 26.487003 27.574845 21.266478 32.945854 curveto
9.1406457 34.555457 3.480271 33.746443 3.1184442 43.764185 curveto
closepath
eoclip
gsave [2.045938 0 0 0.969212 -24.49908 -28.66164] concat
shfill
grestore
grestore
grestore
grestore
gsave
0 0 0 setrgbcolor
newpath
178.76283 126.82646 moveto
177.60268 126.82646 lineto
177.60268 119.30888 lineto
175.1769 124.42412 lineto
174.48549 124.42412 lineto
172.07729 119.30888 lineto
172.07729 126.82646 lineto
170.9933 126.82646 lineto
170.9933 118.10185 lineto
172.57533 118.10185 lineto
174.9015 122.95927 lineto
177.1515 118.10185 lineto
178.76283 118.10185 lineto
178.76283 126.82646 lineto
fill
grestore
gsave
0 0 0 setrgbcolor
newpath
186.60854 123.55693 moveto
186.60853 124.62334 186.33509 125.46514 185.78822 126.08232 curveto
185.24134 126.69951 184.50892 127.0081 183.59096 127.0081 curveto
182.66517 127.0081 181.92885 126.69951 181.38197 126.08232 curveto
180.839 125.46514 180.56752 124.62334 180.56752 123.55693 curveto
180.56752 122.49053 180.839 121.64873 181.38197 121.03154 curveto
181.92885 120.41045 182.66517 120.09991 183.59096 120.0999 curveto
184.50892 120.09991 185.24134 120.41045 185.78822 121.03154 curveto
186.33509 121.64873 186.60853 122.49053 186.60854 123.55693 curveto
185.47182 123.55693 moveto
185.47181 122.70928 185.3058 122.08037 184.97377 121.67021 curveto
184.64173 121.25615 184.1808 121.04912 183.59096 121.04912 curveto
182.9933 121.04912 182.52846 121.25615 182.19643 121.67021 curveto
181.8683 122.08037 181.70424 122.70928 181.70424 123.55693 curveto
181.70424 124.37725 181.87025 125.00029 182.20229 125.42607 curveto
182.53431 125.84795 182.9972 126.05888 183.59096 126.05888 curveto
184.17689 126.05888 184.63587 125.8499 184.96791 125.43193 curveto
185.30384 125.01006 185.47181 124.38506 185.47182 123.55693 curveto
fill
grestore
gsave
0 0 0 setrgbcolor
newpath
193.79213 126.82646 moveto
192.69057 126.82646 lineto
192.69057 123.0999 lineto
192.69056 122.79912 192.67298 122.51787 192.63783 122.25615 curveto
192.60267 121.99053 192.53822 121.7835 192.44447 121.63506 curveto
192.34681 121.471 192.20619 121.3499 192.0226 121.27177 curveto
191.839 121.18975 191.60072 121.14873 191.30775 121.14873 curveto
191.00697 121.14873 190.69252 121.22295 190.3644 121.37138 curveto
190.03627 121.51983 189.72181 121.70928 189.42104 121.93974 curveto
189.42104 126.82646 lineto
188.31947 126.82646 lineto
188.31947 120.28154 lineto
189.42104 120.28154 lineto
189.42104 121.0081 lineto
189.76478 120.72295 190.12025 120.5003 190.48744 120.34013 curveto
190.85463 120.17998 191.23158 120.09991 191.6183 120.0999 curveto
192.32533 120.09991 192.86439 120.3128 193.23549 120.73857 curveto
193.60658 121.16436 193.79212 121.77764 193.79213 122.57841 curveto
193.79213 126.82646 lineto
fill
grestore
gsave
0 0 0 setrgbcolor
newpath
199.31166 126.76787 moveto
199.10463 126.82256 198.87806 126.86748 198.63197 126.90263 curveto
198.38978 126.93779 198.17299 126.95537 197.98158 126.95537 curveto
197.31361 126.95537 196.8058 126.77568 196.45815 126.41631 curveto
196.11049 126.05693 195.93666 125.48076 195.93666 124.68779 curveto
195.93666 121.20732 lineto
195.19252 121.20732 lineto
195.19252 120.28154 lineto
195.93666 120.28154 lineto
195.93666 118.40068 lineto
197.03822 118.40068 lineto
197.03822 120.28154 lineto
199.31166 120.28154 lineto
199.31166 121.20732 lineto
197.03822 121.20732 lineto
197.03822 124.18974 lineto
197.03822 124.5335 197.04603 124.80303 197.06166 124.99834 curveto
197.07728 125.18974 197.13197 125.36943 197.22572 125.5374 curveto
197.31166 125.69365 197.42885 125.80888 197.57729 125.8831 curveto
197.72963 125.95342 197.9601 125.98857 198.26869 125.98857 curveto
198.44838 125.98857 198.63588 125.96318 198.83119 125.9124 curveto
199.0265 125.85771 199.16713 125.81279 199.25307 125.77763 curveto
199.31166 125.77763 lineto
199.31166 126.76787 lineto
fill
grestore
gsave
0 0 0 setrgbcolor
newpath
204.73158 121.48271 moveto
204.67299 121.48271 lineto
204.50892 121.44365 204.34877 121.41631 204.19252 121.40068 curveto
204.04017 121.38115 203.85853 121.37139 203.6476 121.37138 curveto
203.30775 121.37139 202.97963 121.44756 202.66322 121.5999 curveto
202.34681 121.74834 202.04213 121.9417 201.74916 122.17998 curveto
201.74916 126.82646 lineto
200.6476 126.82646 lineto
200.6476 120.28154 lineto
201.74916 120.28154 lineto
201.74916 121.24834 lineto
202.18666 120.89678 202.57142 120.64873 202.90346 120.5042 curveto
203.23939 120.35577 203.58119 120.28155 203.92885 120.28154 curveto
204.12025 120.28155 204.25892 120.28741 204.34486 120.29912 curveto
204.4308 120.30694 204.5597 120.32452 204.73158 120.35185 curveto
204.73158 121.48271 lineto
fill
grestore
gsave
0 0 0 setrgbcolor
newpath
211.25893 123.66826 moveto
206.43666 123.66826 lineto
206.43666 124.07061 206.49721 124.42217 206.6183 124.72295 curveto
206.73939 125.01982 206.90541 125.26396 207.11635 125.45537 curveto
207.31947 125.64287 207.5597 125.78349 207.83705 125.87724 curveto
208.1183 125.97099 208.42689 126.01787 208.76283 126.01787 curveto
209.20814 126.01787 209.65541 125.92998 210.10463 125.7542 curveto
210.55775 125.57451 210.88001 125.39873 211.07143 125.22685 curveto
211.13002 125.22685 lineto
211.13002 126.42802 lineto
210.75892 126.58427 210.38001 126.71513 209.9933 126.8206 curveto
209.60658 126.92607 209.20033 126.97881 208.77455 126.97881 curveto
207.68861 126.97881 206.84096 126.68584 206.23158 126.0999 curveto
205.62221 125.51006 205.31752 124.67412 205.31752 123.59209 curveto
205.31752 122.52178 205.60853 121.67217 206.19057 121.04326 curveto
206.7765 120.41436 207.54603 120.09991 208.49916 120.0999 curveto
209.38197 120.09991 210.06166 120.35772 210.53822 120.87334 curveto
211.01869 121.38897 211.25892 122.12139 211.25893 123.0706 curveto
211.25893 123.66826 lineto
210.18666 122.82451 moveto
210.18275 122.24639 210.03626 121.79912 209.74721 121.48271 curveto
209.46205 121.16631 209.0265 121.00811 208.44057 121.0081 curveto
207.85072 121.00811 207.38002 121.18194 207.02846 121.52959 curveto
206.6808 121.87725 206.48353 122.30889 206.43666 122.82451 curveto
210.18666 122.82451 lineto
210.32143 117.00615 moveto
208.72182 119.19756 lineto
207.84877 119.19756 lineto
208.8976 117.00615 lineto
210.32143 117.00615 lineto
fill
grestore
gsave
0 0 0 setrgbcolor
newpath
218.01479 126.82646 moveto
216.91908 126.82646 lineto
216.91908 126.1292 lineto
216.82142 126.1956 216.68861 126.28935 216.52065 126.41045 curveto
216.35658 126.52763 216.19642 126.62138 216.04018 126.6917 curveto
215.85658 126.78154 215.64564 126.85576 215.40736 126.91435 curveto
215.16908 126.97685 214.88978 127.0081 214.56947 127.0081 curveto
213.97963 127.0081 213.47963 126.81279 213.06947 126.42216 curveto
212.65932 126.03154 212.45424 125.53349 212.45424 124.92802 curveto
212.45424 124.43193 212.55971 124.03154 212.77065 123.72685 curveto
212.98549 123.41826 213.29017 123.17607 213.68471 123.00029 curveto
214.08314 122.82451 214.56166 122.70537 215.12025 122.64287 curveto
215.67884 122.58037 216.27845 122.5335 216.91908 122.50224 curveto
216.91908 122.33232 lineto
216.91908 122.08233 216.87416 121.87529 216.78432 121.71123 curveto
216.69837 121.54717 216.57337 121.41826 216.40932 121.32451 curveto
216.25306 121.23467 216.06556 121.17412 215.84682 121.14287 curveto
215.62806 121.11162 215.39955 121.096 215.16127 121.09599 curveto
214.8722 121.096 214.54994 121.13506 214.19447 121.21318 curveto
213.839 121.2874 213.47182 121.39678 213.09291 121.54131 curveto
213.03432 121.54131 lineto
213.03432 120.42216 lineto
213.24916 120.36358 213.55971 120.29912 213.96596 120.22881 curveto
214.37221 120.1585 214.7726 120.12334 215.16713 120.12334 curveto
215.62806 120.12334 216.02845 120.16241 216.3683 120.24052 curveto
216.71205 120.31475 217.00892 120.44366 217.25893 120.62724 curveto
217.50501 120.80694 217.69251 121.03936 217.82143 121.32451 curveto
217.95033 121.60967 218.01478 121.96319 218.01479 122.38506 curveto
218.01479 126.82646 lineto
216.91908 125.21513 moveto
216.91908 123.39287 lineto
216.58314 123.4124 216.18666 123.4417 215.72963 123.48076 curveto
215.2765 123.51982 214.91713 123.57647 214.6515 123.65068 curveto
214.3351 123.74053 214.07924 123.88115 213.88393 124.07256 curveto
213.68861 124.26006 213.59096 124.51982 213.59096 124.85185 curveto
213.59096 125.22685 213.70424 125.51006 213.9308 125.70146 curveto
214.15736 125.88896 214.50306 125.98271 214.96791 125.98271 curveto
215.35463 125.98271 215.70814 125.90849 216.02846 125.76006 curveto
216.34877 125.60771 216.64564 125.42607 216.91908 125.21513 curveto
fill
grestore
gsave
0 0 0 setrgbcolor
newpath
221.26088 126.82646 moveto
220.15932 126.82646 lineto
220.15932 117.70927 lineto
221.26088 117.70927 lineto
221.26088 126.82646 lineto
fill
grestore
gsave [0.991661 0 0 1.008409 0 0] concat
gsave
0 0 0 setrgbcolor
newpath
176.34259 134.46853 moveto
176.34259 134.72137 176.29789 134.95634 176.20851 135.17342 curveto
176.12167 135.38796 175.99908 135.57439 175.84074 135.73274 curveto
175.64408 135.92939 175.41167 136.07752 175.14351 136.17712 curveto
174.87534 136.27418 174.53694 136.3227 174.12831 136.3227 curveto
173.36979 136.3227 lineto
173.36979 138.44887 lineto
172.61126 138.44887 lineto
172.61126 132.74461 lineto
174.15896 132.74461 lineto
174.50119 132.74461 174.79106 132.77399 175.02858 132.83272 curveto
175.2661 132.88891 175.4768 132.9783 175.66069 133.10089 curveto
175.87777 133.24647 176.04505 133.4278 176.16254 133.64488 curveto
176.28257 133.86197 176.34259 134.13652 176.34259 134.46853 curveto
175.55342 134.48768 moveto
175.55342 134.29103 175.51894 134.11992 175.44999 133.97434 curveto
175.38102 133.82877 175.27631 133.71001 175.13585 133.61806 curveto
175.01326 133.53889 174.87279 133.48271 174.71445 133.4495 curveto
174.55865 133.41375 174.36072 133.39587 174.12065 133.39587 curveto
173.36979 133.39587 lineto
173.36979 135.67527 lineto
174.00955 135.67527 lineto
174.31603 135.67528 174.56504 135.64846 174.75659 135.59482 curveto
174.94813 135.53864 175.10392 135.45053 175.22396 135.33049 curveto
175.34399 135.2079 175.42827 135.07893 175.4768 134.94356 curveto
175.52788 134.80821 175.55342 134.65625 175.55342 134.48768 curveto
fill
grestore
gsave
0 0 0 setrgbcolor
newpath
180.4302 138.44887 moveto
179.71381 138.44887 lineto
179.71381 137.99299 lineto
179.64996 138.0364 179.56313 138.0977 179.45331 138.17687 curveto
179.34604 138.25349 179.24133 138.31479 179.13917 138.36076 curveto
179.01913 138.4195 178.88122 138.46802 178.72543 138.50633 curveto
178.56964 138.54719 178.38703 138.56763 178.17761 138.56763 curveto
177.79196 138.56763 177.46505 138.43993 177.19689 138.18453 curveto
176.92872 137.92914 176.79464 137.60351 176.79464 137.20765 curveto
176.79464 136.88329 176.8636 136.62151 177.00151 136.4223 curveto
177.14198 136.22054 177.34119 136.0622 177.59914 135.94727 curveto
177.85964 135.83234 178.1725 135.75445 178.53772 135.71358 curveto
178.90293 135.67272 179.29496 135.64207 179.71381 135.62164 curveto
179.71381 135.51054 lineto
179.71381 135.34709 179.68444 135.21173 179.6257 135.10446 curveto
179.56951 134.9972 179.48779 134.91292 179.38052 134.85162 curveto
179.27836 134.79288 179.15577 134.7533 179.01275 134.73286 curveto
178.86973 134.71244 178.72032 134.70222 178.56453 134.70222 curveto
178.37554 134.70222 178.16484 134.72776 177.93243 134.77883 curveto
177.70002 134.82736 177.45995 134.89887 177.21221 134.99337 curveto
177.1739 134.99337 lineto
177.1739 134.26166 lineto
177.31437 134.22335 177.51741 134.18121 177.78302 134.13524 curveto
178.04863 134.08927 178.31041 134.06629 178.56836 134.06628 curveto
178.86973 134.06629 179.13151 134.09182 179.35371 134.1429 curveto
179.57845 134.19143 179.77255 134.27571 179.93601 134.39574 curveto
180.0969 134.51323 180.21949 134.66519 180.30378 134.85162 curveto
180.38805 135.03806 180.43019 135.2692 180.4302 135.54502 curveto
180.4302 138.44887 lineto
179.71381 137.39536 moveto
179.71381 136.20394 lineto
179.49417 136.21671 179.23494 136.23587 178.93613 136.26141 curveto
178.63987 136.28695 178.40491 136.32398 178.23124 136.3725 curveto
178.02437 136.43125 177.85709 136.52319 177.72939 136.64833 curveto
177.60169 136.77092 177.53784 136.94076 177.53784 137.15784 curveto
177.53784 137.40302 177.61191 137.58819 177.76004 137.71333 curveto
177.90817 137.83592 178.13419 137.89721 178.43811 137.89721 curveto
178.69095 137.89721 178.92208 137.84869 179.13151 137.75164 curveto
179.34093 137.65203 179.53503 137.53328 179.71381 137.39536 curveto
fill
grestore
gsave
0 0 0 setrgbcolor
newpath
184.49482 134.95506 moveto
184.45651 134.95506 lineto
184.34924 134.92952 184.24453 134.91164 184.14237 134.90142 curveto
184.04276 134.88866 183.92401 134.88227 183.78609 134.88227 curveto
183.5639 134.88227 183.34937 134.93208 183.1425 135.03168 curveto
182.93563 135.12873 182.73642 135.25515 182.54487 135.41094 curveto
182.54487 138.44887 lineto
181.82466 138.44887 lineto
181.82466 134.16972 lineto
182.54487 134.16972 lineto
182.54487 134.80182 lineto
182.83091 134.57197 183.08248 134.40979 183.29957 134.31529 curveto
183.5192 134.21825 183.74267 134.16972 183.96998 134.16972 curveto
184.09512 134.16972 184.18579 134.17355 184.24198 134.18121 curveto
184.29816 134.18632 184.38244 134.19781 184.49482 134.21569 curveto
184.49482 134.95506 lineto
fill
grestore
gsave
0 0 0 setrgbcolor
newpath
187.4025 138.41056 moveto
187.26713 138.44631 187.119 138.47568 186.95811 138.49867 curveto
186.79976 138.52166 186.65802 138.53315 186.53287 138.53315 curveto
186.09615 138.53315 185.76413 138.41567 185.53683 138.1807 curveto
185.30953 137.94574 185.19588 137.56903 185.19588 137.05058 curveto
185.19588 134.775 lineto
184.70935 134.775 lineto
184.70935 134.16972 lineto
185.19588 134.16972 lineto
185.19588 132.93999 lineto
185.91609 132.93999 lineto
185.91609 134.16972 lineto
187.4025 134.16972 lineto
187.4025 134.775 lineto
185.91609 134.775 lineto
185.91609 136.72495 lineto
185.91609 136.9497 185.9212 137.12592 185.93142 137.25362 curveto
185.94163 137.37876 185.97739 137.49624 186.03868 137.60606 curveto
186.09487 137.70822 186.17149 137.78356 186.26854 137.83209 curveto
186.36814 137.87806 186.51883 137.90104 186.72059 137.90104 curveto
186.83807 137.90104 186.96066 137.88444 187.08836 137.85124 curveto
187.21605 137.81549 187.308 137.78612 187.36419 137.76313 curveto
187.4025 137.76313 lineto
187.4025 138.41056 lineto
fill
grestore
gsave
0 0 0 setrgbcolor
newpath
189.00383 138.44887 moveto
188.28361 138.44887 lineto
188.28361 132.48794 lineto
189.00383 132.48794 lineto
189.00383 138.44887 lineto
fill
grestore
gsave
0 0 0 setrgbcolor
newpath
194.10663 134.16972 moveto
191.60886 140.02721 lineto
190.83884 140.02721 lineto
191.63568 138.242 lineto
189.93091 134.16972 lineto
190.71242 134.16972 lineto
192.02643 137.34173 lineto
193.35193 134.16972 lineto
194.10663 134.16972 lineto
fill
grestore
gsave
0 0 0 setrgbcolor
newpath
fill
grestore
gsave
0 0 0 setrgbcolor
newpath
202.27035 138.03513 moveto
202.12987 138.09642 202.00218 138.15389 201.88725 138.20752 curveto
201.77487 138.26115 201.62675 138.31734 201.44286 138.37608 curveto
201.28707 138.42461 201.11723 138.46547 200.93335 138.49867 curveto
200.75202 138.53443 200.55153 138.5523 200.33189 138.5523 curveto
199.91815 138.5523 199.54144 138.49484 199.20177 138.37991 curveto
198.86465 138.26243 198.57094 138.07982 198.32065 137.83209 curveto
198.07547 137.58946 197.88393 137.28171 197.74601 136.90883 curveto
197.6081 136.5334 197.53914 136.09795 197.53914 135.60248 curveto
197.53914 135.13256 197.60555 134.71244 197.73835 134.34211 curveto
197.87116 133.97179 198.0627 133.65893 198.31299 133.40353 curveto
198.55562 133.1558 198.84804 132.96681 199.19028 132.83655 curveto
199.53506 132.70631 199.91687 132.64118 200.33573 132.64117 curveto
200.6422 132.64118 200.94739 132.67821 201.25132 132.75227 curveto
201.55779 132.82634 201.89746 132.95659 202.27035 133.14303 curveto
202.27035 134.0433 lineto
202.21288 134.0433 lineto
201.89874 133.78024 201.58716 133.5887 201.27813 133.46866 curveto
200.9691 133.34862 200.63837 133.28861 200.28592 133.2886 curveto
199.99732 133.28861 199.73682 133.33585 199.50441 133.43035 curveto
199.27455 133.52229 199.06896 133.66659 198.88763 133.86324 curveto
198.71141 134.05479 198.57349 134.29742 198.47389 134.59112 curveto
198.37684 134.88227 198.32832 135.21939 198.32832 135.60248 curveto
198.32832 136.00346 198.38195 136.34824 198.48922 136.63684 curveto
198.59903 136.92544 198.7395 137.1604 198.91062 137.34173 curveto
199.08939 137.53072 199.29754 137.67119 199.53506 137.76313 curveto
199.77513 137.85252 200.02797 137.89721 200.29358 137.89721 curveto
200.6588 137.89721 201.00103 137.83464 201.32027 137.7095 curveto
201.63951 137.58435 201.93833 137.39664 202.21671 137.14635 curveto
202.27035 137.14635 lineto
202.27035 138.03513 lineto
fill
grestore
gsave
0 0 0 setrgbcolor
newpath
204.02108 138.44887 moveto
203.30087 138.44887 lineto
203.30087 132.48794 lineto
204.02108 132.48794 lineto
204.02108 138.44887 lineto
fill
grestore
gsave
0 0 0 setrgbcolor
newpath
209.07025 136.31121 moveto
209.07025 137.00844 208.89147 137.55882 208.53392 137.96234 curveto
208.17636 138.36586 207.6975 138.56763 207.09732 138.56763 curveto
206.49203 138.56763 206.01061 138.36586 205.65306 137.96234 curveto
205.29806 137.55882 205.12056 137.00844 205.12056 136.31121 curveto
205.12056 135.61398 205.29806 135.0636 205.65306 134.66008 curveto
206.01061 134.254 206.49203 134.05096 207.09732 134.05096 curveto
207.6975 134.05096 208.17636 134.254 208.53392 134.66008 curveto
208.89147 135.0636 209.07025 135.61398 209.07025 136.31121 curveto
208.32705 136.31121 moveto
208.32705 135.757 208.2185 135.34582 208.00142 135.07765 curveto
207.78433 134.80693 207.48297 134.67157 207.09732 134.67157 curveto
206.70656 134.67157 206.40264 134.80693 206.18556 135.07765 curveto
205.97103 135.34582 205.86376 135.757 205.86376 136.31121 curveto
205.86376 136.84754 205.9723 137.25489 206.18939 137.53327 curveto
206.40647 137.8091 206.70912 137.94702 207.09732 137.94702 curveto
207.48041 137.94702 207.7805 137.81038 207.99759 137.53711 curveto
208.21723 137.26128 208.32705 136.85265 208.32705 136.31121 curveto
fill
grestore
gsave
0 0 0 setrgbcolor
newpath
213.73633 138.44887 moveto
213.01611 138.44887 lineto
213.01611 137.97383 lineto
212.77348 138.16538 212.54107 138.31223 212.31888 138.41439 curveto
212.09668 138.51655 211.8515 138.56763 211.58334 138.56763 curveto
211.13384 138.56763 210.78395 138.43099 210.53367 138.15772 curveto
210.28338 137.88189 210.15823 137.47837 210.15823 136.94714 curveto
210.15823 134.16972 lineto
210.87845 134.16972 lineto
210.87845 136.60619 lineto
210.87845 136.82328 210.88866 137.00972 210.9091 137.16551 curveto
210.92953 137.31874 210.97295 137.45027 211.03935 137.56009 curveto
211.1083 137.67247 211.19769 137.75419 211.30751 137.80527 curveto
211.41733 137.85635 211.57695 137.88189 211.78638 137.88189 curveto
211.97282 137.88189 212.17586 137.83337 212.3955 137.73631 curveto
212.61769 137.63926 212.82456 137.5154 213.01611 137.36471 curveto
213.01611 134.16972 lineto
213.73633 134.16972 lineto
213.73633 138.44887 lineto
fill
grestore
gsave
0 0 0 setrgbcolor
newpath
218.6246 138.44887 moveto
217.90438 138.44887 lineto
217.90438 138.00065 lineto
217.69751 138.17943 217.4817 138.31862 217.25695 138.41822 curveto
217.0322 138.51782 216.7883 138.56763 216.52525 138.56763 curveto
216.01445 138.56763 215.60837 138.37097 215.30701 137.97766 curveto
215.0082 137.58435 214.85879 137.03909 214.85879 136.34185 curveto
214.85879 135.9792 214.90987 135.65612 215.01203 135.37263 curveto
215.11674 135.08914 215.25721 134.84779 215.43343 134.64858 curveto
215.6071 134.45449 215.80886 134.30636 216.03872 134.20419 curveto
216.27113 134.10204 216.5112 134.05096 216.75893 134.05096 curveto
216.98368 134.05096 217.18289 134.07522 217.35656 134.12374 curveto
217.53022 134.16972 217.71283 134.24251 217.90438 134.34211 curveto
217.90438 132.48794 lineto
218.6246 132.48794 lineto
218.6246 138.44887 lineto
217.90438 137.39536 moveto
217.90438 134.93973 lineto
217.71028 134.8529 217.53661 134.79288 217.38337 134.75968 curveto
217.23013 134.72648 217.06285 134.70988 216.88152 134.70988 curveto
216.478 134.70988 216.16386 134.85035 215.93911 135.13128 curveto
215.71436 135.41222 215.60199 135.81063 215.60199 136.32653 curveto
215.60199 136.83477 215.68882 137.22169 215.86249 137.4873 curveto
216.03616 137.75036 216.31454 137.88189 216.69764 137.88189 curveto
216.90195 137.88189 217.10882 137.8372 217.31825 137.74781 curveto
217.52767 137.65587 217.72305 137.53838 217.90438 137.39536 curveto
fill
grestore
gsave
0 0 0 setrgbcolor
newpath
223.74272 134.16972 moveto
221.24496 140.02721 lineto
220.47494 140.02721 lineto
221.27177 138.242 lineto
219.56701 134.16972 lineto
220.34852 134.16972 lineto
221.66253 137.34173 lineto
222.98803 134.16972 lineto
223.74272 134.16972 lineto
fill
grestore
grestore
gsave [0.987827 0 0 1.012323 0 0] concat
gsave
0 0 0 setrgbcolor
newpath
175.1981 146.72876 moveto
172.68835 146.72876 lineto
172.68835 146.20839 lineto
172.86264 146.059 173.03693 145.90961 173.21122 145.76022 curveto
173.38716 145.61083 173.55066 145.46227 173.70171 145.31454 curveto
174.02041 145.0058 174.23869 144.76097 174.35654 144.58004 curveto
174.47439 144.39745 174.53331 144.20076 174.53332 143.98995 curveto
174.53331 143.7974 174.46941 143.64718 174.3416 143.53929 curveto
174.21545 143.42974 174.03867 143.37496 173.81127 143.37496 curveto
173.66022 143.37496 173.49672 143.40152 173.32077 143.45463 curveto
173.14482 143.50775 172.97302 143.58909 172.80538 143.69864 curveto
172.78048 143.69864 lineto
172.78048 143.17577 lineto
172.89833 143.11768 173.05519 143.06456 173.25105 143.01642 curveto
173.44858 142.96829 173.63947 142.94422 173.82372 142.94422 curveto
174.20383 142.94422 174.50178 143.03635 174.71756 143.22059 curveto
174.93335 143.40318 175.04124 143.65133 175.04124 143.96505 curveto
175.04124 144.10614 175.02298 144.2381 174.98647 144.36093 curveto
174.95161 144.48211 174.89932 144.59747 174.82961 144.70702 curveto
174.76487 144.80993 174.68851 144.91119 174.60054 145.01078 curveto
174.51423 145.11037 174.40882 145.22075 174.28433 145.34192 curveto
174.10672 145.51621 173.92331 145.68552 173.73408 145.84985 curveto
173.54485 146.01252 173.36808 146.16357 173.20375 146.303 curveto
175.1981 146.303 lineto
175.1981 146.72876 lineto
fill
grestore
gsave
0 0 0 setrgbcolor
newpath
178.49962 145.52617 moveto
178.49961 145.90297 178.37512 146.21088 178.12614 146.4499 curveto
177.87882 146.68726 177.57506 146.80594 177.21486 146.80594 curveto
177.03227 146.80594 176.86629 146.77773 176.7169 146.72129 curveto
176.56751 146.66485 176.43555 146.58103 176.32101 146.46982 curveto
176.17826 146.33205 176.06788 146.14946 175.98987 145.92205 curveto
175.91351 145.69465 175.87534 145.42077 175.87534 145.10041 curveto
175.87534 144.77176 175.91019 144.48045 175.97991 144.22648 curveto
176.05128 143.97252 176.16416 143.74678 176.31853 143.54925 curveto
176.46459 143.36168 176.65299 143.21561 176.88372 143.11104 curveto
177.11444 143.00481 177.38334 142.95169 177.69042 142.95169 curveto
177.78835 142.95169 177.87052 142.95584 177.93691 142.96414 curveto
178.00331 142.97244 178.07053 142.98738 178.13859 143.00895 curveto
178.13859 143.48451 lineto
178.11369 143.48451 lineto
178.06721 143.45962 177.99667 143.43638 177.90206 143.4148 curveto
177.8091 143.39156 177.71366 143.37994 177.61573 143.37994 curveto
177.25885 143.37994 176.97418 143.49198 176.76171 143.71607 curveto
176.54925 143.93849 176.42559 144.23976 176.39073 144.61987 curveto
176.53016 144.53522 176.6671 144.47132 176.80155 144.42816 curveto
176.93766 144.38334 177.09452 144.36093 177.27213 144.36093 curveto
177.42982 144.36093 177.56842 144.37587 177.68793 144.40575 curveto
177.8091 144.43397 177.93276 144.49207 178.05892 144.58004 curveto
178.20498 144.68129 178.31454 144.8091 178.38757 144.96347 curveto
178.46227 145.11784 178.49961 145.30541 178.49962 145.52617 curveto
177.99418 145.54609 moveto
177.99418 145.39172 177.97094 145.26391 177.92447 145.16266 curveto
177.87965 145.06141 177.80495 144.97343 177.70038 144.89873 curveto
177.62402 144.84562 177.53937 144.81076 177.44642 144.79416 curveto
177.35346 144.77757 177.25636 144.76927 177.15511 144.76926 curveto
177.01402 144.76927 176.88289 144.78586 176.76171 144.81906 curveto
176.64054 144.85226 176.51605 144.90372 176.38824 144.97343 curveto
176.38492 145.00995 176.38243 145.04564 176.38077 145.08049 curveto
176.37911 145.11369 176.37828 145.15602 176.37828 145.20747 curveto
176.37828 145.46974 176.40484 145.67722 176.45796 145.82993 curveto
176.51273 145.98098 176.58743 146.10049 176.68204 146.18847 curveto
176.75839 146.2615 176.84056 146.31545 176.92853 146.35031 curveto
177.01817 146.3835 177.11527 146.4001 177.21984 146.4001 curveto
177.46053 146.4001 177.64975 146.32707 177.78752 146.181 curveto
177.92529 146.03327 177.99418 145.82163 177.99418 145.54609 curveto
fill
grestore
gsave
0 0 0 setrgbcolor
newpath
fill
grestore
gsave
0 0 0 setrgbcolor
newpath
183.93491 146.45986 moveto
183.84362 146.4997 183.76062 146.53704 183.68593 146.5719 curveto
183.61289 146.60676 183.51662 146.64328 183.39711 146.68145 curveto
183.29586 146.71299 183.18547 146.73955 183.06596 146.76113 curveto
182.94811 146.78437 182.81781 146.79599 182.67506 146.79599 curveto
182.40616 146.79599 182.16132 146.75864 181.94056 146.68394 curveto
181.72145 146.60759 181.53057 146.48891 181.3679 146.3279 curveto
181.20855 146.17021 181.08406 145.97019 180.99443 145.72785 curveto
180.90479 145.48385 180.85997 145.20084 180.85998 144.87882 curveto
180.85997 144.5734 180.90313 144.30035 180.98945 144.05966 curveto
181.07576 143.81898 181.20025 143.61565 181.36292 143.44965 curveto
181.52061 143.28865 181.71067 143.16582 181.93309 143.08116 curveto
182.15717 142.99651 182.40533 142.95418 182.67755 142.95418 curveto
182.87673 142.95418 183.07509 142.97825 183.27262 143.02638 curveto
183.4718 143.07452 183.69257 143.15918 183.93491 143.28035 curveto
183.93491 143.86546 lineto
183.89757 143.86546 lineto
183.6934 143.69449 183.49089 143.57 183.29005 143.49198 curveto
183.0892 143.41397 182.87424 143.37496 182.64518 143.37496 curveto
182.45761 143.37496 182.28831 143.40567 182.13726 143.46708 curveto
181.98787 143.52684 181.85425 143.62063 181.7364 143.74843 curveto
181.62186 143.87293 181.53223 144.03062 181.46749 144.2215 curveto
181.40442 144.41073 181.37288 144.62984 181.37288 144.87882 curveto
181.37288 145.13942 181.40774 145.3635 181.47745 145.55107 curveto
181.54883 145.73864 181.64012 145.89135 181.75133 146.0092 curveto
181.86752 146.13203 182.00281 146.22332 182.15718 146.28308 curveto
182.3132 146.34118 182.47753 146.37022 182.65016 146.37022 curveto
182.88752 146.37022 183.10995 146.32956 183.31744 146.24822 curveto
183.52492 146.16689 183.71913 146.04489 183.90006 145.88222 curveto
183.93491 145.88222 lineto
183.93491 146.45986 lineto
fill
grestore
grestore
gsave [0.618902 0 0 0.618902 59.77679 34.2125] concat
0 0 0 setrgbcolor
[] 0 setdash
0.2 setlinewidth
1 setlinejoin
1 setlinecap
newpath
191.42858 179.50504 moveto
191.42858 180.09646 190.94858 180.57646 190.35715 180.57646 curveto
189.76572 180.57646 189.28572 180.09646 189.28572 179.50504 curveto
189.28572 178.91361 189.76572 178.43361 190.35715 178.43361 curveto
190.94858 178.43361 191.42858 178.91361 191.42858 179.50504 curveto
closepath
stroke
grestore
grestore
showpage
