%!PS-Adobe-3.0 EPSF-3.0
%%Creator: ansi2ps, written by S.Fourmanoit, 2005.
%%LanguageLevel: 2
%%BoundingBox: 0 116 522 789
%%Pages: 1 0

%-------------------------------------------------
% Headers
%-------------------------------------------------
/Times-Roman findfont
%/System findfont
12 scalefont
setfont

/cr {
   currentpoint
   12 sub
   exch pop 0 exch
   moveto
} def
%-------------------------------------------------
% Content
%-------------------------------------------------

%%Page: 1 1
0 780 moveto
0 0 0 setrgbcolor
() show
() show
0 1 0 setrgbcolor
(These are the packages that I would merge, in reverse order:) show
0 0 0 setrgbcolor
() show
cr
() show
cr
(Calculating dependencies    ...done!) show
cr
([ebuild  ) show
0 1 0 setrgbcolor
(N) show
0 0 0 setrgbcolor
(    ] ) show
0 1 0 setrgbcolor
(gnome-extra/gdesklets-core-20050316) show
0 0 0 setrgbcolor
(  ) show
0 0 1 setrgbcolor
(-debug) show
0 0 0 setrgbcolor
( ) show
0 0 1 setrgbcolor
(-doc) show
0 0 0 setrgbcolor
( 0 kB ) show
0 1 1 setrgbcolor
([1]) show
0 0 0 setrgbcolor
( ) show
cr
([ebuild  ) show
0 1 0 setrgbcolor
(N) show
0 0 0 setrgbcolor
(    ]  ) show
0 1 0 setrgbcolor
(gnome-base/librsvg-2.8.1-r1) show
0 0 0 setrgbcolor
(  ) show
0 0 1 setrgbcolor
(-debug) show
0 0 0 setrgbcolor
( ) show
0 0 1 setrgbcolor
(-doc) show
0 0 0 setrgbcolor
( ) show
0 0 1 setrgbcolor
(-gnome) show
0 0 0 setrgbcolor
( ) show
1 0 0 setrgbcolor
(+zlib) show
0 0 0 setrgbcolor
( 352 kB ) show
cr
([ebuild  ) show
0 1 0 setrgbcolor
(N) show
0 0 0 setrgbcolor
(    ]   ) show
0 1 0 setrgbcolor
(gnome-extra/libgsf-1.10.0) show
0 0 0 setrgbcolor
(  ) show
0 0 1 setrgbcolor
(-debug) show
0 0 0 setrgbcolor
( ) show
0 0 1 setrgbcolor
(-doc) show
0 0 0 setrgbcolor
( ) show
0 0 1 setrgbcolor
(-gnome) show
0 0 0 setrgbcolor
( 389 kB ) show
cr
([ebuild  ) show
0 1 0 setrgbcolor
(N) show
0 0 0 setrgbcolor
(    ]   ) show
0 1 0 setrgbcolor
(dev-libs/libcroco-0.6.0) show
0 0 0 setrgbcolor
(  ) show
0 0 1 setrgbcolor
(-debug) show
0 0 0 setrgbcolor
( 349 kB ) show
cr
([ebuild  ) show
0 1 0 setrgbcolor
(N) show
0 0 0 setrgbcolor
(    ]  ) show
0 1 0 setrgbcolor
(gnome-base/libgtop-2.8.2) show
0 0 0 setrgbcolor
(  ) show
0 0 1 setrgbcolor
(-debug) show
0 0 0 setrgbcolor
( 1,023 kB ) show
cr
([ebuild  ) show
0 1 0 setrgbcolor
(N) show
0 0 0 setrgbcolor
(    ] ) show
0 1 0 setrgbcolor
(x11-themes/gnome-themes-2.8.1) show
0 0 0 setrgbcolor
(  ) show
0 0 1 setrgbcolor
(-accessibility) show
0 0 0 setrgbcolor
( ) show
0 0 1 setrgbcolor
(-debug) show
0 0 0 setrgbcolor
( 2,654 kB ) show
cr
([ebuild  ) show
0 1 0 setrgbcolor
(N) show
0 0 0 setrgbcolor
(    ]  ) show
0 1 0 setrgbcolor
(x11-themes/gtk-engines-2.2.0) show
0 0 0 setrgbcolor
(  1,072 kB ) show
cr
([ebuild  ) show
0 1 0 setrgbcolor
(N) show
0 0 0 setrgbcolor
(    ]   ) show
0 1 0 setrgbcolor
(media-libs/imlib-1.9.14-r3) show
0 0 0 setrgbcolor
(  574 kB ) show
cr
([ebuild  ) show
0 1 0 setrgbcolor
(N) show
0 0 0 setrgbcolor
(    ]    ) show
0 1 0 setrgbcolor
(media-libs/tiff-3.7.1-r1) show
0 0 0 setrgbcolor
(  1,224 kB ) show
cr
([ebuild  ) show
0 1 0 setrgbcolor
(N) show
0 0 0 setrgbcolor
(    ]    ) show
0 1 0 setrgbcolor
(x11-libs/gtk+-1.2.10-r11) show
0 0 0 setrgbcolor
(  ) show
0 0 1 setrgbcolor
(-debug) show
0 0 0 setrgbcolor
( ) show
1 0 0 setrgbcolor
(+nls) show
0 0 0 setrgbcolor
( 2,880 kB ) show
cr
([ebuild  ) show
0 1 0 setrgbcolor
(N) show
0 0 0 setrgbcolor
(    ]     ) show
0 1 0 setrgbcolor
(dev-libs/glib-1.2.10-r5) show
0 0 0 setrgbcolor
(  ) show
0 0 1 setrgbcolor
(-debug) show
0 0 0 setrgbcolor
( 411 kB ) show
cr
([ebuild  ) show
0 1 0 setrgbcolor
(N) show
0 0 0 setrgbcolor
(    ]    ) show
0 1 0 setrgbcolor
(media-libs/giflib-4.1.3) show
0 0 0 setrgbcolor
(  ) show
1 0 0 setrgbcolor
(+X) show
0 0 0 setrgbcolor
( ) show
0 0 1 setrgbcolor
(-gif) show
0 0 0 setrgbcolor
( 556 kB ) show
cr
([ebuild  ) show
0 1 0 setrgbcolor
(N) show
0 0 0 setrgbcolor
(    ]    ) show
0 1 0 setrgbcolor
(media-libs/jpeg-6b-r4) show
0 0 0 setrgbcolor
(  ) show
0 0 1 setrgbcolor
(-debug) show
0 0 0 setrgbcolor
( 598 kB ) show
cr
([ebuild  ) show
0 1 0 setrgbcolor
(N) show
0 0 0 setrgbcolor
(    ] ) show
0 1 0 setrgbcolor
(x11-themes/gnome-icon-theme-2.8.0) show
0 0 0 setrgbcolor
(  ) show
0 0 1 setrgbcolor
(-debug) show
0 0 0 setrgbcolor
( 2,800 kB ) show
cr
([ebuild  ) show
0 1 0 setrgbcolor
(N) show
0 0 0 setrgbcolor
(    ]  ) show
0 1 0 setrgbcolor
(x11-themes/hicolor-icon-theme-0.5) show
0 0 0 setrgbcolor
(  30 kB ) show
cr
([ebuild  ) show
0 1 0 setrgbcolor
(N) show
0 0 0 setrgbcolor
(    ]  ) show
0 1 0 setrgbcolor
(dev-python/gnome-python-2.6.1) show
0 0 0 setrgbcolor
(  ) show
0 0 1 setrgbcolor
(-debug) show
0 0 0 setrgbcolor
( ) show
0 0 1 setrgbcolor
(-gtkhtml) show
0 0 0 setrgbcolor
( 0 kB ) show
0 1 1 setrgbcolor
([1]) show
0 0 0 setrgbcolor
( ) show
cr
([ebuild  ) show
0 1 0 setrgbcolor
(N) show
0 0 0 setrgbcolor
(    ]   ) show
0 1 0 setrgbcolor
(gnome-base/libgnomeui-2.8.1-r1) show
0 0 0 setrgbcolor
(  ) show
0 0 1 setrgbcolor
(-debug) show
0 0 0 setrgbcolor
( ) show
0 0 1 setrgbcolor
(-doc) show
0 0 0 setrgbcolor
( ) show
0 0 1 setrgbcolor
(-jpeg) show
0 0 0 setrgbcolor
( 1,422 kB ) show
cr
([ebuild  ) show
0 1 0 setrgbcolor
(N) show
0 0 0 setrgbcolor
(    ]    ) show
0 1 0 setrgbcolor
(gnome-base/gnome-keyring-0.4.0) show
0 0 0 setrgbcolor
(  ) show
0 0 1 setrgbcolor
(-debug) show
0 0 0 setrgbcolor
( 336 kB ) show
cr
([ebuild  ) show
0 1 0 setrgbcolor
(N) show
0 0 0 setrgbcolor
(    ]   ) show
0 1 0 setrgbcolor
(x11-libs/libzvt-2.0.1-r2) show
0 0 0 setrgbcolor
(  ) show
0 0 1 setrgbcolor
(-debug) show
0 0 0 setrgbcolor
( 244 kB ) show
cr
([ebuild  ) show
0 1 0 setrgbcolor
(N) show
0 0 0 setrgbcolor
(    ]   ) show
0 1 0 setrgbcolor
(dev-python/pyorbit-2.0.1) show
0 0 0 setrgbcolor
(  ) show
0 0 1 setrgbcolor
(-debug) show
0 0 0 setrgbcolor
( 237 kB ) show
cr
([ebuild  ) show
0 1 0 setrgbcolor
(N) show
0 0 0 setrgbcolor
(    ]   ) show
0 1 0 setrgbcolor
(gnome-base/libbonoboui-2.8.0) show
0 0 0 setrgbcolor
(  ) show
0 0 1 setrgbcolor
(-debug) show
0 0 0 setrgbcolor
( ) show
0 0 1 setrgbcolor
(-doc) show
0 0 0 setrgbcolor
( 947 kB ) show
cr
([ebuild  ) show
0 1 0 setrgbcolor
(N) show
0 0 0 setrgbcolor
(    ]    ) show
0 1 0 setrgbcolor
(gnome-base/libgnome-2.8.0) show
0 0 0 setrgbcolor
(  ) show
0 0 1 setrgbcolor
(-debug) show
0 0 0 setrgbcolor
( ) show
0 0 1 setrgbcolor
(-doc) show
0 0 0 setrgbcolor
( 1,136 kB ) show
cr
([ebuild  ) show
0 1 0 setrgbcolor
(N) show
0 0 0 setrgbcolor
(    ]     ) show
0 1 0 setrgbcolor
(gnome-base/gnome-vfs-2.8.3-r1) show
0 0 0 setrgbcolor
(  ) show
0 0 1 setrgbcolor
(-debug) show
0 0 0 setrgbcolor
( ) show
0 0 1 setrgbcolor
(-doc) show
0 0 0 setrgbcolor
( ) show
0 0 1 setrgbcolor
(-gnutls) show
0 0 0 setrgbcolor
( ) show
0 0 1 setrgbcolor
(-hal) show
0 0 0 setrgbcolor
( ) show
0 0 1 setrgbcolor
(-howl) show
0 0 0 setrgbcolor
( ) show
0 0 1 setrgbcolor
(-ipv6) show
0 0 0 setrgbcolor
( ) show
0 0 1 setrgbcolor
(-samba) show
0 0 0 setrgbcolor
( ) show
1 0 0 setrgbcolor
(+ssl) show
0 0 0 setrgbcolor
( 1,936 kB ) show
cr
([ebuild  ) show
0 1 0 setrgbcolor
(N) show
0 0 0 setrgbcolor
(    ]      ) show
0 1 0 setrgbcolor
(app-admin/fam-2.7.0-r2) show
0 0 0 setrgbcolor
(  294 kB ) show
cr
([ebuild  ) show
0 1 0 setrgbcolor
(N) show
0 0 0 setrgbcolor
(    ]       ) show
0 1 0 setrgbcolor
(net-nds/portmap-5b-r9) show
0 0 0 setrgbcolor
(  ) show
0 0 1 setrgbcolor
(-debug) show
0 0 0 setrgbcolor
( ) show
0 0 1 setrgbcolor
((-selinux)) show
0 0 0 setrgbcolor
( ) show
1 0 0 setrgbcolor
(+tcpd) show
0 0 0 setrgbcolor
( 18 kB ) show
cr
([ebuild  ) show
0 1 0 setrgbcolor
(N) show
0 0 0 setrgbcolor
(    ]      ) show
0 1 0 setrgbcolor
(gnome-base/gnome-mime-data-2.4.2) show
0 0 0 setrgbcolor
(  ) show
0 0 1 setrgbcolor
(-debug) show
0 0 0 setrgbcolor
( 829 kB ) show
cr
([ebuild  ) show
0 1 0 setrgbcolor
(N) show
0 0 0 setrgbcolor
(    ]      ) show
0 1 0 setrgbcolor
(gnome-base/gconf-2.8.1-r1) show
0 0 0 setrgbcolor
(  ) show
0 0 1 setrgbcolor
(-debug) show
0 0 0 setrgbcolor
( ) show
0 0 1 setrgbcolor
(-doc) show
0 0 0 setrgbcolor
( 1,690 kB ) show
cr
([ebuild  ) show
0 1 0 setrgbcolor
(N) show
0 0 0 setrgbcolor
(    ]     ) show
0 1 0 setrgbcolor
(media-sound/esound-0.2.34) show
0 0 0 setrgbcolor
(  ) show
0 0 1 setrgbcolor
(-alsa) show
0 0 0 setrgbcolor
( ) show
0 0 1 setrgbcolor
(-ipv6) show
0 0 0 setrgbcolor
( ) show
1 0 0 setrgbcolor
(+tcpd) show
0 0 0 setrgbcolor
( 310 kB ) show
cr
([ebuild  ) show
0 1 0 setrgbcolor
(N) show
0 0 0 setrgbcolor
(    ]      ) show
0 1 0 setrgbcolor
(media-libs/audiofile-0.2.6-r1) show
0 0 0 setrgbcolor
(  365 kB ) show
cr
([ebuild  ) show
0 1 0 setrgbcolor
(N) show
0 0 0 setrgbcolor
(    ]    ) show
0 1 0 setrgbcolor
(gnome-base/libgnomecanvas-2.8.0) show
0 0 0 setrgbcolor
(  ) show
0 0 1 setrgbcolor
(-debug) show
0 0 0 setrgbcolor
( ) show
0 0 1 setrgbcolor
(-doc) show
0 0 0 setrgbcolor
( 565 kB ) show
cr
([ebuild  ) show
0 1 0 setrgbcolor
(N) show
0 0 0 setrgbcolor
(    ]     ) show
0 1 0 setrgbcolor
(media-libs/libart_lgpl-2.3.16) show
0 0 0 setrgbcolor
(  ) show
0 0 1 setrgbcolor
(-debug) show
0 0 0 setrgbcolor
( 259 kB ) show
cr
([ebuild  ) show
0 1 0 setrgbcolor
(N) show
0 0 0 setrgbcolor
(    ]    ) show
0 1 0 setrgbcolor
(gnome-base/libglade-2.4.0) show
0 0 0 setrgbcolor
(  ) show
0 0 1 setrgbcolor
(-debug) show
0 0 0 setrgbcolor
( ) show
0 0 1 setrgbcolor
(-doc) show
0 0 0 setrgbcolor
( 303 kB ) show
cr
([ebuild  ) show
0 1 0 setrgbcolor
(N) show
0 0 0 setrgbcolor
(    ]    ) show
0 1 0 setrgbcolor
(gnome-base/libbonobo-2.8.0) show
0 0 0 setrgbcolor
(  ) show
0 0 1 setrgbcolor
(-debug) show
0 0 0 setrgbcolor
( ) show
0 0 1 setrgbcolor
(-doc) show
0 0 0 setrgbcolor
( 1,426 kB ) show
cr
([ebuild  ) show
0 1 0 setrgbcolor
(N) show
0 0 0 setrgbcolor
(    ]     ) show
0 1 0 setrgbcolor
(gnome-base/orbit-2.12.0) show
0 0 0 setrgbcolor
(  ) show
0 0 1 setrgbcolor
(-debug) show
0 0 0 setrgbcolor
( ) show
0 0 1 setrgbcolor
(-doc) show
0 0 0 setrgbcolor
( ) show
1 0 0 setrgbcolor
(+ssl) show
0 0 0 setrgbcolor
( 651 kB ) show
cr
([ebuild  ) show
0 1 0 setrgbcolor
(N) show
0 0 0 setrgbcolor
(    ]      ) show
0 1 0 setrgbcolor
(dev-libs/libIDL-0.8.4) show
0 0 0 setrgbcolor
(  ) show
0 0 1 setrgbcolor
(-debug) show
0 0 0 setrgbcolor
( 318 kB ) show
cr
([ebuild  ) show
0 1 0 setrgbcolor
(N) show
0 0 0 setrgbcolor
(    ]      ) show
0 1 0 setrgbcolor
(dev-util/indent-2.2.9-r2) show
0 0 0 setrgbcolor
(  ) show
1 0 0 setrgbcolor
(+nls) show
0 0 0 setrgbcolor
( 662 kB ) show
cr
([ebuild  ) show
0 1 0 setrgbcolor
(N) show
0 0 0 setrgbcolor
(    ]  ) show
0 1 0 setrgbcolor
(dev-python/pygtk-2.4.1) show
0 0 0 setrgbcolor
(  ) show
0 0 1 setrgbcolor
(-debug) show
0 0 0 setrgbcolor
( ) show
0 0 1 setrgbcolor
(-doc) show
0 0 0 setrgbcolor
( ) show
0 0 1 setrgbcolor
(-gnome) show
0 0 0 setrgbcolor
( ) show
1 0 0 setrgbcolor
(+opengl) show
0 0 0 setrgbcolor
( 697 kB ) show
cr
([ebuild  ) show
0 1 0 setrgbcolor
(N) show
0 0 0 setrgbcolor
(    ]   ) show
0 1 0 setrgbcolor
(x11-libs/gtkglarea-1.99.0) show
0 0 0 setrgbcolor
(  ) show
0 0 1 setrgbcolor
(-debug) show
0 0 0 setrgbcolor
( 205 kB ) show
cr
([ebuild  ) show
0 1 0 setrgbcolor
(N) show
0 0 0 setrgbcolor
(    ]   ) show
0 1 0 setrgbcolor
(dev-python/pyopengl-2.0.0.44) show
0 0 0 setrgbcolor
(  1,251 kB ) show
cr
([ebuild  ) show
0 1 0 setrgbcolor
(N) show
0 0 0 setrgbcolor
(    ]    ) show
0 1 0 setrgbcolor
(media-libs/glut-3.7.1) show
0 0 0 setrgbcolor
(  2,479 kB ) show
cr
([ebuild  ) show
0 1 0 setrgbcolor
(N) show
0 0 0 setrgbcolor
(    ]   ) show
0 1 0 setrgbcolor
(x11-libs/gtk+-2.6.2) show
0 0 0 setrgbcolor
(  ) show
0 0 1 setrgbcolor
(-debug) show
0 0 0 setrgbcolor
( ) show
0 0 1 setrgbcolor
(-doc) show
0 0 0 setrgbcolor
( ) show
0 0 1 setrgbcolor
(-jpeg) show
0 0 0 setrgbcolor
( ) show
0 0 1 setrgbcolor
(-static) show
0 0 0 setrgbcolor
( ) show
0 0 1 setrgbcolor
(-tiff) show
0 0 0 setrgbcolor
( 10,969 kB ) show
cr
([ebuild  ) show
0 1 0 setrgbcolor
(N) show
0 0 0 setrgbcolor
(    ]    ) show
0 1 0 setrgbcolor
(x11-misc/shared-mime-info-0.14-r2) show
0 0 0 setrgbcolor
(  347 kB ) show
cr
([ebuild  ) show
0 1 0 setrgbcolor
(N) show
0 0 0 setrgbcolor
(    ]     ) show
0 1 0 setrgbcolor
(dev-libs/libxml2-2.6.16) show
0 0 0 setrgbcolor
(  ) show
0 0 1 setrgbcolor
(-debug) show
0 0 0 setrgbcolor
( ) show
0 0 1 setrgbcolor
(-ipv6) show
0 0 0 setrgbcolor
( ) show
1 0 0 setrgbcolor
(+python) show
0 0 0 setrgbcolor
( ) show
1 0 0 setrgbcolor
(+readline) show
0 0 0 setrgbcolor
( 3,027 kB ) show
cr
([ebuild  ) show
0 1 0 setrgbcolor
(N) show
0 0 0 setrgbcolor
(    ]     ) show
0 1 0 setrgbcolor
(dev-util/intltool-0.31.2) show
0 0 0 setrgbcolor
(  121 kB ) show
cr
([ebuild  ) show
0 1 0 setrgbcolor
(N) show
0 0 0 setrgbcolor
(    ]      ) show
0 1 0 setrgbcolor
(dev-perl/XML-Parser-2.34) show
0 0 0 setrgbcolor
(  224 kB ) show
cr
([ebuild  ) show
0 1 0 setrgbcolor
(N) show
0 0 0 setrgbcolor
(    ]    ) show
0 1 0 setrgbcolor
(x11-libs/pango-1.8.1) show
0 0 0 setrgbcolor
(  ) show
0 0 1 setrgbcolor
(-debug) show
0 0 0 setrgbcolor
( ) show
0 0 1 setrgbcolor
(-doc) show
0 0 0 setrgbcolor
( ) show
0 0 1 setrgbcolor
(-static) show
0 0 0 setrgbcolor
( 973 kB ) show
cr
([ebuild  ) show
0 1 0 setrgbcolor
(N) show
0 0 0 setrgbcolor
(    ]    ) show
0 1 0 setrgbcolor
(dev-libs/atk-1.8.0) show
0 0 0 setrgbcolor
(  ) show
0 0 1 setrgbcolor
(-debug) show
0 0 0 setrgbcolor
( ) show
0 0 1 setrgbcolor
(-doc) show
0 0 0 setrgbcolor
( 488 kB ) show
cr
([ebuild  ) show
0 1 0 setrgbcolor
(N) show
0 0 0 setrgbcolor
(    ]    ) show
0 1 0 setrgbcolor
(dev-libs/glib-2.6.2-r1) show
0 0 0 setrgbcolor
(  ) show
0 0 1 setrgbcolor
(-debug) show
0 0 0 setrgbcolor
( ) show
0 0 1 setrgbcolor
(-doc) show
0 0 0 setrgbcolor
( 2,288 kB ) show
cr
([ebuild  ) show
0 1 0 setrgbcolor
(N) show
0 0 0 setrgbcolor
(    ]     ) show
0 1 0 setrgbcolor
(dev-util/pkgconfig-0.15.0) show
0 0 0 setrgbcolor
(  596 kB ) show
cr
() show
cr
(Total size of downloads: 52,549 kB) show
cr
(Portage overlays:) show
cr
( ) show
0 1 1 setrgbcolor
([1]) show
0 0 0 setrgbcolor
( /root/portage) show
cr
() show

%%EOF
