%!PS-Adobe-3.0 EPSF-3.0
%%Creator: inkscape 0.43
%%Pages: 1
%%Orientation: Portrait
%%BoundingBox: 3 0 47 48
%%HiResBoundingBox: 3.8725539 0.97398125 46.956679 47.03353
%%EndComments
%%Page: 1 1
0 48 translate
0.8 -0.8 scale
gsave [1 0 0 1 0 0] concat
gsave [1 0 0 1 0 0] concat
gsave
0 0 0 setrgbcolor
newpath
8.3905812 44.279826 moveto
8.7160968 44.731121 11.464006 50.497178 13.044688 51.439704 curveto
14.697247 52.471793 38.868872 58.722625 40.969048 58.781504 curveto
43.08313 58.838577 48.098449 56.481176 48.527849 56.248362 curveto
50.16482 55.224253 59.745314 14.99643 58.601267 13.284944 curveto
58.378175 12.93538 55.707204 11.039605 51.723561 10.358235 curveto
47.739918 9.676864 26.148642 6.8549456 22.118059 6.495203 curveto
18.087476 6.1354604 16.009008 6.6003803 15.692037 6.8940725 curveto
14.370823 8.2675722 7.3079461 42.580144 8.3905812 44.279826 curveto
closepath
eofill
grestore
grestore
gsave
<<
/ShadingType 2
/ColorSpace /DeviceRGB
/Coords [5.6577652 2.0498425 56.316276 54.238641]
/Extend [true true]
/Domain [0 1]
/Function <<
/FunctionType 3
/Functions
[
<<
/FunctionType 2
/Domain [0 1]
/C0 [0.8509804 0.80000001 0.90196079]
/C1 [0.4509804 0.40000001 0.49803922]
/N 1
>>
]
/Domain [0 1]
/Bounds [ ]
/Encode [ 0 1 ]
>>
>>
newpath
5.8905812 40.061076 moveto
6.2160968 40.512371 8.9640057 46.278428 10.544688 47.220954 curveto
12.197247 48.253043 36.368872 54.503875 38.469048 54.562754 curveto
40.58313 54.619827 45.598449 52.262426 46.027849 52.029612 curveto
47.66482 51.005503 57.245314 10.77768 56.101267 9.0661941 curveto
55.878175 8.7166301 53.207204 6.8208554 49.223561 6.1394847 curveto
45.239918 5.458114 23.648642 2.6361956 19.618059 2.276453 curveto
15.587476 1.9167104 13.509008 2.3816303 13.192037 2.6753225 curveto
11.870823 4.0488222 4.8079461 38.361394 5.8905812 40.061076 curveto
closepath
eoclip
shfill
grestore
0.14901961 0.098039217 0.2 setrgbcolor
[] 0 setdash
1.875 setlinewidth
0 setlinejoin
0 setlinecap
newpath
5.8905812 40.061076 moveto
6.2160968 40.512371 8.9640057 46.278428 10.544688 47.220954 curveto
12.197247 48.253043 36.368872 54.503875 38.469048 54.562754 curveto
40.58313 54.619827 45.598449 52.262426 46.027849 52.029612 curveto
47.66482 51.005503 57.245314 10.77768 56.101267 9.0661941 curveto
55.878175 8.7166301 53.207204 6.8208554 49.223561 6.1394847 curveto
45.239918 5.458114 23.648642 2.6361956 19.618059 2.276453 curveto
15.587476 1.9167104 13.509008 2.3816303 13.192037 2.6753225 curveto
11.870823 4.0488222 4.8079461 38.361394 5.8905812 40.061076 curveto
closepath
stroke
gsave
<<
/ShadingType 2
/ColorSpace /DeviceRGB
/Coords [13.513167 2.7925919 49.328289 34.944658]
/Extend [true true]
/Domain [0 1]
/Function <<
/FunctionType 3
/Functions
[
<<
/FunctionType 2
/Domain [0 1]
/C0 [1 1 1]
/C1 [0.8509804 0.81960785 0.88235295]
/N 1
>>
]
/Domain [0 1]
/Bounds [ ]
/Encode [ 0 1 ]
>>
>>
newpath
19.463853 2.8947939 moveto
17.648344 9.2969353 14.727981 22.083244 13.915713 28.91538 curveto
22.945515 31.447565 33.408671 33.69308 42.581914 35.365254 curveto
44.588502 27.86429 47.413273 14.409048 48.703289 6.7647488 curveto
39.625638 5.1880827 28.541399 3.3247883 19.463853 2.8947939 curveto
closepath
eoclip
shfill
grestore
0.14901961 0.098039217 0.2 setrgbcolor
[] 0 setdash
1.25 setlinewidth
0 setlinejoin
0 setlinecap
newpath
19.463853 2.8947939 moveto
17.648344 9.2969353 14.727981 22.083244 13.915713 28.91538 curveto
22.945515 31.447565 33.408671 33.69308 42.581914 35.365254 curveto
44.588502 27.86429 47.413273 14.409048 48.703289 6.7647488 curveto
39.625638 5.1880827 28.541399 3.3247883 19.463853 2.8947939 curveto
closepath
stroke
gsave
1 1 1 setrgbcolor
newpath
13.833948 3.3747117 moveto
15.533789 3.1049127 16.519804 3.0011293 18.738035 3.1792801 curveto
14.850592 17.16864 14.477048 23.080884 10.474141 45.899313 curveto
9.1441119 44.231384 7.9901515 42.077376 6.7429865 39.636048 curveto
6.2473836 37.945489 10.172537 16.251921 13.833948 3.3747117 curveto
closepath
eofill
grestore
gsave
<<
/ShadingType 2
/ColorSpace /DeviceRGB
/Coords [10.7494 39.887452 34.63476 53.132781]
/Extend [true true]
/Domain [0 1]
/Function <<
/FunctionType 3
/Functions
[
<<
/FunctionType 2
/Domain [0 1]
/C0 [0.80000001 0.80000001 0.80000001]
/C1 [0.49803922 0.49803922 0.49803922]
/N 1
>>
]
/Domain [0 1]
/Bounds [ ]
/Encode [ 0 1 ]
>>
>>
newpath
11.528719 47.325795 moveto
12.19633 43.230373 11.913726 44.772823 12.631676 40.606021 curveto
19.581946 41.959061 27.375085 44.321181 34.329985 46.139484 curveto
33.41209 49.979109 33.704149 48.705062 32.609464 52.852074 curveto
25.429451 51.396604 18.596177 49.309307 11.528719 47.325795 curveto
closepath
eoclip
shfill
grestore
0.14901961 0.098039217 0.2 setrgbcolor
[] 0 setdash
1.875 setlinewidth
0 setlinejoin
0 setlinecap
newpath
11.528719 47.325795 moveto
12.19633 43.230373 11.913726 44.772823 12.631676 40.606021 curveto
19.581946 41.959061 27.375085 44.321181 34.329985 46.139484 curveto
33.41209 49.979109 33.704149 48.705062 32.609464 52.852074 curveto
25.429451 51.396604 18.596177 49.309307 11.528719 47.325795 curveto
closepath
stroke
gsave [1 0 0 1 0 0] concat
gsave
<<
/ShadingType 2
/ColorSpace /DeviceRGB
/Coords [7.8443645 3.8939847 46.125308 38.382233]
/Extend [true true]
/Domain [0 1]
/Function <<
/FunctionType 3
/Functions
[
<<
/FunctionType 2
/Domain [0 1]
/C0 [1 1 1]
/C1 [1 1 1]
/N 1
>>
]
/Domain [0 1]
/Bounds [ ]
/Encode [ 0 1 ]
>>
>>
newpath
7.6089682 39.178935 moveto
7.2007802 38.132905 12.269829 6.323159 14.600606 4.345123 curveto
16.924744 2.351045 47.018364 7.553499 47.414116 8.567596 curveto
47.782782 9.512344 25.235237 3.945386 17.32387 9.648324 curveto
9.6598616 15.172948 7.9651982 40.091749 7.6089682 39.178935 curveto
closepath
eoclip
shfill
grestore
grestore
gsave [1 0 0 1 0 0] concat
gsave
<<
/ShadingType 2
/ColorSpace /DeviceRGB
/Coords [13.110457 42.477451 20.555776 46.748774]
/Extend [true true]
/Domain [0 1]
/Function <<
/FunctionType 3
/Functions
[
<<
/FunctionType 2
/Domain [0 1]
/C0 [1 1 1]
/C1 [1 1 1]
/N 1
>>
]
/Domain [0 1]
/Bounds [ ]
/Encode [ 0 1 ]
>>
>>
newpath
13.34752 46.615999 moveto
13.268301 46.532815 13.684675 42.455278 14.173685 42.385546 curveto
14.89903 42.263394 20.646666 43.859966 20.725411 43.942663 curveto
20.798784 44.019722 16.200063 42.827344 15.109107 43.149529 curveto
14.003317 43.483107 13.420501 46.692618 13.34752 46.615999 curveto
closepath
eoclip
shfill
grestore
grestore
gsave [1 0 0 1 0 0] concat
gsave
0 0 0 setrgbcolor
newpath
21.328475 9.5736994 moveto
28.526013 10.698881 36.827861 12.408153 43.688139 14.340753 curveto
44.131002 14.46554 43.698046 15.817951 43.23779 15.746071 curveto
36.096745 14.629953 27.800482 12.724859 20.884559 10.776555 curveto
20.497448 10.667474 20.924819 9.5106721 21.328475 9.5736994 curveto
closepath
eofill
grestore
grestore
gsave [1 0 0 1 0 0] concat
gsave
0 0 0 setrgbcolor
newpath
20.517473 13.582025 moveto
27.71501 14.707101 36.016752 16.416373 42.877134 18.349081 curveto
43.319893 18.473867 42.887041 19.826277 42.426788 19.754399 curveto
35.285743 18.638175 26.989373 16.733187 20.073556 14.784882 curveto
19.686339 14.6758 20.113814 13.518895 20.517473 13.582025 curveto
closepath
eofill
grestore
grestore
gsave [1 0 0 1 0 0] concat
gsave
0 0 0 setrgbcolor
newpath
19.632694 17.804513 moveto
26.83023 18.929483 35.13208 20.638756 41.992356 22.571463 curveto
42.43522 22.696248 42.002157 24.048658 41.542114 23.976781 curveto
34.401069 22.860556 26.104702 20.955569 19.188777 19.007263 curveto
18.801665 18.898181 19.229141 17.741276 19.632694 17.804513 curveto
closepath
eofill
grestore
grestore
gsave
0 0 0 setrgbcolor
newpath
49.253038 7.0796482 moveto
51.360014 7.457402 53.494612 8.3047188 55.297753 9.5387348 curveto
54.411251 20.114111 46.978486 48.0357 45.456692 51.291416 curveto
43.097837 52.295777 39.606505 53.907809 38.352505 53.558724 curveto
41.949187 40.303029 46.650724 23.180343 49.253038 7.0796482 curveto
closepath
eofill
grestore
gsave [1 0 0 1 0 0] concat
gsave
0 0 0 setrgbcolor
newpath
18.52784 22.444901 moveto
25.725376 23.569871 34.027226 25.279144 40.887502 27.211851 curveto
41.330366 27.336636 40.897303 28.689046 40.43726 28.617169 curveto
33.296215 27.500944 24.999848 25.595957 18.083923 23.647651 curveto
17.696811 23.538569 18.124287 22.381664 18.52784 22.444901 curveto
closepath
eofill
grestore
grestore
grestore
showpage
