%!PS-Adobe-3.0 EPSF-3.0
%%Creator: inkscape 0.43
%%Pages: 1
%%Orientation: Portrait
%%BoundingBox: 3 0 46 48
%%HiResBoundingBox: 3.0521035 0.30001607 45.866072 47.760105
%%EndComments
%%Page: 1 1
0 48 translate
0.8 -0.8 scale
gsave [1 0 0 1 0 0] concat
gsave [1 0 0 1 0 0] concat
gsave
0 0 0 setrgbcolor
newpath
32.709415 4.6143602 moveto
26.515415 4.8467181 7.5058318 22.426859 8.6165628 26.709521 curveto
9.3230596 29.514505 11.526155 27.80957 11.873937 29.540002 curveto
13.60437 38.149955 10.138019 54.017098 14.10647 57.641692 curveto
18.246653 61.266286 47.859111 59.205487 50.797162 57.126493 curveto
53.563479 55.047499 51.370126 38.049086 53.029694 29.368269 curveto
53.346964 27.708701 56.793996 28.364962 57.261585 26.964003 curveto
58.659828 23.155908 39.017626 4.3841018 32.709415 4.6143602 curveto
closepath
eofill
grestore
grestore
gsave
<<
/ShadingType 2
/ColorSpace /DeviceRGB
/Coords [3.8151294 0.62097746 53.649088 57.508697]
/Extend [true true]
/Domain [0 1]
/Function <<
/FunctionType 3
/Functions
[
<<
/FunctionType 2
/Domain [0 1]
/C0 [0.8509804 0.80000001 0.90196079]
/C1 [0.4509804 0.40000001 0.49803922]
/N 1
>>
]
/Domain [0 1]
/Bounds [ ]
/Encode [ 0 1 ]
>>
>>
newpath
28.892186 1.5605777 moveto
22.698186 1.7929356 3.6886036 19.373076 4.7993346 23.655738 curveto
5.5058314 26.460722 7.7089261 24.755787 8.0567089 26.486219 curveto
9.7871414 35.096172 6.3207912 50.963315 10.289241 54.587909 curveto
14.429424 58.212503 44.041882 56.151704 46.979933 54.07271 curveto
49.74625 51.993716 47.552897 34.995303 49.212465 26.314486 curveto
49.529735 24.654918 52.976767 25.311179 53.444356 23.91022 curveto
54.842599 20.102125 35.200397 1.3303193 28.892186 1.5605777 curveto
closepath
eoclip
shfill
grestore
0.14901961 0.098039217 0.2 setrgbcolor
[] 0 setdash
1.875 setlinewidth
0 setlinejoin
0 setlinecap
newpath
28.892186 1.5605777 moveto
22.698186 1.7929356 3.6886036 19.373076 4.7993346 23.655738 curveto
5.5058314 26.460722 7.7089261 24.755787 8.0567089 26.486219 curveto
9.7871414 35.096172 6.3207912 50.963315 10.289241 54.587909 curveto
14.429424 58.212503 44.041882 56.151704 46.979933 54.07271 curveto
49.74625 51.993716 47.552897 34.995303 49.212465 26.314486 curveto
49.529735 24.654918 52.976767 25.311179 53.444356 23.91022 curveto
54.842599 20.102125 35.200397 1.3303193 28.892186 1.5605777 curveto
closepath
stroke
gsave
<<
/ShadingType 2
/ColorSpace /DeviceRGB
/Coords [14.281221 38.637219 26.962766 56.603479]
/Extend [true true]
/Domain [0 1]
/Function <<
/FunctionType 3
/Functions
[
<<
/FunctionType 2
/Domain [0 1]
/C0 [1 1 1]
/C1 [1 1 1]
/N 1
>>
]
/Domain [0 1]
/Bounds [ ]
/Encode [ 0 1 ]
>>
>>
newpath
15.870518 40.78938 moveto
14.986418 42.320687 14.87024 54.021762 15.870518 55.022041 curveto
16.807005 55.958527 23.90949 56.664588 25.552037 55.022041 curveto
26.57075 53.257578 26.726986 41.96433 25.552037 40.78938 curveto
23.90949 39.146832 16.877319 39.04555 15.870518 40.78938 curveto
closepath
eoclip
shfill
grestore
0.14901961 0.098039217 0.2 setrgbcolor
[] 0 setdash
1.76397 setlinewidth
0 setlinejoin
0 setlinecap
newpath
15.870518 40.78938 moveto
14.986418 42.320687 14.87024 54.021762 15.870518 55.022041 curveto
16.807005 55.958527 23.90949 56.664588 25.552037 55.022041 curveto
26.57075 53.257578 26.726986 41.96433 25.552037 40.78938 curveto
23.90949 39.146832 16.877319 39.04555 15.870518 40.78938 curveto
closepath
stroke
gsave
<<
/ShadingType 2
/ColorSpace /DeviceRGB
/Coords [32.609601 29.264385 45.020044 42.060397]
/Extend [true true]
/Domain [0 1]
/Function <<
/FunctionType 3
/Functions
[
<<
/FunctionType 2
/Domain [0 1]
/C0 [1 1 1]
/C1 [1 1 1]
/N 1
>>
]
/Domain [0 1]
/Bounds [ ]
/Encode [ 0 1 ]
>>
>>
newpath
34.04847 30.750255 moveto
33.145306 31.653419 33.087787 39.802083 34.04847 40.762766 curveto
35.147085 41.861381 42.802939 41.689817 43.72999 40.762766 curveto
44.892456 39.600299 44.803734 31.824 43.72999 30.750255 curveto
42.77216 29.792426 35.045507 29.719133 34.04847 30.750255 curveto
closepath
eoclip
shfill
grestore
0.14901961 0.098039217 0.2 setrgbcolor
[] 0 setdash
1.47952 setlinewidth
0 setlinejoin
0 setlinecap
newpath
34.04847 30.750255 moveto
33.145306 31.653419 33.087787 39.802083 34.04847 40.762766 curveto
35.147085 41.861381 42.802939 41.689817 43.72999 40.762766 curveto
44.892456 39.600299 44.803734 31.824 43.72999 30.750255 curveto
42.77216 29.792426 35.045507 29.719133 34.04847 30.750255 curveto
closepath
stroke
0.14901961 0.098039217 0.2 setrgbcolor
[] 0 setdash
1.875 setlinewidth
0 setlinejoin
0 setlinecap
newpath
6.6355893 25.448143 moveto
20.58771 27.394453 35.913697 26.936499 50.381017 25.448144 curveto
stroke
gsave
<<
/ShadingType 2
/ColorSpace /DeviceRGB
/Coords [6.1635329 24.799729 23.343605 5.2109314]
/Extend [true true]
/Domain [0 1]
/Function <<
/FunctionType 3
/Functions
[
<<
/FunctionType 2
/Domain [0 1]
/C0 [1 1 1]
/C1 [1 1 1]
/N 1
>>
]
/Domain [0 1]
/Bounds [ ]
/Encode [ 0 1 ]
>>
>>
newpath
23.44134 5.2202024 moveto
21.320912 5.7668745 7.1354549 19.343868 5.959466 23.100012 curveto
5.2874158 25.246561 20.234433 25.166426 21.675354 24.645612 curveto
22.523795 24.338946 14.920248 22.625245 14.648009 19.87284 curveto
14.163492 15.27989 24.851495 4.8566473 23.44134 5.2202024 curveto
closepath
eoclip
shfill
grestore
gsave
<<
/ShadingType 2
/ColorSpace /DeviceRGB
/Coords [28.149087 32.303947 47.524811 54.36777]
/Extend [true true]
/Domain [0 1]
/Function <<
/FunctionType 3
/Functions
[
<<
/FunctionType 2
/Domain [0 1]
/C0 [1 1 1]
/C1 [1 1 1]
/N 1
>>
]
/Domain [0 1]
/Bounds [ ]
/Encode [ 0 1 ]
>>
>>
newpath
46.214095 32.311658 moveto
46.59706 32.83249 48.94893 51.025732 46.729295 53.164161 curveto
44.42537 55.383795 28.786016 54.66323 28.160886 54.366293 curveto
27.68271 54.139159 41.885047 52.877399 44.164105 50.68172 curveto
46.408605 48.519336 45.907492 31.894679 46.214095 32.311658 curveto
closepath
eoclip
shfill
grestore
gsave
<<
/ShadingType 2
/ColorSpace /DeviceRGB
/Coords [9.181104 27.425586 39.700815 49.727638]
/Extend [true true]
/Domain [0 1]
/Function <<
/FunctionType 3
/Functions
[
<<
/FunctionType 2
/Domain [0 1]
/C0 [1 1 1]
/C1 [1 1 1]
/N 1
>>
]
/Domain [0 1]
/Bounds [ ]
/Encode [ 0 1 ]
>>
>>
newpath
10.140527 50.074205 moveto
9.757562 49.553374 8.0926258 30.729332 10.31226 28.590904 curveto
12.616186 26.371269 39.298449 27.9505 39.92358 28.247437 curveto
40.401755 28.47457 15.15651 28.877664 12.877451 31.073344 curveto
10.632951 33.235727 10.44713 50.491184 10.140527 50.074205 curveto
closepath
eoclip
shfill
grestore
gsave
<<
/ShadingType 2
/ColorSpace /DeviceRGB
/Coords [38.913745 8.4043728 47.216841 19.047393]
/Extend [true true]
/Domain [0 1]
/Function <<
/FunctionType 3
/Functions
[
<<
/FunctionType 2
/Domain [0 1]
/C0 [0.8509804 0.80000001 0.90196079]
/C1 [0.4509804 0.40000001 0.49803922]
/N 1
>>
]
/Domain [0 1]
/Bounds [ ]
/Encode [ 0 1 ]
>>
>>
newpath
39.61492 10.63051 moveto
39.70399 12.88268 39.53879 16.13052 39.8694 17.43949 curveto
40.21143 18.92085 45.97384 18.6334 46.3157 17.62877 curveto
46.65472 16.75971 46.7356 12.50096 46.69743 10.75776 curveto
46.48183 8.485799 39.65359 8.348684 39.61492 10.63051 curveto
39.61492 10.63051 lineto
39.61492 10.63051 lineto
closepath
eoclip
shfill
grestore
0.14901961 0.098039217 0.2 setrgbcolor
[] 0 setdash
1.25 setlinewidth
0 setlinejoin
0 setlinecap
newpath
39.61492 10.63051 moveto
39.70399 12.88268 39.53879 16.13052 39.8694 17.43949 curveto
40.21143 18.92085 45.97384 18.6334 46.3157 17.62877 curveto
46.65472 16.75971 46.7356 12.50096 46.69743 10.75776 curveto
46.48183 8.485799 39.65359 8.348684 39.61492 10.63051 curveto
39.61492 10.63051 lineto
39.61492 10.63051 lineto
closepath
stroke
gsave
0.43529412 0.43529412 0.43529412 setrgbcolor
newpath
43.38916 8.0856969 moveto
42.896545 7.6154731 43.509913 3.5324853 44.66157 2.8688184 curveto
46.012318 2.0904213 49.008005 4.2038276 50.896376 3.7595049 curveto
52.613164 3.3555546 54.966059 -0.016660753 55.477049 0.32399959 curveto
55.983986 0.66195761 55.196877 4.9840033 53.950158 5.79536 curveto
52.524817 6.7229628 49.484804 5.1019527 47.46087 5.5408781 curveto
45.964471 5.8653984 43.829645 8.5061597 43.38916 8.0856969 curveto
closepath
eofill
grestore
grestore
showpage
