%!PS-Adobe-2.0 EPSF-1.2
%%Title: test1.ps
%%Creator: Ghostscript ps2epsi from test1.ps
%%CreationDate: Mar 21 01:44
%%For:sylvain sylvain
%%Pages: 1
%%DocumentFonts:
%%BoundingBox: 50 640 502 683
save countdictstack mark newpath /showpage {} def /setpagedevice {pop} def
%%EndProlog
%%Page: 1 1
%%BeginDocument: logo.eps
%!
0.0 841.8897 translate
0.8 -0.8 scale
gsave [1 0 0 1 0 0] concat
0 0 0 setrgbcolor
newpath
89.9279 242.8055 moveto
87.58415 244.7977 85.32243 246.2039 83.14274 247.0243 curveto
80.98649 247.8446 78.66618 248.2547 76.18181 248.2547 curveto
72.08024 248.2547 68.9279 247.2586 66.72477 245.2664 curveto
64.52165 243.2508 63.42009 240.6844 63.42009 237.5672 curveto
63.42009 235.7391 63.83024 234.075 64.65056 232.575 curveto
65.49431 231.0516 66.58415 229.8329 67.92009 228.9188 curveto
69.27946 228.0047 70.8029 227.3133 72.4904 226.8446 curveto
73.73259 226.5164 75.60759 226.2 78.1154 225.8954 curveto
83.22477 225.286 86.98649 224.5594 89.40055 223.7157 curveto
89.42399 222.8485 89.43571 222.2977 89.43571 222.0633 curveto
89.43571 219.4852 88.83805 217.6688 87.64274 216.6141 curveto
86.02555 215.1844 83.62321 214.4696 80.43571 214.4696 curveto
77.45915 214.4696 75.25602 214.9969 73.82634 216.0516 curveto
72.42009 217.0829 71.37712 218.9227 70.69743 221.5711 curveto
64.50993 220.7274 lineto
65.07243 218.079 65.99821 215.9461 67.28727 214.329 curveto
68.57634 212.6883 70.43962 211.4344 72.87712 210.5672 curveto
75.31462 209.6766 78.13884 209.2313 81.34977 209.2313 curveto
84.53727 209.2313 87.12712 209.6063 89.1193 210.3563 curveto
91.11149 211.1063 92.57634 212.0555 93.51384 213.204 curveto
94.45134 214.329 95.10759 215.7586 95.48259 217.493 curveto
95.69352 218.5711 95.79899 220.5165 95.79899 223.329 curveto
95.79899 231.7664 lineto
95.79899 237.6493 95.9279 241.3758 96.18571 242.9461 curveto
96.46696 244.493 97.00602 245.9813 97.8029 247.411 curveto
91.19352 247.411 lineto
90.53727 246.0985 90.1154 244.5633 89.9279 242.8055 curveto
closepath
89.40055 228.6727 moveto
87.10368 229.6102 83.65837 230.4071 79.06462 231.0633 curveto
76.46306 231.4383 74.62321 231.8602 73.54509 232.3289 curveto
72.46696 232.7977 71.63493 233.4891 71.04899 234.4032 curveto
70.46306 235.2938 70.17009 236.2899 70.17009 237.3914 curveto
70.17009 239.0789 70.8029 240.4852 72.06852 241.6102 curveto
73.35759 242.7352 75.23259 243.2977 77.69352 243.2977 curveto
80.13102 243.2977 82.29899 242.7704 84.19743 241.7157 curveto
86.09587 240.6375 87.4904 239.1727 88.38102 237.3211 curveto
89.06071 235.8914 89.40055 233.7821 89.40055 230.993 curveto
89.40055 228.6727 lineto
closepath
fill
0.482353 0.482353 0.482353 setrgbcolor
newpath
102.5328 249.1796 moveto
102.5328 237.3428 lineto
105.4828 237.3428 lineto
105.4828 239.0258 lineto
106.9032 237.7255 108.9549 237.0753 111.6377 237.0753 curveto
112.8032 237.0753 113.8715 237.2053 114.8427 237.4654 curveto
115.8261 237.7181 116.5605 238.0524 117.0461 238.4685 curveto
117.5317 238.8847 117.8716 239.3788 118.0659 239.9509 curveto
118.1873 240.3224 118.248 240.9726 118.248 241.9014 curveto
118.248 249.1796 lineto
114.9702 249.1796 lineto
114.9702 241.9795 lineto
114.9702 241.1621 114.8427 240.5528 114.5877 240.1516 curveto
114.3328 239.7429 113.8776 239.4196 113.222 239.1819 curveto
112.5786 238.9366 111.8199 238.814 110.9458 238.814 curveto
109.5497 238.814 108.3418 239.0853 107.322 239.6277 curveto
106.3144 240.1701 105.8106 241.1993 105.8106 242.7151 curveto
105.8106 249.1796 lineto
102.5328 249.1796 lineto
closepath
122.0538 243.2612 moveto
122.0538 241.0692 123.0493 239.4456 125.0402 238.3905 curveto
126.7034 237.5137 128.7308 237.0753 131.1224 237.0753 curveto
133.781 237.0753 135.954 237.6103 137.6415 238.6803 curveto
139.329 239.7429 140.1727 241.2141 140.1727 243.094 curveto
140.1727 244.6173 139.7964 245.8173 139.0437 246.6941 curveto
138.3031 247.5635 137.2166 248.2397 135.7841 248.7226 curveto
134.3637 249.2056 132.8098 249.4471 131.1224 249.4471 curveto
128.4152 249.4471 126.2239 248.9158 124.5486 247.8533 curveto
122.8854 246.7907 122.0538 245.26 122.0538 243.2612 curveto
closepath
125.4227 243.2612 moveto
125.4227 244.777 125.9629 245.9139 127.0433 246.6718 curveto
128.1238 247.4223 129.4835 247.7976 131.1224 247.7976 curveto
132.7491 247.7976 134.1027 247.4186 135.1832 246.6607 curveto
136.2636 245.9028 136.8039 244.7473 136.8039 243.1943 curveto
136.8039 241.7305 136.2576 240.6234 135.165 239.8729 curveto
134.0845 239.115 132.737 238.736 131.1224 238.736 curveto
129.4835 238.736 128.1238 239.1113 127.0433 239.8618 curveto
125.9629 240.6122 125.4227 241.7454 125.4227 243.2612 curveto
closepath
151.1715 247.3852 moveto
151.6449 249.1573 lineto
150.7223 249.2762 149.8968 249.3356 149.1684 249.3356 curveto
147.9787 249.3356 147.056 249.2205 146.4005 248.9901 curveto
145.7449 248.7598 145.2836 248.4589 145.0165 248.0873 curveto
144.7495 247.7084 144.6159 246.917 144.6159 245.7133 curveto
144.6159 238.9032 lineto
142.2122 238.9032 lineto
142.2122 237.3428 lineto
144.6159 237.3428 lineto
144.6159 234.4115 lineto
147.8755 233.2077 lineto
147.8755 237.3428 lineto
151.1715 237.3428 lineto
151.1715 238.9032 lineto
147.8755 238.9032 lineto
147.8755 245.8247 lineto
147.8755 246.3969 147.9301 246.7647 148.0394 246.9282 curveto
148.1608 247.0916 148.3489 247.2217 148.6039 247.3183 curveto
148.871 247.4149 149.2473 247.4632 149.7329 247.4632 curveto
150.0971 247.4632 150.5766 247.4371 151.1715 247.3852 curveto
closepath
154.3765 249.1796 moveto
154.3765 232.8399 lineto
157.6542 232.8399 lineto
157.6542 238.7026 lineto
159.1839 237.6177 161.1141 237.0753 163.445 237.0753 curveto
164.8775 237.0753 166.1218 237.2499 167.178 237.5992 curveto
168.2342 237.941 168.9869 238.4165 169.4361 239.0258 curveto
169.8974 239.6351 170.128 240.5193 170.128 241.6785 curveto
170.128 249.1796 lineto
166.8502 249.1796 lineto
166.8502 241.6785 lineto
166.8502 240.6754 166.4921 239.9472 165.7759 239.4939 curveto
165.0717 239.0332 164.0702 238.8029 162.7712 238.8029 curveto
161.8 238.8029 160.8835 238.9589 160.0215 239.271 curveto
159.1717 239.5757 158.5647 239.9918 158.2005 240.5193 curveto
157.8363 241.0469 157.6542 241.7751 157.6542 242.7039 curveto
157.6542 249.1796 lineto
154.3765 249.1796 lineto
closepath
188.3561 245.3678 moveto
191.7432 245.6241 lineto
191.209 246.8353 190.2196 247.7752 188.775 248.444 curveto
187.3303 249.1127 185.485 249.4471 183.2392 249.4471 curveto
180.4106 249.4471 178.1646 248.9158 176.5015 247.8533 curveto
174.8505 246.7833 174.025 245.286 174.025 243.3615 curveto
174.025 241.3701 174.8626 239.8246 176.5379 238.7249 curveto
178.2132 237.6252 180.3863 237.0753 183.0571 237.0753 curveto
185.6428 237.0753 187.7552 237.614 189.3941 238.6915 curveto
191.033 239.7689 191.8524 241.2847 191.8524 243.2389 curveto
191.8524 243.3578 191.8464 243.5361 191.8343 243.7739 curveto
177.412 243.7739 lineto
177.5334 245.0743 178.1343 246.0699 179.2148 246.761 curveto
180.2952 247.452 181.6428 247.7976 183.2574 247.7976 curveto
184.4592 247.7976 185.485 247.6044 186.3349 247.2179 curveto
187.1846 246.8316 187.8584 246.2148 188.3561 245.3678 curveto
closepath
177.5941 242.1243 moveto
188.3925 242.1243 lineto
188.2469 241.1287 187.8341 240.3819 187.1543 239.884 curveto
186.1103 239.1113 184.7567 238.7249 183.0935 238.7249 curveto
181.5881 238.7249 180.3195 239.0332 179.2876 239.65 curveto
178.2679 240.2667 177.7033 241.0915 177.5941 242.1243 curveto
closepath
195.8222 249.1796 moveto
195.8222 237.3428 lineto
198.7722 237.3428 lineto
198.7722 239.1373 lineto
199.5249 238.2976 200.2169 237.7441 200.8481 237.4766 curveto
201.4916 237.2091 202.1957 237.0753 202.9605 237.0753 curveto
204.0652 237.0753 205.1882 237.2908 206.3293 237.7218 curveto
205.2003 239.5831 lineto
204.3991 239.2933 203.5978 239.1484 202.7966 239.1484 curveto
202.0803 239.1484 201.4369 239.2822 200.8664 239.5497 curveto
200.2958 239.8097 199.8891 240.1738 199.6463 240.6419 curveto
199.2821 241.3553 199.1 242.1355 199.1 242.9826 curveto
199.1 249.1796 lineto
195.8222 249.1796 lineto
closepath
fill
0 0 0 setrgbcolor
newpath
237.6598 250.9885 moveto
237.6598 246.2776 lineto
235.2926 249.9807 231.8121 251.8322 227.2184 251.8322 curveto
224.2418 251.8322 221.4996 251.0119 218.9918 249.3713 curveto
216.5075 247.7307 214.5739 245.4455 213.191 242.5158 curveto
211.8317 239.5627 211.152 236.176 211.152 232.3557 curveto
211.152 228.6291 211.7731 225.2541 213.0153 222.2307 curveto
214.2575 219.1838 216.1207 216.8518 218.6051 215.2346 curveto
221.0895 213.6174 223.8668 212.8088 226.9371 212.8088 curveto
229.1871 212.8088 231.191 213.2893 232.9489 214.2502 curveto
234.7067 215.1877 236.1364 216.4182 237.2379 217.9416 curveto
237.2379 199.4494 lineto
243.5309 199.4494 lineto
243.5309 250.9885 lineto
237.6598 250.9885 lineto
closepath
217.6559 232.3557 moveto
217.6559 237.1369 218.6637 240.7112 220.6793 243.0783 curveto
222.695 245.4455 225.0739 246.6291 227.816 246.6291 curveto
230.5817 246.6291 232.9254 245.5041 234.8473 243.2541 curveto
236.7926 240.9807 237.7653 237.5237 237.7653 232.883 curveto
237.7653 227.7737 236.7809 224.0237 234.8121 221.633 curveto
232.8434 219.2424 230.4176 218.0471 227.5348 218.0471 curveto
224.7223 218.0471 222.3668 219.1955 220.4684 221.4924 curveto
218.5934 223.7893 217.6559 227.4104 217.6559 232.3557 curveto
closepath
279.0387 238.9651 moveto
285.5778 239.7737 lineto
284.5465 243.594 282.6364 246.5588 279.8473 248.6682 curveto
277.0582 250.7776 273.4957 251.8322 269.1598 251.8322 curveto
263.6989 251.8322 259.3629 250.1565 256.152 246.8049 curveto
252.9645 243.4299 251.3707 238.7072 251.3707 232.6369 curveto
251.3707 226.3557 252.9879 221.4807 256.2223 218.0119 curveto
259.4567 214.5432 263.652 212.8088 268.8082 212.8088 curveto
273.8004 212.8088 277.8785 214.508 281.0426 217.9065 curveto
284.2067 221.3049 285.7887 226.0862 285.7887 232.2502 curveto
285.7887 232.6252 285.777 233.1877 285.7535 233.9377 curveto
257.9098 233.9377 lineto
258.1442 238.0393 259.3043 241.1799 261.3903 243.3596 curveto
263.4762 245.5393 266.0778 246.6291 269.195 246.6291 curveto
271.5153 246.6291 273.4957 246.0197 275.1364 244.801 curveto
276.777 243.5822 278.0778 241.6369 279.0387 238.9651 curveto
closepath
258.2614 228.7346 moveto
279.109 228.7346 lineto
278.8278 225.594 278.0309 223.2385 276.7184 221.6682 curveto
274.7028 219.2307 272.0895 218.0119 268.8785 218.0119 curveto
265.9723 218.0119 263.5231 218.9846 261.5309 220.9299 curveto
259.5621 222.8752 258.4723 225.4768 258.2614 228.7346 curveto
closepath
290.9918 239.844 moveto
297.2496 238.8596 lineto
297.6012 241.3674 298.5738 243.2893 300.1676 244.6252 curveto
301.7848 245.9612 304.0348 246.6291 306.9176 246.6291 curveto
309.8238 246.6291 311.9801 246.0432 313.3863 244.8713 curveto
314.7926 243.676 315.4957 242.2815 315.4957 240.6877 curveto
315.4957 239.258 314.8746 238.133 313.6324 237.3127 curveto
312.7652 236.7502 310.609 236.0354 307.1637 235.1682 curveto
302.5231 233.9963 299.3004 232.9885 297.4957 232.1447 curveto
295.7145 231.2776 294.3551 230.094 293.4176 228.594 curveto
292.5035 227.0705 292.0465 225.3947 292.0465 223.5666 curveto
292.0465 221.9026 292.4215 220.3674 293.1715 218.9612 curveto
293.9449 217.5315 294.9879 216.3479 296.3004 215.4104 curveto
297.2848 214.6838 298.6207 214.0744 300.3082 213.5822 curveto
302.0192 213.0666 303.8473 212.8088 305.7926 212.8088 curveto
308.7223 212.8088 311.2887 213.2307 313.4918 214.0744 curveto
315.7184 214.9182 317.359 216.0666 318.4137 217.5197 curveto
319.4684 218.9494 320.1949 220.8713 320.5934 223.2854 curveto
314.4059 224.1291 lineto
314.1246 222.2072 313.3043 220.7072 311.9449 219.6291 curveto
310.609 218.551 308.7106 218.0119 306.2496 218.0119 curveto
303.3434 218.0119 301.2692 218.4924 300.027 219.4533 curveto
298.7848 220.4143 298.1637 221.5393 298.1637 222.8283 curveto
298.1637 223.6487 298.4215 224.3869 298.9371 225.0432 curveto
299.4527 225.7229 300.2613 226.2854 301.3629 226.7307 curveto
301.9957 226.9651 303.859 227.5041 306.9527 228.3479 curveto
311.4293 229.5432 314.5465 230.5276 316.3043 231.301 curveto
318.0856 232.051 319.4801 233.1526 320.4879 234.6057 curveto
321.4957 236.0588 321.9996 237.8635 321.9996 240.0197 curveto
321.9996 242.1291 321.3785 244.1213 320.1363 245.9963 curveto
318.9176 247.8479 317.1481 249.2893 314.8277 250.3205 curveto
312.5074 251.3283 309.8824 251.8322 306.9527 251.8322 curveto
302.1012 251.8322 298.3981 250.8244 295.8434 248.8088 curveto
293.3121 246.7932 291.6949 243.8049 290.9918 239.844 curveto
closepath
329.5582 250.9885 moveto
329.5582 199.4494 lineto
335.8863 199.4494 lineto
335.8863 228.8401 lineto
350.8629 213.6526 lineto
359.0543 213.6526 lineto
344.7809 227.5041 lineto
360.4957 250.9885 lineto
352.691 250.9885 lineto
340.3512 231.8987 lineto
335.8863 236.1877 lineto
335.8863 250.9885 lineto
329.5582 250.9885 lineto
closepath
365.3824 250.9885 moveto
365.3824 199.4494 lineto
371.7106 199.4494 lineto
371.7106 250.9885 lineto
365.3824 250.9885 lineto
closepath
407.0777 238.9651 moveto
413.6168 239.7737 lineto
412.5856 243.594 410.6754 246.5588 407.8863 248.6682 curveto
405.0973 250.7776 401.5348 251.8322 397.1988 251.8322 curveto
391.7379 251.8322 387.402 250.1565 384.191 246.8049 curveto
381.0035 243.4299 379.4098 238.7072 379.4098 232.6369 curveto
379.4098 226.3557 381.027 221.4807 384.2613 218.0119 curveto
387.4957 214.5432 391.691 212.8088 396.8473 212.8088 curveto
401.8395 212.8088 405.9176 214.508 409.0817 217.9065 curveto
412.2457 221.3049 413.8277 226.0862 413.8277 232.2502 curveto
413.8277 232.6252 413.816 233.1877 413.7926 233.9377 curveto
385.9488 233.9377 lineto
386.1832 238.0393 387.3434 241.1799 389.4293 243.3596 curveto
391.5152 245.5393 394.1168 246.6291 397.234 246.6291 curveto
399.5543 246.6291 401.5348 246.0197 403.1754 244.801 curveto
404.816 243.5822 406.1168 241.6369 407.0777 238.9651 curveto
closepath
386.3004 228.7346 moveto
407.1481 228.7346 lineto
406.8668 225.594 406.0699 223.2385 404.7574 221.6682 curveto
402.7418 219.2307 400.1285 218.0119 396.9176 218.0119 curveto
394.0113 218.0119 391.5621 218.9846 389.5699 220.9299 curveto
387.6012 222.8752 386.5113 225.4768 386.3004 228.7346 curveto
closepath
435.3785 245.3283 moveto
436.2926 250.9182 lineto
434.5113 251.2932 432.9176 251.4807 431.5113 251.4807 curveto
429.2145 251.4807 427.4332 251.1174 426.1676 250.3908 curveto
424.902 249.6643 424.0113 248.7151 423.4957 247.5432 curveto
422.9801 246.3479 422.7223 243.8518 422.7223 240.0549 curveto
422.7223 218.5744 lineto
418.0817 218.5744 lineto
418.0817 213.6526 lineto
422.7223 213.6526 lineto
422.7223 204.4065 lineto
429.0152 200.6096 lineto
429.0152 213.6526 lineto
435.3785 213.6526 lineto
435.3785 218.5744 lineto
429.0152 218.5744 lineto
429.0152 240.4065 lineto
429.0152 242.2112 429.1207 243.3713 429.3317 243.8869 curveto
429.566 244.4026 429.9293 244.8127 430.4215 245.1174 curveto
430.9371 245.4221 431.6637 245.5744 432.6012 245.5744 curveto
433.3043 245.5744 434.2301 245.4924 435.3785 245.3283 curveto
closepath
439.0348 239.844 moveto
445.2926 238.8596 lineto
445.6442 241.3674 446.6168 243.2893 448.2106 244.6252 curveto
449.8277 245.9612 452.0777 246.6291 454.9606 246.6291 curveto
457.8668 246.6291 460.0231 246.0432 461.4293 244.8713 curveto
462.8356 243.676 463.5387 242.2815 463.5387 240.6877 curveto
463.5387 239.258 462.9176 238.133 461.6754 237.3127 curveto
460.8082 236.7502 458.652 236.0354 455.2067 235.1682 curveto
450.566 233.9963 447.3434 232.9885 445.5387 232.1447 curveto
443.7574 231.2776 442.3981 230.094 441.4606 228.594 curveto
440.5465 227.0705 440.0895 225.3947 440.0895 223.5666 curveto
440.0895 221.9026 440.4645 220.3674 441.2145 218.9612 curveto
441.9879 217.5315 443.0309 216.3479 444.3434 215.4104 curveto
445.3277 214.6838 446.6637 214.0744 448.3512 213.5822 curveto
450.0621 213.0666 451.8902 212.8088 453.8356 212.8088 curveto
456.7652 212.8088 459.3317 213.2307 461.5348 214.0744 curveto
463.7613 214.9182 465.402 216.0666 466.4567 217.5197 curveto
467.5113 218.9494 468.2379 220.8713 468.6363 223.2854 curveto
462.4488 224.1291 lineto
462.1676 222.2072 461.3473 220.7072 459.9879 219.6291 curveto
458.652 218.551 456.7535 218.0119 454.2926 218.0119 curveto
451.3863 218.0119 449.3121 218.4924 448.0699 219.4533 curveto
446.8277 220.4143 446.2067 221.5393 446.2067 222.8283 curveto
446.2067 223.6487 446.4645 224.3869 446.9801 225.0432 curveto
447.4957 225.7229 448.3043 226.2854 449.4059 226.7307 curveto
450.0387 226.9651 451.902 227.5041 454.9957 228.3479 curveto
459.4723 229.5432 462.5895 230.5276 464.3473 231.301 curveto
466.1285 232.051 467.5231 233.1526 468.5309 234.6057 curveto
469.5387 236.0588 470.0426 237.8635 470.0426 240.0197 curveto
470.0426 242.1291 469.4215 244.1213 468.1793 245.9963 curveto
466.9606 247.8479 465.191 249.2893 462.8707 250.3205 curveto
460.5504 251.3283 457.9254 251.8322 454.9957 251.8322 curveto
450.1442 251.8322 446.441 250.8244 443.8863 248.8088 curveto
441.3551 246.7932 439.7379 243.8049 439.0348 239.844 curveto
closepath
fill
0.537255 0.537255 0.537255 setrgbcolor
newpath
480.7023 250.9866 moveto
480.7023 231.6473 lineto
486.965 231.6473 lineto
486.965 233.1857 lineto
483.5418 233.1857 lineto
483.5418 249.4481 lineto
486.965 249.4481 lineto
486.965 250.9866 lineto
480.7023 250.9866 lineto
closepath
500.5475 242.7676 moveto
503.3394 243.0051 lineto
503.0343 244.2648 502.2509 245.2526 500.9891 245.9685 curveto
499.7376 246.6775 498.1967 247.032 496.3669 247.032 curveto
494.0744 247.032 492.2284 246.5433 490.8298 245.5658 curveto
489.4419 244.5814 488.7477 243.1738 488.7477 241.3428 curveto
488.7477 240.1588 489.0475 239.1228 489.647 238.2348 curveto
490.246 237.3468 491.156 236.6826 492.376 236.242 curveto
493.6064 235.7946 494.9418 235.5709 496.3826 235.5709 curveto
498.2021 235.5709 499.6901 235.8738 500.8468 236.4795 curveto
502.0041 237.0784 502.7453 237.9319 503.0716 239.0402 curveto
500.3106 239.319 lineto
500.0477 238.5824 499.5797 238.0283 498.9066 237.6566 curveto
498.2443 237.2849 497.4398 237.0991 496.493 237.0991 curveto
495.0629 237.0991 493.9008 237.4363 493.0069 238.1109 curveto
492.1131 238.7786 491.6662 239.8387 491.6662 241.2911 curveto
491.6662 242.7642 492.0969 243.8346 492.9594 244.5023 curveto
493.8218 245.17 494.9472 245.5038 496.3355 245.5038 curveto
497.4501 245.5038 498.3807 245.2801 499.1274 244.8327 curveto
499.8745 244.3853 500.3474 243.6969 500.5475 242.7676 curveto
closepath
504.7121 241.3015 moveto
504.7121 239.2708 505.5745 237.7667 507.2989 236.7893 curveto
508.7397 235.977 510.496 235.5709 512.5681 235.5709 curveto
514.8709 235.5709 516.7537 236.0665 518.2156 237.0577 curveto
519.6771 238.0421 520.408 239.405 520.408 241.1466 curveto
520.408 242.5577 520.0823 243.6694 519.4303 244.4816 curveto
518.7886 245.287 517.8472 245.9134 516.6065 246.3608 curveto
515.3757 246.8083 514.0296 247.032 512.5681 247.032 curveto
510.2227 247.032 508.3246 246.5398 506.8731 245.5555 curveto
505.4322 244.5711 504.7121 243.1531 504.7121 241.3015 curveto
closepath
507.6305 241.3015 moveto
507.6305 242.7057 508.0985 243.7589 509.0345 244.461 curveto
509.9705 245.1562 511.1484 245.5038 512.5681 245.5038 curveto
513.9771 245.5038 515.1496 245.1528 516.0856 244.4507 curveto
517.0216 243.7485 517.4896 242.6782 517.4896 241.2395 curveto
517.4896 239.8834 517.0167 238.8578 516.0699 238.1626 curveto
515.1339 237.4604 513.9668 237.1094 512.5681 237.1094 curveto
511.1484 237.1094 509.9705 237.457 509.0345 238.1522 curveto
508.0985 238.8475 507.6305 239.8972 507.6305 241.3015 curveto
closepath
523.7366 246.7842 moveto
523.7366 235.8187 lineto
526.2925 235.8187 lineto
526.2925 237.3778 lineto
527.5228 236.1732 529.3002 235.5709 531.6241 235.5709 curveto
532.6337 235.5709 533.5594 235.6914 534.4007 235.9323 curveto
535.2524 236.1663 535.8886 236.4761 536.3095 236.8616 curveto
536.73 237.247 537.0243 237.7048 537.1926 238.2348 curveto
537.298 238.579 537.3505 239.1813 537.3505 240.0418 curveto
537.3505 246.7842 lineto
534.5111 246.7842 lineto
534.5111 240.114 lineto
534.5111 239.3569 534.4007 238.7924 534.1799 238.4207 curveto
533.9587 238.0421 533.5647 237.7427 532.9967 237.5224 curveto
532.4394 237.2952 531.782 237.1816 531.0246 237.1816 curveto
529.8153 237.1816 528.7689 237.4329 527.8854 237.9354 curveto
527.0126 238.4379 526.576 239.3912 526.576 240.7955 curveto
526.576 246.7842 lineto
523.7366 246.7842 lineto
closepath
547.9043 245.1218 moveto
548.3144 246.7635 lineto
547.5148 246.8737 546.8 246.9287 546.1686 246.9287 curveto
545.1384 246.9287 544.3388 246.822 543.7712 246.6087 curveto
543.2031 246.3953 542.8033 246.1165 542.5722 245.7723 curveto
542.3407 245.4212 542.2249 244.6881 542.2249 243.573 curveto
542.2249 237.2643 lineto
540.1429 237.2643 lineto
540.1429 235.8187 lineto
542.2249 235.8187 lineto
542.2249 233.1031 lineto
545.0487 231.988 lineto
545.0487 235.8187 lineto
547.9043 235.8187 lineto
547.9043 237.2643 lineto
545.0487 237.2643 lineto
545.0487 243.6763 lineto
545.0487 244.2063 545.0962 244.547 545.1909 244.6985 curveto
545.2959 244.8499 545.4588 244.9704 545.68 245.0599 curveto
545.9111 245.1493 546.2373 245.1941 546.6577 245.1941 curveto
546.9732 245.1941 547.3887 245.17 547.9043 245.1218 curveto
closepath
561.6125 245.4316 moveto
560.5611 246.0167 559.5461 246.4297 558.5679 246.6706 curveto
557.6005 246.9115 556.5595 247.032 555.4444 247.032 curveto
553.6043 247.032 552.1895 246.7395 551.201 246.1543 curveto
550.2125 245.5624 549.7184 244.8086 549.7184 243.8931 curveto
549.7184 243.3562 549.9024 242.8675 550.2703 242.4269 curveto
550.649 241.9795 551.1381 241.6215 551.7376 241.3531 curveto
552.3474 241.0846 553.0308 240.8816 553.7882 240.7439 curveto
554.3455 240.6475 555.1869 240.5546 556.3123 240.4651 curveto
558.6047 240.2861 560.2928 240.0727 561.376 239.8249 curveto
561.3863 239.5702 561.3917 239.4085 561.3917 239.3396 curveto
561.3917 238.5824 561.1238 238.049 560.5871 237.7392 curveto
559.8616 237.3193 558.7838 237.1094 557.3533 237.1094 curveto
556.0179 237.1094 555.0289 237.2643 554.3877 237.574 curveto
553.7568 237.8769 553.2888 238.4172 552.9837 239.1951 curveto
550.2071 238.9473 lineto
550.4597 238.1694 550.8752 237.543 551.4536 237.0681 curveto
552.032 236.5862 552.8679 236.218 553.9619 235.9633 curveto
555.0554 235.7017 556.3226 235.5709 557.7634 235.5709 curveto
559.1939 235.5709 560.3561 235.681 561.2499 235.9013 curveto
562.1437 236.1216 562.8011 236.4004 563.2215 236.7377 curveto
563.6424 237.0681 563.9368 237.488 564.1051 237.9974 curveto
564.1997 238.314 564.2468 238.8853 564.2468 239.7113 curveto
564.2468 242.1894 lineto
564.2468 243.9172 564.3047 245.0117 564.4205 245.4729 curveto
564.5466 245.9272 564.7884 246.3643 565.1461 246.7842 curveto
562.1805 246.7842 lineto
561.8862 246.3987 561.6968 245.9478 561.6125 245.4316 curveto
closepath
561.376 241.2808 moveto
560.3453 241.5561 558.7995 241.7902 556.7381 241.9829 curveto
555.571 242.0931 554.7453 242.2169 554.2616 242.3546 curveto
553.7775 242.4923 553.4041 242.6953 553.1412 242.9638 curveto
552.8787 243.2254 552.7472 243.5179 552.7472 243.8415 curveto
552.7472 244.3371 553.0308 244.7501 553.5989 245.0805 curveto
554.1773 245.4109 555.0186 245.5761 556.1229 245.5761 curveto
557.2164 245.5761 558.1892 245.4212 559.0413 245.1115 curveto
559.893 244.7948 560.5189 244.3646 560.9183 243.8208 curveto
561.2234 243.4009 561.376 242.7814 561.376 241.9623 curveto
561.376 241.2808 lineto
closepath
568.664 233.7846 moveto
568.664 231.6473 lineto
571.5034 231.6473 lineto
571.5034 233.7846 lineto
568.664 233.7846 lineto
closepath
568.664 246.7842 moveto
568.664 235.8187 lineto
571.5034 235.8187 lineto
571.5034 246.7842 lineto
568.664 246.7842 lineto
closepath
575.8259 246.7842 moveto
575.8259 235.8187 lineto
578.3813 235.8187 lineto
578.3813 237.3778 lineto
579.6121 236.1732 581.3895 235.5709 583.7134 235.5709 curveto
584.723 235.5709 585.6487 235.6914 586.49 235.9323 curveto
587.3417 236.1663 587.9779 236.4761 588.3988 236.8616 curveto
588.8193 237.247 589.1136 237.7048 589.2819 238.2348 curveto
589.3873 238.579 589.4398 239.1813 589.4398 240.0418 curveto
589.4398 246.7842 lineto
586.6004 246.7842 lineto
586.6004 240.114 lineto
586.6004 239.3569 586.49 238.7924 586.2692 238.4207 curveto
586.048 238.0421 585.6536 237.7427 585.086 237.5224 curveto
584.5287 237.2952 583.8713 237.1816 583.1139 237.1816 curveto
581.9046 237.1816 580.8582 237.4329 579.9747 237.9354 curveto
579.1019 238.4379 578.6653 239.3912 578.6653 240.7955 curveto
578.6653 246.7842 lineto
575.8259 246.7842 lineto
closepath
605.2624 243.2529 moveto
608.1965 243.4904 lineto
607.7339 244.6124 606.8764 245.4832 605.6249 246.1027 curveto
604.3735 246.7222 602.7751 247.032 600.8295 247.032 curveto
598.3791 247.032 596.4335 246.5398 594.9927 245.5555 curveto
593.5622 244.5642 592.8474 243.1772 592.8474 241.3944 curveto
592.8474 239.5496 593.5729 238.1178 595.0241 237.0991 curveto
596.4757 236.0803 598.358 235.5709 600.6716 235.5709 curveto
602.9115 235.5709 604.7418 236.07 606.1616 237.0681 curveto
607.5813 238.0662 608.2912 239.4704 608.2912 241.2808 curveto
608.2912 241.3909 608.2858 241.5561 608.2755 241.7764 curveto
595.7815 241.7764 lineto
595.8865 242.981 596.407 243.9034 597.343 244.5436 curveto
598.279 245.1838 599.4466 245.5038 600.8452 245.5038 curveto
601.8862 245.5038 602.7751 245.3249 603.511 244.9669 curveto
604.2474 244.609 604.8311 244.0377 605.2624 243.2529 curveto
closepath
595.939 240.2483 moveto
605.2938 240.2483 lineto
605.1677 239.3259 604.8101 238.6341 604.2209 238.1729 curveto
603.3167 237.457 602.1438 237.0991 600.7034 237.0991 curveto
599.399 237.0991 598.3001 237.3847 597.4063 237.956 curveto
596.5228 238.5274 596.0337 239.2914 595.939 240.2483 curveto
closepath
611.7301 246.7842 moveto
611.7301 235.8187 lineto
614.2855 235.8187 lineto
614.2855 237.4811 lineto
614.9375 236.7032 615.537 236.1904 616.084 235.9426 curveto
616.6413 235.6948 617.2511 235.5709 617.9138 235.5709 curveto
618.8709 235.5709 619.8437 235.7705 620.8322 236.1698 curveto
619.8541 237.8941 lineto
619.1599 237.6256 618.4657 237.4914 617.772 237.4914 curveto
617.1515 237.4914 616.5942 237.6153 616.0997 237.8631 curveto
615.6052 238.104 615.253 238.4413 615.043 238.875 curveto
614.7271 239.5358 614.5696 240.2586 614.5696 241.0433 curveto
614.5696 246.7842 lineto
611.7301 246.7842 lineto
closepath
627.2686 250.9866 moveto
621.0059 250.9866 lineto
621.0059 249.4481 lineto
624.4291 249.4481 lineto
624.4291 233.1857 lineto
621.0059 233.1857 lineto
621.0059 231.6473 lineto
627.2686 231.6473 lineto
627.2686 250.9866 lineto
closepath
fill
grestore
showpage
%%EndDocument
%%Trailer
cleartomark countdictstack exch sub { end } repeat restore
%%EOF
