%!PS-Adobe-3.0 EPSF-3.0
%%Creator: ansi2ps, written by S.Fourmanoit, 2005.
%%LanguageLevel: 2
%%BoundingBox: 0 512 402 789
%%Pages: 1 0

%-------------------------------------------------
% Headers
%-------------------------------------------------
/Times-Roman findfont
%/System findfont
12 scalefont
setfont

/cr {
   currentpoint
   12 sub
   exch pop 0 exch
   moveto
} def
%-------------------------------------------------
% Content
%-------------------------------------------------

%%Page: 2 1
0 850 moveto
([ebuild  ) show
0 1 0 setrgbcolor
(N) show
0 0 0 setrgbcolor
(    ]    ) show
0 1 0 setrgbcolor
(gnome-base/libgnomecanvas-2.8.0) show
0 0 0 setrgbcolor
(  ) show
0 0 1 setrgbcolor
(-debug) show
0 0 0 setrgbcolor
( ) show
0 0 1 setrgbcolor
(-doc) show
0 0 0 setrgbcolor
( 565 kB ) show
cr
([ebuild  ) show
0 1 0 setrgbcolor
(N) show
0 0 0 setrgbcolor
(    ]     ) show
0 1 0 setrgbcolor
(media-libs/libart_lgpl-2.3.17) show
0 0 0 setrgbcolor
(  ) show
0 0 1 setrgbcolor
(-debug) show
0 0 0 setrgbcolor
( 282 kB ) show
cr
([ebuild  ) show
0 1 0 setrgbcolor
(N) show
0 0 0 setrgbcolor
(    ]    ) show
0 1 0 setrgbcolor
(gnome-base/libglade-2.4.2) show
0 0 0 setrgbcolor
(  ) show
0 0 1 setrgbcolor
(-debug) show
0 0 0 setrgbcolor
( ) show
0 0 1 setrgbcolor
(-doc) show
0 0 0 setrgbcolor
( 310 kB ) show
cr
([ebuild  ) show
0 1 0 setrgbcolor
(N) show
0 0 0 setrgbcolor
(    ]    ) show
0 1 0 setrgbcolor
(gnome-base/libbonobo-2.8.1) show
0 0 0 setrgbcolor
(  ) show
0 0 1 setrgbcolor
(-debug) show
0 0 0 setrgbcolor
( ) show
0 0 1 setrgbcolor
(-doc) show
0 0 0 setrgbcolor
( 1,036 kB ) show
cr
([ebuild  ) show
0 1 0 setrgbcolor
(N) show
0 0 0 setrgbcolor
(    ]     ) show
0 1 0 setrgbcolor
(gnome-base/orbit-2.12.1) show
0 0 0 setrgbcolor
(  ) show
0 0 1 setrgbcolor
(-debug) show
0 0 0 setrgbcolor
( ) show
0 0 1 setrgbcolor
(-doc) show
0 0 0 setrgbcolor
( ) show
1 0 0 setrgbcolor
(+ssl) show
0 0 0 setrgbcolor
( 659 kB ) show
cr
([ebuild  ) show
0 1 0 setrgbcolor
(N) show
0 0 0 setrgbcolor
(    ]      ) show
0 1 0 setrgbcolor
(dev-libs/libIDL-0.8.5) show
0 0 0 setrgbcolor
(  ) show
0 0 1 setrgbcolor
(-debug) show
0 0 0 setrgbcolor
( 331 kB ) show
cr
([ebuild  ) show
0 1 0 setrgbcolor
(N) show
0 0 0 setrgbcolor
(    ]      ) show
0 1 0 setrgbcolor
(dev-util/indent-2.2.9-r2) show
0 0 0 setrgbcolor
(  ) show
1 0 0 setrgbcolor
(+nls) show
0 0 0 setrgbcolor
( 662 kB ) show
cr
([ebuild  ) show
0 1 0 setrgbcolor
(N) show
0 0 0 setrgbcolor
(    ]  ) show
0 1 0 setrgbcolor
(dev-python/pygtk-2.6.1) show
0 0 0 setrgbcolor
(  ) show
0 0 1 setrgbcolor
(-debug) show
0 0 0 setrgbcolor
( ) show
0 0 1 setrgbcolor
(-doc) show
0 0 0 setrgbcolor
( ) show
0 0 1 setrgbcolor
(-gnome) show
0 0 0 setrgbcolor
( ) show
1 0 0 setrgbcolor
(+opengl) show
0 0 0 setrgbcolor
( 712 kB ) show
cr
([ebuild  ) show
0 1 0 setrgbcolor
(N) show
0 0 0 setrgbcolor
(    ]   ) show
0 1 0 setrgbcolor
(dev-python/numeric-23.7) show
0 0 0 setrgbcolor
(  708 kB ) show
cr
([ebuild  ) show
0 1 0 setrgbcolor
(N) show
0 0 0 setrgbcolor
(    ]   ) show
0 1 0 setrgbcolor
(dev-python/pyopengl-2.0.1.09) show
0 0 0 setrgbcolor
(  2,129 kB ) show
cr
([ebuild  ) show
0 1 0 setrgbcolor
(N) show
0 0 0 setrgbcolor
(    ]    ) show
0 1 0 setrgbcolor
(media-libs/glut-3.7.1) show
0 0 0 setrgbcolor
(  2,479 kB ) show
cr
([ebuild  ) show
0 1 0 setrgbcolor
(N) show
0 0 0 setrgbcolor
(    ]   ) show
0 1 0 setrgbcolor
(x11-libs/gtkglarea-1.99.0) show
0 0 0 setrgbcolor
(  ) show
0 0 1 setrgbcolor
(-debug) show
0 0 0 setrgbcolor
( 205 kB ) show
cr
([ebuild  ) show
0 1 0 setrgbcolor
(N) show
0 0 0 setrgbcolor
(    ]    ) show
0 1 0 setrgbcolor
(x11-libs/gtk+-2.6.4) show
0 0 0 setrgbcolor
(  ) show
0 0 1 setrgbcolor
(-debug) show
0 0 0 setrgbcolor
( ) show
0 0 1 setrgbcolor
(-doc) show
0 0 0 setrgbcolor
( ) show
0 0 1 setrgbcolor
(-jpeg) show
0 0 0 setrgbcolor
( ) show
0 0 1 setrgbcolor
(-static) show
0 0 0 setrgbcolor
( ) show
0 0 1 setrgbcolor
(-tiff) show
0 0 0 setrgbcolor
( 10,985 kB ) show
cr
([ebuild  ) show
0 1 0 setrgbcolor
(N) show
0 0 0 setrgbcolor
(    ]     ) show
0 1 0 setrgbcolor
(x11-misc/shared-mime-info-0.14-r2) show
0 0 0 setrgbcolor
(  347 kB ) show
cr
([ebuild  ) show
0 1 0 setrgbcolor
(N) show
0 0 0 setrgbcolor
(    ]      ) show
0 1 0 setrgbcolor
(dev-libs/libxml2-2.6.17) show
0 0 0 setrgbcolor
(  ) show
0 0 1 setrgbcolor
(-debug) show
0 0 0 setrgbcolor
( ) show
0 0 1 setrgbcolor
(-ipv6) show
0 0 0 setrgbcolor
( ) show
1 0 0 setrgbcolor
(+python) show
0 0 0 setrgbcolor
( ) show
1 0 0 setrgbcolor
(+readline) show
0 0 0 setrgbcolor
( 2,995 kB ) show
cr
([ebuild  ) show
0 1 0 setrgbcolor
(N) show
0 0 0 setrgbcolor
(    ]      ) show
0 1 0 setrgbcolor
(dev-util/intltool-0.32.1) show
0 0 0 setrgbcolor
(  121 kB ) show
cr
([ebuild  ) show
0 1 0 setrgbcolor
(N) show
0 0 0 setrgbcolor
(    ]       ) show
0 1 0 setrgbcolor
(dev-perl/XML-Parser-2.34) show
0 0 0 setrgbcolor
(  224 kB ) show
cr
([ebuild  ) show
0 1 0 setrgbcolor
(N) show
0 0 0 setrgbcolor
(    ]     ) show
0 1 0 setrgbcolor
(dev-libs/atk-1.8.0-r1) show
0 0 0 setrgbcolor
(  ) show
0 0 1 setrgbcolor
(-debug) show
0 0 0 setrgbcolor
( ) show
0 0 1 setrgbcolor
(-doc) show
0 0 0 setrgbcolor
( ) show
0 0 1 setrgbcolor
(-static) show
0 0 0 setrgbcolor
( 488 kB ) show
cr
([ebuild  ) show
0 1 0 setrgbcolor
(N) show
0 0 0 setrgbcolor
(    ]     ) show
0 1 0 setrgbcolor
(x11-libs/pango-1.8.1) show
0 0 0 setrgbcolor
(  ) show
0 0 1 setrgbcolor
(-debug) show
0 0 0 setrgbcolor
( ) show
0 0 1 setrgbcolor
(-doc) show
0 0 0 setrgbcolor
( ) show
0 0 1 setrgbcolor
(-static) show
0 0 0 setrgbcolor
( 973 kB ) show
cr
([ebuild  ) show
0 1 0 setrgbcolor
(N) show
0 0 0 setrgbcolor
(    ]      ) show
0 1 0 setrgbcolor
(dev-libs/glib-2.6.3) show
0 0 0 setrgbcolor
(  ) show
0 0 1 setrgbcolor
(-debug) show
0 0 0 setrgbcolor
( ) show
0 0 1 setrgbcolor
(-doc) show
0 0 0 setrgbcolor
( 2,246 kB ) show
cr
([ebuild  ) show
0 1 0 setrgbcolor
(N) show
0 0 0 setrgbcolor
(    ]    ) show
0 1 0 setrgbcolor
(dev-util/pkgconfig-0.15.0) show
0 0 0 setrgbcolor
(  596 kB ) show
cr
() show
cr
(Total size of downloads: 80,757 kB) show
cr
() show

%%EOF
