%!PS-Adobe-3.0 EPSF-3.0
%%Creator: ansi2ps, written by S.Fourmanoit, 2005.
%%LanguageLevel: 2
%%BoundingBox: 0 32 289 789
%%Pages: 1 0

%-------------------------------------------------
% Headers
%-------------------------------------------------
/Times-Roman findfont
%/System findfont
12 scalefont
setfont

/cr {
   currentpoint
   12 sub
   exch pop 0 exch
   moveto
} def
%-------------------------------------------------
% Content
%-------------------------------------------------

%%Page: 1 1
0 780 moveto
0 0 0 setrgbcolor
() show
() show
0 1 0 setrgbcolor
(These are the packages that I would merge, in reverse order:) show
0 0 0 setrgbcolor
() show
cr
() show
cr
(Calculating world dependencies  . ...done!) show
cr
([ebuild  ) show
0 1 0 setrgbcolor
(N) show
0 0 0 setrgbcolor
(    ] ) show
0 1 0 setrgbcolor
(sys-libs/pwdb-0.62) show
0 0 0 setrgbcolor
(  ) show
cr
([ebuild  ) show
0 1 0 setrgbcolor
(N) show
0 0 0 setrgbcolor
(    ] ) show
0 1 0 setrgbcolor
(sys-apps/ed-0.2-r6) show
0 0 0 setrgbcolor
(  ) show
cr
([ebuild  ) show
0 1 0 setrgbcolor
(N) show
0 0 0 setrgbcolor
(    ] ) show
0 1 0 setrgbcolor
(sys-apps/less-382-r2) show
0 0 0 setrgbcolor
(  ) show
cr
([ebuild  ) show
0 1 0 setrgbcolor
(N) show
0 0 0 setrgbcolor
(    ] ) show
0 1 0 setrgbcolor
(sys-apps/hdparm-5.7-r1) show
0 0 0 setrgbcolor
(  ) show
cr
([ebuild  ) show
0 1 0 setrgbcolor
(N) show
0 0 0 setrgbcolor
(    ] ) show
0 1 0 setrgbcolor
(x11-wm/fluxbox-0.9.12-r1) show
0 0 0 setrgbcolor
(  ) show
cr
([ebuild  ) show
0 1 0 setrgbcolor
(N) show
0 0 0 setrgbcolor
(    ] ) show
0 1 0 setrgbcolor
(net-misc/wget-1.9.1-r3) show
0 0 0 setrgbcolor
(  ) show
cr
([ebuild  ) show
0 1 0 setrgbcolor
(N) show
0 0 0 setrgbcolor
(    ] ) show
0 1 0 setrgbcolor
(app-admin/syslog-ng-1.6.5-r2) show
0 0 0 setrgbcolor
(  ) show
cr
([ebuild  ) show
0 1 0 setrgbcolor
(N) show
0 0 0 setrgbcolor
(    ]  ) show
0 1 0 setrgbcolor
(dev-libs/libol-0.3.14) show
0 0 0 setrgbcolor
(  ) show
cr
([ebuild  ) show
0 1 0 setrgbcolor
(N) show
0 0 0 setrgbcolor
(    ] ) show
0 1 0 setrgbcolor
(sys-apps/findutils-4.1.20-r1) show
0 0 0 setrgbcolor
(  ) show
cr
([ebuild  ) show
0 1 0 setrgbcolor
(N) show
0 0 0 setrgbcolor
(    ] ) show
0 1 0 setrgbcolor
(sys-apps/shadow-4.0.5-r3) show
0 0 0 setrgbcolor
(  ) show
cr
([ebuild  ) show
0 1 0 setrgbcolor
(N) show
0 0 0 setrgbcolor
(    ] ) show
0 1 0 setrgbcolor
(net-misc/openssh-3.9_p1-r1) show
0 0 0 setrgbcolor
(  ) show
cr
([ebuild  ) show
0 1 0 setrgbcolor
(N) show
0 0 0 setrgbcolor
(    ]  ) show
0 1 0 setrgbcolor
(sys-apps/tcp-wrappers-7.6-r8) show
0 0 0 setrgbcolor
(  ) show
cr
([ebuild  ) show
0 1 0 setrgbcolor
(N) show
0 0 0 setrgbcolor
(    ] ) show
0 1 0 setrgbcolor
(sys-process/procps-3.2.4-r3) show
0 0 0 setrgbcolor
(  ) show
cr
([ebuild  ) show
0 1 0 setrgbcolor
(N) show
0 0 0 setrgbcolor
(    ] ) show
0 1 0 setrgbcolor
(net-misc/iputils-021109-r3) show
0 0 0 setrgbcolor
(  ) show
cr
([ebuild  ) show
0 1 0 setrgbcolor
(N) show
0 0 0 setrgbcolor
(    ] ) show
0 1 0 setrgbcolor
(sys-apps/coreutils-5.2.1-r4) show
0 0 0 setrgbcolor
(  ) show
cr
([ebuild  ) show
0 1 0 setrgbcolor
(N) show
0 0 0 setrgbcolor
(    ]  ) show
0 1 0 setrgbcolor
(sys-apps/help2man-1.33.1) show
0 0 0 setrgbcolor
(  ) show
cr
([ebuild  ) show
0 1 0 setrgbcolor
(N) show
0 0 0 setrgbcolor
(    ]   ) show
0 1 0 setrgbcolor
(dev-perl/Locale-gettext-1.01-r1) show
0 0 0 setrgbcolor
(  ) show
cr
([ebuild  ) show
0 1 0 setrgbcolor
(N) show
0 0 0 setrgbcolor
(    ] ) show
0 1 0 setrgbcolor
(sys-fs/devfsd-1.3.25-r8) show
0 0 0 setrgbcolor
(  ) show
cr
([ebuild  ) show
0 1 0 setrgbcolor
(N) show
0 0 0 setrgbcolor
(    ] ) show
0 1 0 setrgbcolor
(sys-devel/make-3.80-r1) show
0 0 0 setrgbcolor
(  ) show
cr
([ebuild  ) show
0 1 0 setrgbcolor
(N) show
0 0 0 setrgbcolor
(    ] ) show
0 1 0 setrgbcolor
(x11-terms/xterm-197) show
0 0 0 setrgbcolor
(  ) show
cr
([ebuild  ) show
0 1 0 setrgbcolor
(N) show
0 0 0 setrgbcolor
(    ]  ) show
0 1 0 setrgbcolor
(sys-apps/utempter-0.5.5.5-r1) show
0 0 0 setrgbcolor
(  ) show
cr
([ebuild  ) show
0 1 0 setrgbcolor
(N) show
0 0 0 setrgbcolor
(    ]   ) show
0 1 0 setrgbcolor
(app-arch/rpm2targz-9.0-r2) show
0 0 0 setrgbcolor
(  ) show
cr
([ebuild  ) show
0 1 0 setrgbcolor
(N) show
0 0 0 setrgbcolor
(    ]    ) show
0 1 0 setrgbcolor
(app-arch/cpio-2.6-r1) show
0 0 0 setrgbcolor
(  ) show
cr
([ebuild  ) show
0 1 0 setrgbcolor
(N) show
0 0 0 setrgbcolor
(    ]    ) show
0 1 0 setrgbcolor
(sys-apps/which-2.16) show
0 0 0 setrgbcolor
(  ) show
cr
([ebuild  ) show
0 1 0 setrgbcolor
(N) show
0 0 0 setrgbcolor
(    ] ) show
0 1 0 setrgbcolor
(x11-base/xorg-x11-6.8.2-r1) show
0 0 0 setrgbcolor
(  ) show
cr
([ebuild  ) show
0 1 0 setrgbcolor
(N) show
0 0 0 setrgbcolor
(    ]  ) show
0 1 0 setrgbcolor
(media-libs/fontconfig-2.2.3) show
0 0 0 setrgbcolor
(  ) show
cr
([ebuild  ) show
0 1 0 setrgbcolor
(N) show
0 0 0 setrgbcolor
(    ]  ) show
0 1 0 setrgbcolor
(x11-base/opengl-update-2.1.1-r1) show
0 0 0 setrgbcolor
(  ) show
cr
([ebuild  ) show
0 1 0 setrgbcolor
(N) show
0 0 0 setrgbcolor
(    ]  ) show
0 1 0 setrgbcolor
(x11-misc/ttmkfdir-3.0.9-r2) show
0 0 0 setrgbcolor
(  ) show
cr
([ebuild  ) show
0 1 0 setrgbcolor
(N) show
0 0 0 setrgbcolor
(    ]  ) show
0 1 0 setrgbcolor
(media-libs/freetype-2.1.9-r1) show
0 0 0 setrgbcolor
(  ) show
cr
([ebuild  ) show
0 1 0 setrgbcolor
(N) show
0 0 0 setrgbcolor
(    ]  ) show
0 1 0 setrgbcolor
(media-libs/libpng-1.2.8) show
0 0 0 setrgbcolor
(  ) show
cr
([ebuild  ) show
0 1 0 setrgbcolor
(N) show
0 0 0 setrgbcolor
(    ] ) show
0 1 0 setrgbcolor
(net-misc/rsync-2.6.0-r3) show
0 0 0 setrgbcolor
(  ) show
cr
([ebuild  ) show
0 1 0 setrgbcolor
(N) show
0 0 0 setrgbcolor
(    ]  ) show
0 1 0 setrgbcolor
(dev-libs/popt-1.7-r1) show
0 0 0 setrgbcolor
(  ) show
cr
([ebuild  ) show
0 1 0 setrgbcolor
(N) show
0 0 0 setrgbcolor
(    ] ) show
0 1 0 setrgbcolor
(app-editors/nano-1.3.4) show
0 0 0 setrgbcolor
(  ) show
cr
([ebuild  ) show
0 1 0 setrgbcolor
(N) show
0 0 0 setrgbcolor
(    ] ) show
0 1 0 setrgbcolor
(sys-apps/file-4.12) show
0 0 0 setrgbcolor
(  ) show
cr
([ebuild  ) show
0 1 0 setrgbcolor
(N) show
0 0 0 setrgbcolor
(    ] ) show
0 1 0 setrgbcolor
(sys-process/psmisc-21.5) show
0 0 0 setrgbcolor
(  ) show
cr
([ebuild  ) show
0 1 0 setrgbcolor
(N) show
0 0 0 setrgbcolor
(    ]  ) show
0 1 0 setrgbcolor
(sys-devel/libtool-1.5.10-r4) show
0 0 0 setrgbcolor
(  ) show
cr
([ebuild  ) show
0 1 0 setrgbcolor
(N) show
0 0 0 setrgbcolor
(    ]   ) show
0 1 0 setrgbcolor
(sys-devel/automake-1.9.4) show
0 0 0 setrgbcolor
(  ) show
cr
([ebuild  ) show
0 1 0 setrgbcolor
(N) show
0 0 0 setrgbcolor
(    ]    ) show
0 1 0 setrgbcolor
(sys-devel/automake-wrapper-1-r1) show
0 0 0 setrgbcolor
(  ) show
cr
([ebuild  ) show
0 1 0 setrgbcolor
(N) show
0 0 0 setrgbcolor
(    ]     ) show
0 1 0 setrgbcolor
(sys-devel/automake-1.4_p6) show
0 0 0 setrgbcolor
(  ) show
cr
([ebuild  ) show
0 1 0 setrgbcolor
(N) show
0 0 0 setrgbcolor
(    ]     ) show
0 1 0 setrgbcolor
(sys-devel/automake-1.7.9-r1) show
0 0 0 setrgbcolor
(  ) show
cr
([ebuild  ) show
0 1 0 setrgbcolor
(N) show
0 0 0 setrgbcolor
(    ]     ) show
0 1 0 setrgbcolor
(sys-devel/automake-1.6.3) show
0 0 0 setrgbcolor
(  ) show
cr
([ebuild  ) show
0 1 0 setrgbcolor
(N) show
0 0 0 setrgbcolor
(    ]     ) show
0 1 0 setrgbcolor
(sys-devel/automake-1.8.5-r3) show
0 0 0 setrgbcolor
(  ) show
cr
([ebuild  ) show
0 1 0 setrgbcolor
(N) show
0 0 0 setrgbcolor
(    ]     ) show
0 1 0 setrgbcolor
(sys-devel/automake-1.5) show
0 0 0 setrgbcolor
(  ) show
cr
([ebuild  ) show
0 1 0 setrgbcolor
(N) show
0 0 0 setrgbcolor
(    ]      ) show
0 1 0 setrgbcolor
(sys-devel/autoconf-2.59-r6) show
0 0 0 setrgbcolor
(  ) show
cr
([ebuild  ) show
0 1 0 setrgbcolor
(N) show
0 0 0 setrgbcolor
(    ]       ) show
0 1 0 setrgbcolor
(sys-devel/autoconf-wrapper-2-r1) show
0 0 0 setrgbcolor
(  ) show
cr
([ebuild  ) show
0 1 0 setrgbcolor
(N) show
0 0 0 setrgbcolor
(    ]        ) show
0 1 0 setrgbcolor
(sys-devel/autoconf-2.13) show
0 0 0 setrgbcolor
(  ) show
cr
([ebuild  ) show
0 1 0 setrgbcolor
(N) show
0 0 0 setrgbcolor
(    ] ) show
0 1 0 setrgbcolor
(sys-fs/udev-045) show
0 0 0 setrgbcolor
(  ) show
cr
([ebuild  ) show
0 1 0 setrgbcolor
(N) show
0 0 0 setrgbcolor
(    ]  ) show
0 1 0 setrgbcolor
(sys-apps/hotplug-base-20040401) show
0 0 0 setrgbcolor
(  ) show
cr
([ebuild  ) show
0 1 0 setrgbcolor
(N) show
0 0 0 setrgbcolor
(    ] ) show
0 1 0 setrgbcolor
(app-arch/tar-1.14) show
0 0 0 setrgbcolor
(  ) show
cr
([ebuild  ) show
0 1 0 setrgbcolor
(N) show
0 0 0 setrgbcolor
(    ]  ) show
0 1 0 setrgbcolor
(app-arch/ncompress-4.2.4-r1) show
0 0 0 setrgbcolor
(  ) show
cr
([ebuild  ) show
0 1 0 setrgbcolor
(N) show
0 0 0 setrgbcolor
(    ]  ) show
0 1 0 setrgbcolor
(app-arch/gzip-1.3.5-r5) show
0 0 0 setrgbcolor
(  ) show
cr
([ebuild  ) show
0 1 0 setrgbcolor
(N) show
0 0 0 setrgbcolor
(    ] ) show
0 1 0 setrgbcolor
(sys-apps/module-init-tools-3.0-r2) show
0 0 0 setrgbcolor
(  ) show
cr
([ebuild  ) show
0 1 0 setrgbcolor
(N) show
0 0 0 setrgbcolor
(    ] ) show
0 1 0 setrgbcolor
(sys-libs/cracklib-2.7-r10) show
0 0 0 setrgbcolor
(  ) show
cr
([ebuild  ) show
0 1 0 setrgbcolor
(N) show
0 0 0 setrgbcolor
(    ]  ) show
0 1 0 setrgbcolor
(sys-apps/miscfiles-1.3-r1) show
0 0 0 setrgbcolor
(  ) show
cr
([ebuild  ) show
0 1 0 setrgbcolor
(N) show
0 0 0 setrgbcolor
(    ] ) show
0 1 0 setrgbcolor
(app-shells/sash-3.7) show
0 0 0 setrgbcolor
(  ) show
cr
([ebuild  ) show
0 1 0 setrgbcolor
(N) show
0 0 0 setrgbcolor
(    ] ) show
0 1 0 setrgbcolor
(sys-apps/kbd-1.12-r3) show
0 0 0 setrgbcolor
(  ) show
cr
([ebuild  ) show
0 1 0 setrgbcolor
(N) show
0 0 0 setrgbcolor
(    ] ) show
0 1 0 setrgbcolor
(sys-apps/net-tools-1.60-r11) show
0 0 0 setrgbcolor
(  ) show
cr
([ebuild  ) show
0 1 0 setrgbcolor
(N) show
0 0 0 setrgbcolor
(    ] ) show
0 1 0 setrgbcolor
(sys-devel/bin86-0.16.16) show
0 0 0 setrgbcolor
(  ) show
cr
([ebuild  ) show
0 1 0 setrgbcolor
(N) show
0 0 0 setrgbcolor
(    ] ) show
0 1 0 setrgbcolor
(sys-apps/grep-2.5.1-r6) show
0 0 0 setrgbcolor
(  ) show
cr
([ebuild  ) show
0 1 0 setrgbcolor
(N) show
0 0 0 setrgbcolor
(    ] ) show
0 1 0 setrgbcolor
(sys-libs/zlib-1.2.2) show
0 0 0 setrgbcolor
(  ) show

%%EOF
