%!PS-Adobe-3.0 EPSF-3.0
%%Creator: inkscape 0.43
%%Pages: 1
%%Orientation: Portrait
%%BoundingBox: 83 665 252 702
%%HiResBoundingBox: 83.622411 665.28389 251.35045 701.57948
%%EndComments
%%Page: 1 1
0 842 translate
0.8 -0.8 scale
gsave [1 0 0 1 0 0] concat
gsave [1 0 0 1 104.3553 168.2426] concat
gsave [1 0 0 1 1.25 1.25] concat
gsave [1.1841 0 0 1.1841 -4.810286 2.839354] concat
gsave
0 0 0 setrgbcolor
newpath
5 23.75 moveto
30 13.75 lineto
52.5 30 lineto
53.75 30.902778 29.230769 41.25 27.5 40 curveto
5 23.75 lineto
closepath
fill
grestore
0 0 0 setrgbcolor
[] 0 setdash
1.5834811 setlinewidth
1 setlinejoin
1 setlinecap
newpath
5 23.75 moveto
30 13.75 lineto
52.5 30 lineto
53.75 30.902778 29.230769 41.25 27.5 40 curveto
5 23.75 lineto
closepath
stroke
grestore
gsave [1.1841 0 0 1.1841 -4.810286 2.839354] concat
gsave
0 0 0 setrgbcolor
newpath
5 15 moveto
5 8.75 30 2.5 30 5 curveto
30 13.75 lineto
5 23.75 lineto
5 15 lineto
closepath
fill
grestore
0 0 0 setrgbcolor
[] 0 setdash
1.5834811 setlinewidth
1 setlinejoin
1 setlinecap
newpath
5 15 moveto
5 8.75 30 2.5 30 5 curveto
30 13.75 lineto
5 23.75 lineto
5 15 lineto
closepath
stroke
grestore
gsave
0 0 0 setrgbcolor
newpath
30.85775 8.7707276 moveto
30.85775 5.8104776 57.5 23.25952 57.5 33.932853 curveto
57.5 38.373228 lineto
30.85775 19.131603 lineto
30.85775 8.7707276 lineto
closepath
fill
grestore
0 0 0 setrgbcolor
[] 0 setdash
1.8749999 setlinewidth
1 setlinejoin
1 setlinecap
newpath
30.85775 8.7707276 moveto
30.85775 5.8104776 57.5 23.25952 57.5 33.932853 curveto
57.5 38.373228 lineto
30.85775 19.131603 lineto
30.85775 8.7707276 lineto
closepath
stroke
grestore
gsave [1.1841 0 0 1.1841 -4.810286 2.839354] concat
gsave
<<
/ShadingType 2
/ColorSpace /DeviceRGB
/Coords [36.134808 59.805271 2.7633562 19.102106]
/Extend [true true]
/Domain [0 1]
/Function <<
/FunctionType 3
/Functions
[
<<
/FunctionType 2
/Domain [0 1]
/C0 [0.8509804 0.80000001 0.90196079]
/C1 [0.4509804 0.40000001 0.49803922]
/N 1
>>
]
/Domain [0 1]
/Bounds [ ]
/Encode [ 0 1 ]
>>
>>
newpath
5 23.75 moveto
30 13.75 lineto
52.5 30 lineto
53.75 30.902778 29.230769 41.25 27.5 40 curveto
5 23.75 lineto
closepath
clip
gsave [1.470133 0 0 0.680211 0 0] concat
shfill
grestore
grestore
0.14901961 0.098039217 0.2 setrgbcolor
[] 0 setdash
1.5834811 setlinewidth
1 setlinejoin
1 setlinecap
newpath
5 23.75 moveto
30 13.75 lineto
52.5 30 lineto
53.75 30.902778 29.230769 41.25 27.5 40 curveto
5 23.75 lineto
closepath
stroke
grestore
gsave [1.1841 0 0 1.1841 -4.810286 2.839354] concat
gsave
<<
/ShadingType 2
/ColorSpace /DeviceRGB
/Coords [20.419432 5.7963028 2.8459804 36.605484]
/Extend [true true]
/Domain [0 1]
/Function <<
/FunctionType 3
/Functions
[
<<
/FunctionType 2
/Domain [0 1]
/C0 [0.8509804 0.80000001 0.90196079]
/C1 [0.4509804 0.40000001 0.49803922]
/N 1
>>
]
/Domain [0 1]
/Bounds [ ]
/Encode [ 0 1 ]
>>
>>
newpath
5 15 moveto
5 8.75 30 2.5 30 5 curveto
30 13.75 lineto
5 23.75 lineto
5 15 lineto
closepath
clip
gsave [1.504379 0 0 0.664726 0 0] concat
shfill
grestore
grestore
0.14901961 0.098039217 0.2 setrgbcolor
[] 0 setdash
1.5834811 setlinewidth
1 setlinejoin
1 setlinecap
newpath
5 15 moveto
5 8.75 30 2.5 30 5 curveto
30 13.75 lineto
5 23.75 lineto
5 15 lineto
closepath
stroke
grestore
gsave
<<
/ShadingType 2
/ColorSpace /DeviceRGB
/Coords [2.47962 23.37414 17.147795 65.993713]
/Extend [true true]
/Domain [0 1]
/Function <<
/FunctionType 3
/Functions
[
<<
/FunctionType 2
/Domain [0 1]
/C0 [0.8509804 0.80000001 0.90196079]
/C1 [0.4509804 0.40000001 0.49803922]
/N 1
>>
]
/Domain [0 1]
/Bounds [ ]
/Encode [ 0 1 ]
>>
>>
newpath
30.85775 8.7707276 moveto
30.85775 5.8104776 57.5 23.25952 57.5 33.932853 curveto
57.5 38.373228 lineto
30.85775 19.131603 lineto
30.85775 8.7707276 lineto
closepath
clip
gsave [1.939977 0 0 0.722737 24.93725 -8.990772] concat
shfill
grestore
grestore
0.14901961 0.098039217 0.2 setrgbcolor
[] 0 setdash
1.8749999 setlinewidth
1 setlinejoin
1 setlinecap
newpath
30.85775 8.7707276 moveto
30.85775 5.8104776 57.5 23.25952 57.5 33.932853 curveto
57.5 38.373228 lineto
30.85775 19.131603 lineto
30.85775 8.7707276 lineto
closepath
stroke
gsave [1.1841 0 0 1.1841 -4.810286 2.839354] concat
gsave
<<
/ShadingType 2
/ColorSpace /DeviceRGB
/Coords [2.47962 23.37414 17.147795 65.993713]
/Extend [true true]
/Domain [0 1]
/Function <<
/FunctionType 3
/Functions
[
<<
/FunctionType 2
/Domain [0 1]
/C0 [0.8509804 0.80000001 0.90196079]
/C1 [0.4509804 0.40000001 0.49803922]
/N 1
>>
]
/Domain [0 1]
/Bounds [ ]
/Encode [ 0 1 ]
>>
>>
newpath
5 15 moveto
5 12.5 27.5 27.236122 27.5 36.25 curveto
27.5 40 lineto
5 23.75 lineto
5 15 lineto
closepath
clip
gsave [1.638356 0 0 0.610368 0 0] concat
shfill
grestore
grestore
0.14901961 0.098039217 0.2 setrgbcolor
[] 0 setdash
1.5834811 setlinewidth
1 setlinejoin
1 setlinecap
newpath
5 15 moveto
5 12.5 27.5 27.236122 27.5 36.25 curveto
27.5 40 lineto
5 23.75 lineto
5 15 lineto
closepath
stroke
grestore
gsave [0.75 0 0 0.75 7.657403 7.650881] concat
gsave
0 0 0 setrgbcolor
newpath
2.0463304 38.017282 moveto
3.2962754 40.459219 43.727561 54.60989 46.497381 53.109149 curveto
49.294487 51.772691 59.673353 24.794113 57.807566 21.994025 curveto
55.978204 18.977744 16.478918 5.8640083 13.218885 6.6125147 curveto
10.115404 7.2133504 0.70889204 35.71636 2.0463304 38.017282 curveto
closepath
eofill
grestore
grestore
gsave [1.508072 0 0 1.508072 7.302136 5.738604] concat
gsave
<<
/ShadingType 2
/ColorSpace /DeviceRGB
/Coords [0.9155075 4.1149545 25.931114 29.016375]
/Extend [true true]
/Domain [0 1]
/Function <<
/FunctionType 3
/Functions
[
<<
/FunctionType 2
/Domain [0 1]
/C0 [1 1 1]
/C1 [0.8509804 0.80000001 0.90196079]
/N 1
>>
]
/Domain [0 1]
/Bounds [ ]
/Encode [ 0 1 ]
>>
>>
newpath
1.5928059 19.186357 moveto
2.1848241 20.342945 21.334508 27.045202 22.646391 26.334398 curveto
23.971201 25.701404 28.886998 12.923398 28.003296 11.597177 curveto
27.136845 10.16856 8.4285886 3.9574319 6.8845223 4.3119513 curveto
5.4146041 4.5965278 0.95934761 18.096559 1.5928059 19.186357 curveto
closepath
eoclip
gsave [1.092626 0 0 0.915226 0 0] concat
shfill
grestore
grestore
0.14901961 0.098039217 0.2 setrgbcolor
[] 0 setdash
1.2433093 setlinewidth
0 setlinejoin
0 setlinecap
newpath
1.5928059 19.186357 moveto
2.1848241 20.342945 21.334508 27.045202 22.646391 26.334398 curveto
23.971201 25.701404 28.886998 12.923398 28.003296 11.597177 curveto
27.136845 10.16856 8.4285886 3.9574319 6.8845223 4.3119513 curveto
5.4146041 4.5965278 0.95934761 18.096559 1.5928059 19.186357 curveto
closepath
stroke
grestore
gsave [1.508072 0 0 1.508072 7.302136 5.738604] concat
gsave
<<
/ShadingType 2
/ColorSpace /DeviceRGB
/Coords [0.72228009 18.032919 17.64345 34.706448]
/Extend [true true]
/Domain [0 1]
/Function <<
/FunctionType 3
/Functions
[
<<
/FunctionType 2
/Domain [0 1]
/C0 [1 1 1]
/C1 [0.8509804 0.80000001 0.90196079]
/N 1
>>
]
/Domain [0 1]
/Bounds [ ]
/Encode [ 0 1 ]
>>
>>
newpath
1.4916193 19.150359 moveto
0.95459984 18.145131 11.912091 13.321529 15.544779 14.574488 curveto
18.917954 15.737938 23.743434 25.863708 22.509207 26.399586 curveto
21.371607 26.973763 1.5551732 20.05153 1.4916193 19.150359 curveto
closepath
eoclip
gsave [1.303241 0 0 0.767318 0 0] concat
shfill
grestore
grestore
0.14901961 0.098039217 0.2 setrgbcolor
[] 0 setdash
1.2433093 setlinewidth
0 setlinejoin
0 setlinecap
newpath
1.4916193 19.150359 moveto
0.95459984 18.145131 11.912091 13.321529 15.544779 14.574488 curveto
18.917954 15.737938 23.743434 25.863708 22.509207 26.399586 curveto
21.371607 26.973763 1.5551732 20.05153 1.4916193 19.150359 curveto
closepath
stroke
grestore
gsave [1.508072 0 0 1.508072 7.302136 5.738604] concat
gsave
<<
/ShadingType 2
/ColorSpace /DeviceRGB
/Coords [5.0333643 4.5306602 23.086508 22.757391]
/Extend [true true]
/Domain [0 1]
/Function <<
/FunctionType 3
/Functions
[
<<
/FunctionType 2
/Domain [0 1]
/C0 [1 1 1]
/C1 [0.8509804 0.80000001 0.90196079]
/N 1
>>
]
/Domain [0 1]
/Bounds [ ]
/Encode [ 0 1 ]
>>
>>
newpath
6.7473378 4.3771391 moveto
5.6898254 5.0346975 10.191179 17.286613 13.70011 18.477953 curveto
17.209041 19.669293 28.294585 12.68429 27.800923 11.525181 curveto
27.389314 10.347314 7.8583621 3.4700121 6.7473378 4.3771391 curveto
closepath
eoclip
gsave [1.203773 0 0 0.830721 0 0] concat
shfill
grestore
grestore
0.14901961 0.098039217 0.2 setrgbcolor
[] 0 setdash
1.2433093 setlinewidth
0 setlinejoin
0 setlinecap
newpath
6.7473378 4.3771391 moveto
5.6898254 5.0346975 10.191179 17.286613 13.70011 18.477953 curveto
17.209041 19.669293 28.294585 12.68429 27.800923 11.525181 curveto
27.389314 10.347314 7.8583621 3.4700121 6.7473378 4.3771391 curveto
closepath
stroke
grestore
gsave [1.508072 0 0 1.508072 7.302136 5.738604] concat
gsave
<<
/ShadingType 2
/ColorSpace /DeviceRGB
/Coords [0.71294367 5.4813294 19.078899 24.213966]
/Extend [true true]
/Domain [0 1]
/Function <<
/FunctionType 3
/Functions
[
<<
/FunctionType 2
/Domain [0 1]
/C0 [1 1 1]
/C1 [1 1 1]
/N 1
>>
]
/Domain [0 1]
/Bounds [ ]
/Encode [ 0 1 ]
>>
>>
newpath
3.0142647 17.754172 moveto
2.8238069 17.384598 6.4143912 6.2685315 7.5724036 5.5826101 curveto
8.5980888 5.0710043 26.509191 12.022513 26.696639 12.386245 curveto
26.868862 12.720434 10.640594 6.9404988 8.6514163 7.6763759 curveto
6.7286882 8.4007261 3.1834775 18.08252 3.0142647 17.754172 curveto
closepath
eoclip
gsave [1.393138 0 0 0.717804 0 0] concat
shfill
grestore
grestore
grestore
grestore
gsave [0.936246 0 0 1.068095 0 0] concat
gsave
0 0 0 setrgbcolor
newpath
189.08933 175.37117 moveto
187.74035 175.37117 lineto
187.74035 170.8076 lineto
187.74034 170.46318 187.7236 170.13072 187.69012 169.81022 curveto
187.66141 169.48972 187.59683 169.2338 187.49639 169.04244 curveto
187.38635 168.83676 187.22849 168.68129 187.02281 168.57604 curveto
186.8171 168.47081 186.52052 168.41819 186.13306 168.41818 curveto
185.75514 168.41819 185.37723 168.51386 184.99934 168.7052 curveto
184.62142 168.89177 184.24352 169.13095 183.86562 169.42274 curveto
183.87996 169.53277 183.89192 169.66193 183.9015 169.81022 curveto
183.91106 169.95373 183.91584 170.09724 183.91585 170.24074 curveto
183.91585 175.37117 lineto
182.56687 175.37117 lineto
182.56687 170.8076 lineto
182.56686 170.45362 182.55012 170.11876 182.51664 169.80304 curveto
182.48793 169.48254 182.42335 169.22662 182.3229 169.03527 curveto
182.21287 168.82958 182.05502 168.6765 181.84933 168.57604 curveto
181.64363 168.47081 181.34704 168.41819 180.95957 168.41818 curveto
180.59123 168.41819 180.2205 168.50908 179.84738 168.69085 curveto
179.47904 168.87263 179.1107 169.10464 178.74237 169.38687 curveto
178.74237 175.37117 lineto
177.39339 175.37117 lineto
177.39339 167.35622 lineto
178.74237 167.35622 lineto
178.74237 168.24597 lineto
179.16332 167.89678 179.58189 167.62411 179.99807 167.42797 curveto
180.41902 167.23185 180.86629 167.13379 181.33987 167.13378 curveto
181.8852 167.13379 182.34682 167.2486 182.72473 167.4782 curveto
183.10741 167.70782 183.39204 168.02593 183.5786 168.43253 curveto
184.12393 167.97331 184.62142 167.64324 185.07109 167.44232 curveto
185.52074 167.23664 186.0015 167.13379 186.51335 167.13378 curveto
187.39353 167.13379 188.04171 167.40167 188.45789 167.93743 curveto
188.87884 168.46842 189.08932 169.21227 189.08933 170.16899 curveto
189.08933 175.37117 lineto
fill
grestore
gsave
0 0 0 setrgbcolor
newpath
198.47479 167.35622 moveto
193.79641 178.32745 lineto
192.35415 178.32745 lineto
193.84664 174.9837 lineto
190.65357 167.35622 lineto
192.11736 167.35622 lineto
194.57853 173.29747 lineto
197.06123 167.35622 lineto
198.47479 167.35622 lineto
fill
grestore
gsave
0 0 0 setrgbcolor
newpath
211.93589 175.37117 moveto
210.58691 175.37117 lineto
210.58691 170.8076 lineto
210.58689 170.46318 210.57015 170.13072 210.53668 169.81022 curveto
210.50797 169.48972 210.44339 169.2338 210.34294 169.04244 curveto
210.23291 168.83676 210.07505 168.68129 209.86936 168.57604 curveto
209.66366 168.47081 209.36707 168.41819 208.97961 168.41818 curveto
208.6017 168.41819 208.22379 168.51386 207.84589 168.7052 curveto
207.46798 168.89177 207.09007 169.13095 206.71218 169.42274 curveto
206.72652 169.53277 206.73848 169.66193 206.74805 169.81022 curveto
206.75761 169.95373 206.7624 170.09724 206.7624 170.24074 curveto
206.7624 175.37117 lineto
205.41342 175.37117 lineto
205.41342 170.8076 lineto
205.41342 170.45362 205.39668 170.11876 205.3632 169.80304 curveto
205.33449 169.48254 205.26991 169.22662 205.16946 169.03527 curveto
205.05943 168.82958 204.90157 168.6765 204.69588 168.57604 curveto
204.49018 168.47081 204.1936 168.41819 203.80613 168.41818 curveto
203.43779 168.41819 203.06706 168.50908 202.69394 168.69085 curveto
202.3256 168.87263 201.95726 169.10464 201.58892 169.38687 curveto
201.58892 175.37117 lineto
200.23994 175.37117 lineto
200.23994 167.35622 lineto
201.58892 167.35622 lineto
201.58892 168.24597 lineto
202.00988 167.89678 202.42844 167.62411 202.84462 167.42797 curveto
203.26558 167.23185 203.71284 167.13379 204.18643 167.13378 curveto
204.73175 167.13379 205.19337 167.2486 205.57128 167.4782 curveto
205.95397 167.70782 206.23859 168.02593 206.42516 168.43253 curveto
206.97048 167.97331 207.46798 167.64324 207.91765 167.44232 curveto
208.3673 167.23664 208.84805 167.13379 209.35991 167.13378 curveto
210.24008 167.13379 210.88826 167.40167 211.30445 167.93743 curveto
211.72539 168.46842 211.93587 169.21227 211.93589 170.16899 curveto
211.93589 175.37117 lineto
fill
grestore
gsave
0 0 0 setrgbcolor
newpath
220.76166 175.37117 moveto
219.41985 175.37117 lineto
219.41985 174.51729 lineto
219.30026 174.59862 219.13762 174.71342 218.93193 174.86171 curveto
218.73101 175.00522 218.53488 175.12003 218.34354 175.20614 curveto
218.11871 175.31616 217.86039 175.40705 217.5686 175.4788 curveto
217.27679 175.55534 216.93476 175.59361 216.54251 175.59361 curveto
215.82018 175.59361 215.20788 175.35443 214.7056 174.87607 curveto
214.20332 174.3977 213.95218 173.78779 213.95218 173.04633 curveto
213.95218 172.43882 214.08134 171.9485 214.33965 171.57537 curveto
214.60275 171.19747 214.97587 170.90088 215.45902 170.68562 curveto
215.94695 170.47036 216.53294 170.32446 217.217 170.24792 curveto
217.90105 170.17138 218.63534 170.11398 219.41985 170.07571 curveto
219.41985 169.86762 lineto
219.41985 169.56147 219.36484 169.30794 219.25482 169.10702 curveto
219.14957 168.90612 218.9965 168.74826 218.79559 168.63345 curveto
218.60424 168.52343 218.37463 168.44928 218.10675 168.41101 curveto
217.83886 168.37275 217.55902 168.35361 217.26723 168.3536 curveto
216.91324 168.35361 216.51859 168.40145 216.08328 168.49711 curveto
215.64797 168.58801 215.19831 168.72195 214.7343 168.89894 curveto
214.66255 168.89894 lineto
214.66255 167.52843 lineto
214.92565 167.45668 215.30594 167.37775 215.80344 167.29164 curveto
216.30093 167.20554 216.79125 167.16249 217.2744 167.16248 curveto
217.83886 167.16249 218.32919 167.21033 218.74536 167.30599 curveto
219.16632 167.39689 219.52987 167.55475 219.83603 167.77957 curveto
220.13739 167.99962 220.367 168.28425 220.52487 168.63345 curveto
220.68272 168.98266 220.76165 169.41557 220.76166 169.9322 curveto
220.76166 175.37117 lineto
219.41985 173.39793 moveto
219.41985 171.16637 lineto
219.00846 171.19029 218.52292 171.22617 217.96324 171.274 curveto
217.40834 171.32184 216.96825 171.3912 216.64297 171.48209 curveto
216.25549 171.59212 215.94216 171.76433 215.70298 171.99872 curveto
215.4638 172.22834 215.34421 172.54645 215.34421 172.95305 curveto
215.34421 173.41228 215.48294 173.75909 215.76039 173.99349 curveto
216.03783 174.2231 216.46118 174.33791 217.03044 174.33791 curveto
217.50401 174.33791 217.93693 174.24702 218.32919 174.06524 curveto
218.72144 173.87868 219.085 173.65625 219.41985 173.39793 curveto
fill
grestore
gsave
0 0 0 setrgbcolor
newpath
224.82295 166.01442 moveto
223.30176 166.01442 lineto
223.30176 164.61521 lineto
224.82295 164.61521 lineto
224.82295 166.01442 lineto
224.73684 175.37117 moveto
223.38786 175.37117 lineto
223.38786 167.35622 lineto
224.73684 167.35622 lineto
224.73684 175.37117 lineto
fill
grestore
gsave
0 0 0 setrgbcolor
newpath
228.72638 175.37117 moveto
227.3774 175.37117 lineto
227.3774 164.20621 lineto
228.72638 164.20621 lineto
228.72638 175.37117 lineto
fill
grestore
gsave
0 0 0 setrgbcolor
newpath
243.44318 170.61386 moveto
243.44317 171.27879 243.3451 171.92219 243.14899 172.54405 curveto
242.95763 173.16592 242.68257 173.73278 242.32381 174.24463 curveto
239.16663 174.24463 lineto
238.97289 173.41228 lineto
238.61889 173.6993 238.27926 173.91934 237.95398 174.07242 curveto
237.62869 174.22549 237.25556 174.30203 236.83461 174.30203 curveto
236.03096 174.30203 235.38756 173.99827 234.90442 173.39075 curveto
234.42606 172.78324 234.18688 171.93414 234.18688 170.84348 curveto
234.18688 169.7576 234.48107 168.89177 235.06946 168.24597 curveto
235.65784 167.60019 236.36103 167.2773 237.17903 167.27729 curveto
237.52823 167.2773 237.83677 167.31796 238.10466 167.39927 curveto
238.37254 167.47582 238.66195 167.59302 238.97289 167.75087 curveto
238.97289 167.40645 lineto
240.11378 167.40645 lineto
240.11378 173.44816 lineto
241.85741 173.44816 lineto
242.05831 173.08939 242.209 172.64212 242.30946 172.10635 curveto
242.41469 171.56581 242.46731 171.08266 242.46732 170.65692 curveto
242.46731 169.87241 242.35729 169.15965 242.13725 168.51864 curveto
241.92198 167.87764 241.60387 167.32753 241.18292 166.86829 curveto
240.76195 166.40907 240.24054 166.05748 239.61868 165.8135 curveto
238.9968 165.56476 238.29122 165.44039 237.50193 165.44038 curveto
236.73654 165.44039 236.03574 165.57912 235.39953 165.85656 curveto
234.76809 166.13401 234.22515 166.50714 233.77071 166.97592 curveto
233.31148 167.44472 232.95031 168.0068 232.68722 168.66215 curveto
232.4289 169.31273 232.29974 170.00635 232.29974 170.74302 curveto
232.29974 171.53232 232.42412 172.25465 232.67287 172.91 curveto
232.92161 173.56057 233.27321 174.11786 233.72765 174.58187 curveto
234.20123 175.06502 234.75613 175.42857 235.39235 175.67254 curveto
236.02857 175.92129 236.72219 176.04566 237.47323 176.04566 curveto
237.88461 176.04566 238.30796 176.01935 238.74328 175.96673 curveto
239.18336 175.91411 239.60432 175.8304 240.00615 175.71559 curveto
240.00615 176.7345 lineto
239.54213 176.83496 239.10921 176.90193 238.7074 176.93541 curveto
238.30557 176.97368 237.89179 176.99281 237.46605 176.99282 curveto
236.57629 176.99281 235.75112 176.83974 234.99053 176.53359 curveto
234.22993 176.23222 233.57697 175.80887 233.03164 175.26354 curveto
232.48152 174.71342 232.05339 174.05328 231.74724 173.28312 curveto
231.44108 172.51296 231.28801 171.66148 231.28801 170.72867 curveto
231.28801 169.84371 231.44826 169.02092 231.76876 168.26032 curveto
232.08926 167.49495 232.52696 166.83242 233.08187 166.27273 curveto
233.63676 165.71306 234.29451 165.27296 235.05511 164.95245 curveto
235.8157 164.63196 236.62891 164.47171 237.49475 164.4717 curveto
238.43233 164.47171 239.26947 164.62 240.00615 164.91658 curveto
240.74282 165.21317 241.36469 165.62934 241.87176 166.1651 curveto
242.37881 166.70087 242.76629 167.34666 243.03418 168.10246 curveto
243.30683 168.8535 243.44317 169.69063 243.44318 170.61386 curveto
238.95854 172.4436 moveto
238.95854 168.72673 lineto
238.65716 168.58801 238.38689 168.48994 238.14772 168.43253 curveto
237.90853 168.37035 237.6526 168.33926 237.37995 168.33925 curveto
236.76285 168.33926 236.27971 168.55452 235.93051 168.98504 curveto
235.5813 169.41557 235.4067 170.02788 235.4067 170.82195 curveto
235.4067 171.60168 235.54542 172.19246 235.82288 172.59428 curveto
236.10032 172.99132 236.53324 173.18984 237.12163 173.18984 curveto
237.44213 173.18984 237.76263 173.1157 238.08314 172.9674 curveto
238.40363 172.81911 238.69543 172.64451 238.95854 172.4436 curveto
fill
grestore
gsave
0 0 0 setrgbcolor
newpath
252.75688 171.50362 moveto
246.85151 171.50362 lineto
246.8515 171.99633 246.92565 172.42686 247.07395 172.79519 curveto
247.22223 173.15875 247.42554 173.45773 247.68386 173.69212 curveto
247.9326 173.92174 248.22679 174.09395 248.56643 174.20875 curveto
248.91085 174.32356 249.28876 174.38096 249.70015 174.38096 curveto
250.24548 174.38096 250.7932 174.27333 251.34332 174.05807 curveto
251.89822 173.83802 252.29286 173.62276 252.52727 173.41228 curveto
252.59902 173.41228 lineto
252.59902 174.88324 lineto
252.14457 175.07459 251.68056 175.23484 251.20699 175.36399 curveto
250.73341 175.49315 250.23591 175.55773 249.7145 175.55773 curveto
248.38465 175.55773 247.34661 175.19896 246.60037 174.48142 curveto
245.85412 173.75909 245.481 172.7354 245.481 171.41034 curveto
245.481 170.09963 245.83738 169.05919 246.55014 168.28903 curveto
247.26768 167.51887 248.21005 167.13379 249.37726 167.13378 curveto
250.45835 167.13379 251.2907 167.44951 251.8743 168.08094 curveto
252.46268 168.71238 252.75687 169.60931 252.75688 170.77172 curveto
252.75688 171.50362 lineto
251.44378 170.47035 moveto
251.43899 169.76238 251.2596 169.21466 250.90562 168.82718 curveto
250.55641 168.43972 250.02304 168.24598 249.3055 168.24597 curveto
248.58317 168.24598 248.00675 168.45885 247.57622 168.88459 curveto
247.15048 169.31033 246.90891 169.83892 246.85151 170.47035 curveto
251.44378 170.47035 lineto
fill
grestore
gsave
0 0 0 setrgbcolor
newpath
261.74052 175.37117 moveto
260.03994 175.37117 lineto
257.76533 172.29291 lineto
255.47637 175.37117 lineto
253.90495 175.37117 lineto
257.03344 171.37446 lineto
253.93365 167.35622 lineto
255.63423 167.35622 lineto
257.89449 170.38425 lineto
260.16192 167.35622 lineto
261.74052 167.35622 lineto
258.5905 171.3027 lineto
261.74052 175.37117 lineto
fill
grestore
gsave
0 0 0 setrgbcolor
newpath
269.72677 175.37117 moveto
268.38496 175.37117 lineto
268.38496 174.51729 lineto
268.26537 174.59862 268.10272 174.71342 267.89703 174.86171 curveto
267.69612 175.00522 267.49999 175.12003 267.30865 175.20614 curveto
267.08381 175.31616 266.8255 175.40705 266.5337 175.4788 curveto
266.2419 175.55534 265.89987 175.59361 265.50762 175.59361 curveto
264.78529 175.59361 264.17299 175.35443 263.67071 174.87607 curveto
263.16843 174.3977 262.91729 173.78779 262.91729 173.04633 curveto
262.91729 172.43882 263.04644 171.9485 263.30476 171.57537 curveto
263.56786 171.19747 263.94098 170.90088 264.42413 170.68562 curveto
264.91205 170.47036 265.49805 170.32446 266.18211 170.24792 curveto
266.86616 170.17138 267.60044 170.11398 268.38496 170.07571 curveto
268.38496 169.86762 lineto
268.38496 169.56147 268.32994 169.30794 268.21993 169.10702 curveto
268.11468 168.90612 267.96161 168.74826 267.7607 168.63345 curveto
267.56935 168.52343 267.33974 168.44928 267.07186 168.41101 curveto
266.80397 168.37275 266.52413 168.35361 266.23233 168.3536 curveto
265.87834 168.35361 265.48369 168.40145 265.04839 168.49711 curveto
264.61308 168.58801 264.16342 168.72195 263.69941 168.89894 curveto
263.62765 168.89894 lineto
263.62765 167.52843 lineto
263.89075 167.45668 264.27105 167.37775 264.76855 167.29164 curveto
265.26604 167.20554 265.75636 167.16249 266.23951 167.16248 curveto
266.80397 167.16249 267.29429 167.21033 267.71047 167.30599 curveto
268.13142 167.39689 268.49498 167.55475 268.80114 167.77957 curveto
269.1025 167.99962 269.33211 168.28425 269.48998 168.63345 curveto
269.64783 168.98266 269.72676 169.41557 269.72677 169.9322 curveto
269.72677 175.37117 lineto
268.38496 173.39793 moveto
268.38496 171.16637 lineto
267.97357 171.19029 267.48803 171.22617 266.92835 171.274 curveto
266.37345 171.32184 265.93335 171.3912 265.60807 171.48209 curveto
265.2206 171.59212 264.90727 171.76433 264.66809 171.99872 curveto
264.42891 172.22834 264.30932 172.54645 264.30932 172.95305 curveto
264.30932 173.41228 264.44804 173.75909 264.72549 173.99349 curveto
265.00294 174.2231 265.42629 174.33791 265.99555 174.33791 curveto
266.46912 174.33791 266.90204 174.24702 267.2943 174.06524 curveto
267.68655 173.87868 268.0501 173.65625 268.38496 173.39793 curveto
fill
grestore
gsave
0 0 0 setrgbcolor
newpath
284.03456 175.37117 moveto
282.68558 175.37117 lineto
282.68558 170.8076 lineto
282.68557 170.46318 282.66882 170.13072 282.63535 169.81022 curveto
282.60664 169.48972 282.54206 169.2338 282.44161 169.04244 curveto
282.33158 168.83676 282.17372 168.68129 281.96804 168.57604 curveto
281.76233 168.47081 281.46575 168.41819 281.07828 168.41818 curveto
280.70037 168.41819 280.32246 168.51386 279.94457 168.7052 curveto
279.56665 168.89177 279.18875 169.13095 278.81085 169.42274 curveto
278.82519 169.53277 278.83715 169.66193 278.84673 169.81022 curveto
278.85629 169.95373 278.86107 170.09724 278.86108 170.24074 curveto
278.86108 175.37117 lineto
277.5121 175.37117 lineto
277.5121 170.8076 lineto
277.51209 170.45362 277.49535 170.11876 277.46187 169.80304 curveto
277.43316 169.48254 277.36858 169.22662 277.26813 169.03527 curveto
277.1581 168.82958 277.00024 168.6765 276.79455 168.57604 curveto
276.58885 168.47081 276.29227 168.41819 275.9048 168.41818 curveto
275.53646 168.41819 275.16573 168.50908 274.79261 168.69085 curveto
274.42427 168.87263 274.05593 169.10464 273.6876 169.38687 curveto
273.6876 175.37117 lineto
272.33862 175.37117 lineto
272.33862 167.35622 lineto
273.6876 167.35622 lineto
273.6876 168.24597 lineto
274.10855 167.89678 274.52712 167.62411 274.94329 167.42797 curveto
275.36425 167.23185 275.81152 167.13379 276.2851 167.13378 curveto
276.83043 167.13379 277.29204 167.2486 277.66996 167.4782 curveto
278.05264 167.70782 278.33726 168.02593 278.52383 168.43253 curveto
279.06916 167.97331 279.56665 167.64324 280.01632 167.44232 curveto
280.46597 167.23664 280.94672 167.13379 281.45858 167.13378 curveto
282.33876 167.13379 282.98694 167.40167 283.40312 167.93743 curveto
283.82407 168.46842 284.03455 169.21227 284.03456 170.16899 curveto
284.03456 175.37117 lineto
fill
grestore
gsave
0 0 0 setrgbcolor
newpath
293.68551 171.26683 moveto
293.6855 171.9174 293.59222 172.51296 293.40567 173.05351 curveto
293.2191 173.58927 292.956 174.04372 292.61637 174.41684 curveto
292.30064 174.77083 291.92752 175.04588 291.497 175.24201 curveto
291.07126 175.43336 290.6192 175.52903 290.14085 175.52903 curveto
289.72467 175.52903 289.34676 175.48358 289.00713 175.3927 curveto
288.67227 175.30181 288.33025 175.16069 287.98104 174.96935 curveto
287.98104 178.32745 lineto
286.63206 178.32745 lineto
286.63206 167.35622 lineto
287.98104 167.35622 lineto
287.98104 168.19574 lineto
288.33981 167.89438 288.74164 167.64324 289.18652 167.44232 curveto
289.63617 167.23664 290.11453 167.13379 290.6216 167.13378 curveto
291.58789 167.13379 292.33891 167.49974 292.87469 168.23162 curveto
293.41523 168.95874 293.6855 169.97047 293.68551 171.26683 curveto
292.29348 171.3027 moveto
292.29347 170.33642 292.12843 169.61409 291.79837 169.13573 curveto
291.4683 168.65737 290.96123 168.41819 290.27718 168.41818 curveto
289.8897 168.41819 289.49984 168.5019 289.10759 168.66932 curveto
288.71533 168.83676 288.33981 169.0568 287.98104 169.32946 curveto
287.98104 173.87151 lineto
288.36373 174.04372 288.69141 174.16092 288.96408 174.2231 curveto
289.24152 174.28529 289.55485 174.31638 289.90406 174.31638 curveto
290.65508 174.31638 291.24107 174.06285 291.66204 173.55579 curveto
292.08299 173.04873 292.29347 172.2977 292.29348 171.3027 curveto
fill
grestore
gsave
0 0 0 setrgbcolor
newpath
297.15124 175.37117 moveto
295.80226 175.37117 lineto
295.80226 164.20621 lineto
297.15124 164.20621 lineto
297.15124 175.37117 lineto
fill
grestore
gsave
0 0 0 setrgbcolor
newpath
306.48647 171.50362 moveto
300.58109 171.50362 lineto
300.58109 171.99633 300.65523 172.42686 300.80353 172.79519 curveto
300.95182 173.15875 301.15512 173.45773 301.41344 173.69212 curveto
301.66218 173.92174 301.95638 174.09395 302.29602 174.20875 curveto
302.64043 174.32356 303.01834 174.38096 303.42973 174.38096 curveto
303.97506 174.38096 304.52279 174.27333 305.07291 174.05807 curveto
305.6278 173.83802 306.02245 173.62276 306.25685 173.41228 curveto
306.32861 173.41228 lineto
306.32861 174.88324 lineto
305.87416 175.07459 305.41015 175.23484 304.93657 175.36399 curveto
304.46299 175.49315 303.96549 175.55773 303.44409 175.55773 curveto
302.11424 175.55773 301.07619 175.19896 300.32995 174.48142 curveto
299.58371 173.75909 299.21058 172.7354 299.21058 171.41034 curveto
299.21058 170.09963 299.56696 169.05919 300.27972 168.28903 curveto
300.99726 167.51887 301.93963 167.13379 303.10684 167.13378 curveto
304.18793 167.13379 305.02028 167.44951 305.60389 168.08094 curveto
306.19227 168.71238 306.48646 169.60931 306.48647 170.77172 curveto
306.48647 171.50362 lineto
305.17336 170.47035 moveto
305.16857 169.76238 304.98919 169.21466 304.63521 168.82718 curveto
304.286 168.43972 303.75262 168.24598 303.03509 168.24597 curveto
302.31276 168.24598 301.73633 168.45885 301.30581 168.88459 curveto
300.88006 169.31033 300.63849 169.83892 300.58109 170.47035 curveto
305.17336 170.47035 lineto
fill
grestore
gsave
0 0 0 setrgbcolor
newpath
310.73432 175.37117 moveto
309.01939 175.37117 lineto
309.01939 173.32617 lineto
310.73432 173.32617 lineto
310.73432 175.37117 lineto
fill
grestore
gsave
0 0 0 setrgbcolor
newpath
320.70099 171.36728 moveto
320.70098 172.67321 320.36612 173.70408 319.69643 174.45989 curveto
319.02671 175.2157 318.12979 175.59361 317.00564 175.59361 curveto
315.87192 175.59361 314.97021 175.2157 314.30051 174.45989 curveto
313.63558 173.70408 313.30312 172.67321 313.30312 171.36728 curveto
313.30312 170.06136 313.63558 169.03049 314.30051 168.27467 curveto
314.97021 167.51409 315.87192 167.13379 317.00564 167.13378 curveto
318.12979 167.13379 319.02671 167.51409 319.69643 168.27467 curveto
320.36612 169.03049 320.70098 170.06136 320.70099 171.36728 curveto
319.30895 171.36728 moveto
319.30895 170.32924 319.10564 169.55908 318.69904 169.0568 curveto
318.29243 168.54974 317.72796 168.29621 317.00564 168.2962 curveto
316.27374 168.29621 315.70449 168.54974 315.29789 169.0568 curveto
314.89606 169.55908 314.69515 170.32924 314.69515 171.36728 curveto
314.69515 172.37185 314.89846 173.13483 315.30507 173.65624 curveto
315.71167 174.17288 316.27853 174.43119 317.00564 174.43119 curveto
317.72318 174.43119 318.28525 174.17527 318.69187 173.66342 curveto
319.10325 173.14679 319.30895 172.38141 319.30895 171.36728 curveto
fill
grestore
gsave
0 0 0 setrgbcolor
newpath
327.79748 168.82718 moveto
327.72572 168.82718 lineto
327.5248 168.77935 327.32867 168.74587 327.13734 168.72673 curveto
326.95077 168.70281 326.72833 168.69086 326.47002 168.69085 curveto
326.05384 168.69086 325.65202 168.78414 325.26455 168.97069 curveto
324.87707 169.15247 324.50395 169.38926 324.14518 169.68106 curveto
324.14518 175.37117 lineto
322.7962 175.37117 lineto
322.7962 167.35622 lineto
324.14518 167.35622 lineto
324.14518 168.54016 lineto
324.68095 168.10965 325.15213 167.80589 325.55874 167.62889 curveto
325.97013 167.44712 326.3887 167.35623 326.81444 167.35622 curveto
327.04883 167.35623 327.21865 167.3634 327.3239 167.37775 curveto
327.42913 167.38732 327.58699 167.40885 327.79748 167.44232 curveto
327.79748 168.82718 lineto
fill
grestore
gsave
0 0 0 setrgbcolor
newpath
335.58281 174.45989 moveto
335.58281 175.81844 335.27426 176.81582 334.65718 177.45204 curveto
334.04009 178.08826 333.09054 178.40637 331.80854 178.40638 curveto
331.38279 178.40637 330.96662 178.37528 330.56002 178.31309 curveto
330.15819 178.25569 329.76115 178.17198 329.3689 178.06195 curveto
329.3689 176.68427 lineto
329.44065 176.68427 lineto
329.66069 176.77038 330.0099 176.87562 330.48826 176.99999 curveto
330.96662 177.12915 331.44498 177.19373 331.92335 177.19373 curveto
332.38257 177.19373 332.76287 177.13871 333.06424 177.02869 curveto
333.3656 176.91867 333.6 176.76559 333.76743 176.56947 curveto
333.93485 176.3829 334.05444 176.15807 334.1262 175.89498 curveto
334.19795 175.63188 334.23383 175.33768 334.23383 175.0124 curveto
334.23383 174.28051 lineto
333.82722 174.60579 333.43736 174.84976 333.06424 175.0124 curveto
332.6959 175.17026 332.22471 175.24919 331.65068 175.24919 curveto
330.69395 175.24919 329.93336 174.90477 329.3689 174.21593 curveto
328.80921 173.5223 328.52937 172.54645 328.52937 171.28835 curveto
328.52937 170.59952 328.62504 170.00635 328.81639 169.50885 curveto
329.01252 169.00657 329.27801 168.57366 329.61286 168.2101 curveto
329.92379 167.87047 330.3017 167.60737 330.74658 167.4208 curveto
331.19145 167.22946 331.63393 167.13379 332.07403 167.13378 curveto
332.53804 167.13379 332.92551 167.18163 333.23645 167.27729 curveto
333.55216 167.36819 333.88462 167.5093 334.23383 167.70064 curveto
334.31994 167.35622 lineto
335.58281 167.35622 lineto
335.58281 174.45989 lineto
334.23383 173.16831 moveto
334.23383 168.79848 lineto
333.87506 168.63584 333.5402 168.52104 333.22927 168.45406 curveto
332.92312 168.38231 332.61697 168.34644 332.31082 168.34643 curveto
331.56936 168.34644 330.98576 168.59518 330.56002 169.09267 curveto
330.13427 169.59017 329.9214 170.3125 329.9214 171.25965 curveto
329.9214 172.15897 330.07926 172.84064 330.39498 173.30465 curveto
330.7107 173.76866 331.2345 174.00067 331.9664 174.00066 curveto
332.35865 174.00067 332.75091 173.92652 333.14317 173.77823 curveto
333.5402 173.62515 333.90376 173.42185 334.23383 173.16831 curveto
fill
grestore
grestore
gsave
0 0 0 setrgbcolor
newpath
171.17299 207.54076 moveto
166.45033 207.54076 lineto
166.45033 206.65013 lineto
168.26674 206.65013 lineto
168.26674 200.80247 lineto
166.45033 200.80247 lineto
166.45033 200.0056 lineto
166.69642 200.00561 166.9601 199.98608 167.24135 199.94701 curveto
167.5226 199.90405 167.73549 199.8435 167.88002 199.76537 curveto
168.0597 199.66772 168.20033 199.54467 168.3019 199.39622 curveto
168.40736 199.24389 168.46791 199.04076 168.48354 198.78685 curveto
169.39174 198.78685 lineto
169.39174 206.65013 lineto
171.17299 206.65013 lineto
171.17299 207.54076 lineto
fill
grestore
gsave
0 0 0 setrgbcolor
newpath
fill
grestore
gsave
0 0 0 setrgbcolor
newpath
183.23744 207.54076 moveto
182.13588 207.54076 lineto
182.13588 203.81419 lineto
182.13587 203.51342 182.1183 203.23217 182.08315 202.97044 curveto
182.04798 202.70482 181.98353 202.49779 181.88979 202.34935 curveto
181.79212 202.18529 181.6515 202.0642 181.46791 201.98607 curveto
181.28431 201.90404 181.04603 201.86303 180.75307 201.86302 curveto
180.45228 201.86303 180.13783 201.93725 179.80971 202.08568 curveto
179.48158 202.23412 179.16713 202.42357 178.86635 202.65404 curveto
178.86635 207.54076 lineto
177.76479 207.54076 lineto
177.76479 200.99583 lineto
178.86635 200.99583 lineto
178.86635 201.7224 lineto
179.2101 201.43725 179.56556 201.21459 179.93275 201.05443 curveto
180.29994 200.89428 180.67689 200.8142 181.06361 200.81419 curveto
181.77064 200.8142 182.3097 201.02709 182.6808 201.45287 curveto
183.05189 201.87865 183.23744 202.49193 183.23744 203.29271 curveto
183.23744 207.54076 lineto
fill
grestore
gsave
0 0 0 setrgbcolor
newpath
190.83705 204.38255 moveto
186.01479 204.38255 lineto
186.01478 204.7849 186.07533 205.13646 186.19643 205.43724 curveto
186.31752 205.73412 186.48353 205.97826 186.69447 206.16966 curveto
186.8976 206.35716 187.13783 206.49779 187.41518 206.59154 curveto
187.69642 206.68529 188.00502 206.73216 188.34096 206.73216 curveto
188.78627 206.73216 189.23353 206.64427 189.68275 206.46849 curveto
190.13587 206.2888 190.45814 206.11302 190.64955 205.94115 curveto
190.70815 205.94115 lineto
190.70815 207.14232 lineto
190.33705 207.29857 189.95814 207.42943 189.57143 207.5349 curveto
189.1847 207.64037 188.77845 207.6931 188.35268 207.6931 curveto
187.26674 207.6931 186.41908 207.40013 185.80971 206.81419 curveto
185.20033 206.22435 184.89564 205.38841 184.89565 204.30638 curveto
184.89564 203.23607 185.18666 202.38646 185.76869 201.75755 curveto
186.35463 201.12865 187.12416 200.8142 188.07729 200.81419 curveto
188.96009 200.8142 189.63978 201.07201 190.11635 201.58763 curveto
190.59681 202.10326 190.83704 202.83568 190.83705 203.7849 curveto
190.83705 204.38255 lineto
189.76479 203.5388 moveto
189.76087 202.96068 189.61439 202.51342 189.32533 202.19701 curveto
189.04017 201.88061 188.60463 201.7224 188.01869 201.7224 curveto
187.42885 201.7224 186.95814 201.89623 186.60658 202.24388 curveto
186.25892 202.59154 186.06166 203.02318 186.01479 203.5388 curveto
189.76479 203.5388 lineto
fill
grestore
gsave
0 0 0 setrgbcolor
newpath
200.7394 200.99583 moveto
199.03432 207.54076 lineto
198.01479 207.54076 lineto
196.33315 202.49583 lineto
194.66322 207.54076 lineto
193.64955 207.54076 lineto
191.9269 200.99583 lineto
193.07533 200.99583 lineto
194.2765 206.06419 lineto
195.91127 200.99583 lineto
196.81947 200.99583 lineto
198.49525 206.06419 lineto
199.63197 200.99583 lineto
200.7394 200.99583 lineto
fill
grestore
gsave
0 0 0 setrgbcolor
newpath
fill
grestore
gsave
0 0 0 setrgbcolor
newpath
216.09682 207.54076 moveto
214.99525 207.54076 lineto
214.99525 203.81419 lineto
214.99524 203.53295 214.98157 203.26146 214.95424 202.99974 curveto
214.93079 202.73803 214.87806 202.52904 214.79604 202.37279 curveto
214.70618 202.20482 214.57728 202.07787 214.40932 201.99193 curveto
214.24134 201.906 213.99915 201.86303 213.68275 201.86302 curveto
213.37415 201.86303 213.06556 201.94115 212.75697 202.0974 curveto
212.44837 202.24975 212.13978 202.44506 211.83119 202.68333 curveto
211.8429 202.77318 211.85267 202.87865 211.86049 202.99974 curveto
211.86829 203.11693 211.8722 203.23412 211.87221 203.3513 curveto
211.87221 207.54076 lineto
210.77065 207.54076 lineto
210.77065 203.81419 lineto
210.77064 203.52514 210.75697 203.2517 210.72963 202.99388 curveto
210.70619 202.73217 210.65345 202.52318 210.57143 202.36693 curveto
210.48158 202.19896 210.35267 202.07396 210.18471 201.99193 curveto
210.01673 201.906 209.77455 201.86303 209.45815 201.86302 curveto
209.15736 201.86303 208.85463 201.93725 208.54994 202.08568 curveto
208.24916 202.23412 207.94838 202.42357 207.6476 202.65404 curveto
207.6476 207.54076 lineto
206.54604 207.54076 lineto
206.54604 200.99583 lineto
207.6476 200.99583 lineto
207.6476 201.7224 lineto
207.99135 201.43725 208.33314 201.21459 208.67299 201.05443 curveto
209.01674 200.89428 209.38197 200.8142 209.76869 200.81419 curveto
210.214 200.8142 210.59095 200.90795 210.89955 201.09544 curveto
211.21205 201.28295 211.44447 201.54272 211.59682 201.87474 curveto
212.04212 201.49975 212.44837 201.23022 212.81557 201.06615 curveto
213.18275 200.89818 213.57532 200.8142 213.9933 200.81419 curveto
214.71204 200.8142 215.24134 201.03295 215.58119 201.47044 curveto
215.92493 201.90404 216.09681 202.51146 216.09682 203.29271 curveto
216.09682 207.54076 lineto
fill
grestore
gsave
0 0 0 setrgbcolor
newpath
223.69643 204.38255 moveto
218.87416 204.38255 lineto
218.87416 204.7849 218.93471 205.13646 219.0558 205.43724 curveto
219.17689 205.73412 219.34291 205.97826 219.55385 206.16966 curveto
219.75697 206.35716 219.9972 206.49779 220.27455 206.59154 curveto
220.5558 206.68529 220.86439 206.73216 221.20033 206.73216 curveto
221.64564 206.73216 222.09291 206.64427 222.54213 206.46849 curveto
222.99525 206.2888 223.31751 206.11302 223.50893 205.94115 curveto
223.56752 205.94115 lineto
223.56752 207.14232 lineto
223.19642 207.29857 222.81751 207.42943 222.4308 207.5349 curveto
222.04408 207.64037 221.63783 207.6931 221.21205 207.6931 curveto
220.12611 207.6931 219.27846 207.40013 218.66908 206.81419 curveto
218.05971 206.22435 217.75502 205.38841 217.75502 204.30638 curveto
217.75502 203.23607 218.04603 202.38646 218.62807 201.75755 curveto
219.214 201.12865 219.98353 200.8142 220.93666 200.81419 curveto
221.81947 200.8142 222.49916 201.07201 222.97572 201.58763 curveto
223.45619 202.10326 223.69642 202.83568 223.69643 203.7849 curveto
223.69643 204.38255 lineto
222.62416 203.5388 moveto
222.62025 202.96068 222.47376 202.51342 222.18471 202.19701 curveto
221.89955 201.88061 221.464 201.7224 220.87807 201.7224 curveto
220.28822 201.7224 219.81752 201.89623 219.46596 202.24388 curveto
219.1183 202.59154 218.92103 203.02318 218.87416 203.5388 curveto
222.62416 203.5388 lineto
fill
grestore
gsave
0 0 0 setrgbcolor
newpath
230.04213 205.65404 moveto
230.04212 206.2517 229.79408 206.74193 229.29799 207.12474 curveto
228.8058 207.50755 228.13197 207.69896 227.2765 207.69896 curveto
226.79213 207.69896 226.34681 207.64232 225.94057 207.52904 curveto
225.53822 207.41185 225.20033 207.2849 224.9269 207.14818 curveto
224.9269 205.91185 lineto
224.98549 205.91185 lineto
225.33314 206.17357 225.71986 206.38255 226.14565 206.5388 curveto
226.57142 206.69115 226.97963 206.76732 227.37025 206.76732 curveto
227.85463 206.76732 228.23353 206.68919 228.50697 206.53294 curveto
228.78041 206.37669 228.91712 206.1306 228.91713 205.79466 curveto
228.91712 205.53685 228.84291 205.34154 228.69447 205.20872 curveto
228.54603 205.07591 228.26088 204.96263 227.839 204.86888 curveto
227.68275 204.83373 227.47767 204.79271 227.22377 204.74583 curveto
226.97377 204.69896 226.74525 204.64818 226.53822 204.59349 curveto
225.964 204.44115 225.5558 204.21849 225.31361 203.92552 curveto
225.07533 203.62865 224.95619 203.26537 224.95619 202.83568 curveto
224.95619 202.56615 225.01088 202.31225 225.12025 202.07396 curveto
225.23353 201.83568 225.40346 201.62279 225.63002 201.43529 curveto
225.84877 201.2517 226.12611 201.10717 226.46205 201.00169 curveto
226.80189 200.89233 227.1808 200.83764 227.59877 200.83763 curveto
227.98939 200.83764 228.38392 200.88647 228.78236 200.98412 curveto
229.1847 201.07787 229.51869 201.19311 229.78432 201.32982 curveto
229.78432 202.50755 lineto
229.72572 202.50755 lineto
229.44447 202.30053 229.10267 202.1267 228.70033 201.98607 curveto
228.29798 201.84154 227.90345 201.76928 227.51674 201.76927 curveto
227.11439 201.76928 226.77455 201.8474 226.49721 202.00365 curveto
226.21986 202.156 226.08119 202.38451 226.08119 202.68919 curveto
226.08119 202.95873 226.16517 203.16185 226.33315 203.29857 curveto
226.49721 203.43529 226.76283 203.54662 227.13002 203.63255 curveto
227.33314 203.67943 227.5597 203.72631 227.80971 203.77318 curveto
228.06361 203.82006 228.27455 203.86303 228.44252 203.90208 curveto
228.95423 204.01928 229.34877 204.22045 229.62611 204.5056 curveto
229.90345 204.79467 230.04212 205.17748 230.04213 205.65404 curveto
fill
grestore
gsave
0 0 0 setrgbcolor
newpath
236.29994 205.65404 moveto
236.29994 206.2517 236.05189 206.74193 235.5558 207.12474 curveto
235.06361 207.50755 234.38978 207.69896 233.53432 207.69896 curveto
233.04994 207.69896 232.60463 207.64232 232.19838 207.52904 curveto
231.79603 207.41185 231.45814 207.2849 231.18471 207.14818 curveto
231.18471 205.91185 lineto
231.2433 205.91185 lineto
231.59096 206.17357 231.97767 206.38255 232.40346 206.5388 curveto
232.82924 206.69115 233.23744 206.76732 233.62807 206.76732 curveto
234.11244 206.76732 234.49134 206.68919 234.76479 206.53294 curveto
235.03822 206.37669 235.17494 206.1306 235.17494 205.79466 curveto
235.17494 205.53685 235.10072 205.34154 234.95229 205.20872 curveto
234.80384 205.07591 234.51869 204.96263 234.09682 204.86888 curveto
233.94056 204.83373 233.73549 204.79271 233.48158 204.74583 curveto
233.23158 204.69896 233.00306 204.64818 232.79604 204.59349 curveto
232.22182 204.44115 231.81361 204.21849 231.57143 203.92552 curveto
231.33314 203.62865 231.214 203.26537 231.214 202.83568 curveto
231.214 202.56615 231.26869 202.31225 231.37807 202.07396 curveto
231.49135 201.83568 231.66127 201.62279 231.88783 201.43529 curveto
232.10658 201.2517 232.38392 201.10717 232.71986 201.00169 curveto
233.05971 200.89233 233.43861 200.83764 233.85658 200.83763 curveto
234.2472 200.83764 234.64173 200.88647 235.04018 200.98412 curveto
235.44252 201.07787 235.7765 201.19311 236.04213 201.32982 curveto
236.04213 202.50755 lineto
235.98354 202.50755 lineto
235.70228 202.30053 235.36048 202.1267 234.95815 201.98607 curveto
234.5558 201.84154 234.16127 201.76928 233.77455 201.76927 curveto
233.3722 201.76928 233.03236 201.8474 232.75502 202.00365 curveto
232.47767 202.156 232.339 202.38451 232.339 202.68919 curveto
232.339 202.95873 232.42299 203.16185 232.59096 203.29857 curveto
232.75502 203.43529 233.02064 203.54662 233.38783 203.63255 curveto
233.59095 203.67943 233.81752 203.72631 234.06752 203.77318 curveto
234.32142 203.82006 234.53236 203.86303 234.70033 203.90208 curveto
235.21205 204.01928 235.60658 204.22045 235.88393 204.5056 curveto
236.16126 204.79467 236.29994 205.17748 236.29994 205.65404 curveto
fill
grestore
gsave
0 0 0 setrgbcolor
newpath
242.96791 207.54076 moveto
241.87221 207.54076 lineto
241.87221 206.84349 lineto
241.77455 206.9099 241.64173 207.00365 241.47377 207.12474 curveto
241.3097 207.24193 241.14955 207.33568 240.9933 207.40599 curveto
240.8097 207.49583 240.59877 207.57005 240.36049 207.62865 curveto
240.1222 207.69115 239.84291 207.7224 239.5226 207.7224 curveto
238.93275 207.7224 238.43275 207.52708 238.0226 207.13646 curveto
237.61244 206.74584 237.40736 206.24779 237.40736 205.64232 curveto
237.40736 205.14623 237.51283 204.74584 237.72377 204.44115 curveto
237.93861 204.13256 238.2433 203.89037 238.63783 203.71458 curveto
239.03627 203.53881 239.51478 203.41967 240.07338 203.35716 curveto
240.63197 203.29467 241.23158 203.24779 241.87221 203.21654 curveto
241.87221 203.04662 lineto
241.8722 202.79662 241.82728 202.58959 241.73744 202.42552 curveto
241.6515 202.26146 241.5265 202.13256 241.36244 202.0388 curveto
241.20619 201.94896 241.01869 201.88842 240.79994 201.85716 curveto
240.58119 201.82592 240.35267 201.81029 240.1144 201.81029 curveto
239.82533 201.81029 239.50306 201.84936 239.1476 201.92747 curveto
238.79213 202.0017 238.42494 202.11107 238.04604 202.2556 curveto
237.98744 202.2556 lineto
237.98744 201.13646 lineto
238.20228 201.07787 238.51283 201.01342 238.91908 200.9431 curveto
239.32533 200.87279 239.72572 200.83764 240.12025 200.83763 curveto
240.58119 200.83764 240.98158 200.8767 241.32143 200.95482 curveto
241.66517 201.02904 241.96205 201.15795 242.21205 201.34154 curveto
242.45814 201.52123 242.64564 201.75365 242.77455 202.0388 curveto
242.90345 202.32396 242.9679 202.67748 242.96791 203.09935 curveto
242.96791 207.54076 lineto
241.87221 205.92943 moveto
241.87221 204.10716 lineto
241.53627 204.1267 241.13978 204.15599 240.68275 204.19505 curveto
240.22963 204.23412 239.87025 204.29076 239.60463 204.36497 curveto
239.28822 204.45482 239.03236 204.59545 238.83705 204.78685 curveto
238.64174 204.97435 238.54408 205.23412 238.54408 205.56615 curveto
238.54408 205.94115 238.65736 206.22435 238.88393 206.41576 curveto
239.11049 206.60326 239.45619 206.69701 239.92104 206.69701 curveto
240.30775 206.69701 240.66127 206.62279 240.98158 206.47435 curveto
241.30189 206.32201 241.59877 206.14037 241.87221 205.92943 curveto
fill
grestore
gsave
0 0 0 setrgbcolor
newpath
250.40932 206.79662 moveto
250.40931 207.90599 250.15736 208.72044 249.65346 209.23997 curveto
249.14955 209.7595 248.37416 210.01927 247.32729 210.01927 curveto
246.97963 210.01927 246.63978 209.99388 246.30775 209.9431 curveto
245.97963 209.89622 245.65541 209.82786 245.3351 209.73802 curveto
245.3351 208.61302 lineto
245.39369 208.61302 lineto
245.57338 208.68333 245.85853 208.76927 246.24916 208.87083 curveto
246.63978 208.9763 247.03041 209.02904 247.42104 209.02904 curveto
247.79603 209.02904 248.10658 208.98411 248.35268 208.89427 curveto
248.59877 208.80443 248.79017 208.67943 248.9269 208.51927 curveto
249.06361 208.36693 249.16126 208.18333 249.21986 207.96849 curveto
249.27845 207.75365 249.30775 207.51341 249.30775 207.24779 curveto
249.30775 206.65013 lineto
248.97572 206.91576 248.65736 207.11498 248.35268 207.24779 curveto
248.05189 207.37669 247.66713 207.44115 247.19838 207.44115 curveto
246.41713 207.44115 245.79603 207.1599 245.3351 206.5974 curveto
244.87807 206.03099 244.64955 205.23412 244.64955 204.20677 curveto
244.64955 203.64428 244.72768 203.1599 244.88393 202.75365 curveto
245.04408 202.3435 245.26088 201.98998 245.53432 201.6931 curveto
245.78822 201.41576 246.09681 201.20092 246.4601 201.04857 curveto
246.82338 200.89233 247.1847 200.8142 247.54408 200.81419 curveto
247.92298 200.8142 248.23939 200.85326 248.4933 200.93138 curveto
248.75111 201.00561 249.02259 201.12084 249.30775 201.27708 curveto
249.37807 200.99583 lineto
250.40932 200.99583 lineto
250.40932 206.79662 lineto
249.30775 205.74193 moveto
249.30775 202.17357 lineto
249.01478 202.04076 248.74134 201.94701 248.48744 201.89232 curveto
248.23744 201.83373 247.98744 201.80443 247.73744 201.80443 curveto
247.13197 201.80443 246.65541 202.00756 246.30775 202.4138 curveto
245.9601 202.82006 245.78627 203.4099 245.78627 204.18333 curveto
245.78627 204.91771 245.91517 205.47435 246.17299 205.85326 curveto
246.4308 206.23216 246.85853 206.42162 247.45619 206.42162 curveto
247.7765 206.42162 248.09681 206.36107 248.41713 206.23997 curveto
248.74134 206.11498 249.03822 205.94896 249.30775 205.74193 curveto
fill
grestore
gsave
0 0 0 setrgbcolor
newpath
258.0558 204.38255 moveto
253.23354 204.38255 lineto
253.23353 204.7849 253.29408 205.13646 253.41518 205.43724 curveto
253.53627 205.73412 253.70228 205.97826 253.91322 206.16966 curveto
254.11635 206.35716 254.35658 206.49779 254.63393 206.59154 curveto
254.91517 206.68529 255.22377 206.73216 255.55971 206.73216 curveto
256.00502 206.73216 256.45228 206.64427 256.9015 206.46849 curveto
257.35462 206.2888 257.67689 206.11302 257.8683 205.94115 curveto
257.9269 205.94115 lineto
257.9269 207.14232 lineto
257.5558 207.29857 257.17689 207.42943 256.79018 207.5349 curveto
256.40345 207.64037 255.9972 207.6931 255.57143 207.6931 curveto
254.48549 207.6931 253.63783 207.40013 253.02846 206.81419 curveto
252.41908 206.22435 252.11439 205.38841 252.1144 204.30638 curveto
252.11439 203.23607 252.40541 202.38646 252.98744 201.75755 curveto
253.57338 201.12865 254.34291 200.8142 255.29604 200.81419 curveto
256.17884 200.8142 256.85853 201.07201 257.3351 201.58763 curveto
257.81556 202.10326 258.05579 202.83568 258.0558 203.7849 curveto
258.0558 204.38255 lineto
256.98354 203.5388 moveto
256.97962 202.96068 256.83314 202.51342 256.54408 202.19701 curveto
256.25892 201.88061 255.82338 201.7224 255.23744 201.7224 curveto
254.6476 201.7224 254.17689 201.89623 253.82533 202.24388 curveto
253.47767 202.59154 253.28041 203.02318 253.23354 203.5388 curveto
256.98354 203.5388 lineto
fill
grestore
grestore
showpage
