%!PS-Adobe-3.0 EPSF-3.0
%%Creator: ansi2ps, written by S.Fourmanoit, 2005.
%%LanguageLevel: 2
%%BoundingBox: 1 356 262 789
%%Pages: 1 0

%-------------------------------------------------
% Headers
%-------------------------------------------------
/Times-Roman findfont
%/System findfont
12 scalefont
setfont

/cr {
   currentpoint
   12 sub
   exch pop 0 exch
   moveto
} def
%-------------------------------------------------
% Content
%-------------------------------------------------

%%Page: 2 1
0 700 moveto
([ebuild  ) show
0 1 0 setrgbcolor
(N) show
0 0 0 setrgbcolor
(    ]  ) show
0 1 0 setrgbcolor
(sys-libs/glibc-2.3.4.20050125-r1) show
0 0 0 setrgbcolor
(  ) show
cr
([ebuild  ) show
0 1 0 setrgbcolor
(N) show
0 0 0 setrgbcolor
(    ]   ) show
0 1 0 setrgbcolor
(sys-apps/baselayout-1.9.4-r6) show
0 0 0 setrgbcolor
(  ) show
cr
([ebuild  ) show
0 1 0 setrgbcolor
(N) show
0 0 0 setrgbcolor
(    ]    ) show
0 1 0 setrgbcolor
(sys-apps/util-linux-2.12i-r1) show
0 0 0 setrgbcolor
(  ) show
cr
([ebuild  ) show
0 1 0 setrgbcolor
(N) show
0 0 0 setrgbcolor
(    ]     ) show
0 1 0 setrgbcolor
(sys-kernel/linux26-headers-2.6.8.1-r2) show
0 0 0 setrgbcolor
(  ) show
cr
([ebuild  ) show
0 1 0 setrgbcolor
(N) show
0 0 0 setrgbcolor
(    ]     ) show
0 1 0 setrgbcolor
(sys-fs/e2fsprogs-1.35-r1) show
0 0 0 setrgbcolor
(  ) show
cr
([ebuild  ) show
0 1 0 setrgbcolor
(N) show
0 0 0 setrgbcolor
(    ]    ) show
0 1 0 setrgbcolor
(sys-apps/gawk-3.1.3-r2) show
0 0 0 setrgbcolor
(  ) show
cr
([ebuild  ) show
0 1 0 setrgbcolor
(N) show
0 0 0 setrgbcolor
(    ] ) show
0 1 0 setrgbcolor
(sys-libs/libstdc++-v3-3.3.4) show
0 0 0 setrgbcolor
(  ) show
cr
([ebuild  ) show
0 1 0 setrgbcolor
(N) show
0 0 0 setrgbcolor
(    ]   ) show
0 1 0 setrgbcolor
(sys-devel/gcc-3.4.3.20050110) show
0 0 0 setrgbcolor
(  ) show
cr
([ebuild  ) show
0 1 0 setrgbcolor
(N) show
0 0 0 setrgbcolor
(    ]    ) show
0 1 0 setrgbcolor
(sys-devel/binutils-2.15.92.0.2-r1) show
0 0 0 setrgbcolor
(  ) show
cr
([ebuild  ) show
0 1 0 setrgbcolor
(N) show
0 0 0 setrgbcolor
(    ]    ) show
0 1 0 setrgbcolor
(sys-devel/gcc-config-1.3.10-r1) show
0 0 0 setrgbcolor
(  ) show
cr
([ebuild  ) show
0 1 0 setrgbcolor
(N) show
0 0 0 setrgbcolor
(    ]     ) show
0 1 0 setrgbcolor
(sys-apps/portage-2.0.51.19) show
0 0 0 setrgbcolor
(  ) show
cr
([ebuild  ) show
0 1 0 setrgbcolor
(N) show
0 0 0 setrgbcolor
(    ]      ) show
0 1 0 setrgbcolor
(dev-lang/python-2.4-r2) show
0 0 0 setrgbcolor
(  ) show
cr
([ebuild  ) show
0 1 0 setrgbcolor
(N) show
0 0 0 setrgbcolor
(    ]       ) show
0 1 0 setrgbcolor
(dev-libs/expat-1.95.8) show
0 0 0 setrgbcolor
(  ) show
cr
([ebuild  ) show
0 1 0 setrgbcolor
(N) show
0 0 0 setrgbcolor
(    ]       ) show
0 1 0 setrgbcolor
(dev-libs/openssl-0.9.7e) show
0 0 0 setrgbcolor
(  ) show
cr
([ebuild  ) show
0 1 0 setrgbcolor
(N) show
0 0 0 setrgbcolor
(    ]        ) show
0 1 0 setrgbcolor
(dev-lang/perl-5.8.5-r5) show
0 0 0 setrgbcolor
(  ) show
cr
([ebuild  ) show
0 1 0 setrgbcolor
(N) show
0 0 0 setrgbcolor
(    ]         ) show
0 1 0 setrgbcolor
(sys-devel/libperl-5.8.5) show
0 0 0 setrgbcolor
(  ) show
cr
([ebuild  ) show
0 1 0 setrgbcolor
(N) show
0 0 0 setrgbcolor
(    ]        ) show
0 1 0 setrgbcolor
(sys-apps/diffutils-2.8.7) show
0 0 0 setrgbcolor
(  ) show
cr
([ebuild  ) show
0 1 0 setrgbcolor
(N) show
0 0 0 setrgbcolor
(    ]        ) show
0 1 0 setrgbcolor
(sys-devel/bc-1.06-r6) show
0 0 0 setrgbcolor
(  ) show
cr
([ebuild  ) show
0 1 0 setrgbcolor
(N) show
0 0 0 setrgbcolor
(    ]         ) show
0 1 0 setrgbcolor
(sys-devel/flex-2.5.4a-r5) show
0 0 0 setrgbcolor
(  ) show
cr
([ebuild  ) show
0 1 0 setrgbcolor
(N) show
0 0 0 setrgbcolor
(    ]       ) show
0 1 0 setrgbcolor
(sys-libs/readline-4.3-r5) show
0 0 0 setrgbcolor
(  ) show
cr
([ebuild  ) show
0 1 0 setrgbcolor
(N) show
0 0 0 setrgbcolor
(    ]      ) show
0 1 0 setrgbcolor
(app-shells/bash-3.0-r8) show
0 0 0 setrgbcolor
(  ) show
cr
([ebuild  ) show
0 1 0 setrgbcolor
(N) show
0 0 0 setrgbcolor
(    ]      ) show
0 1 0 setrgbcolor
(sys-apps/debianutils-1.16.7-r4) show
0 0 0 setrgbcolor
(  ) show
cr
([ebuild  ) show
0 1 0 setrgbcolor
(N) show
0 0 0 setrgbcolor
(    ]       ) show
0 1 0 setrgbcolor
(app-arch/bzip2-1.0.2-r5) show
0 0 0 setrgbcolor
(  ) show
cr
([ebuild  ) show
0 1 0 setrgbcolor
(N) show
0 0 0 setrgbcolor
(    ]      ) show
0 1 0 setrgbcolor
(dev-python/python-fchksum-1.7.1) show
0 0 0 setrgbcolor
(  ) show
cr
([ebuild  ) show
0 1 0 setrgbcolor
(N) show
0 0 0 setrgbcolor
(    ]      ) show
0 1 0 setrgbcolor
(sys-apps/sed-4.0.9) show
0 0 0 setrgbcolor
(  ) show
cr
([ebuild  ) show
0 1 0 setrgbcolor
(N) show
0 0 0 setrgbcolor
(    ]    ) show
0 1 0 setrgbcolor
(sys-devel/bison-1.875d) show
0 0 0 setrgbcolor
(  ) show
cr
([ebuild  ) show
0 1 0 setrgbcolor
(N) show
0 0 0 setrgbcolor
(    ]     ) show
0 1 0 setrgbcolor
(sys-devel/m4-1.4.1) show
0 0 0 setrgbcolor
(  ) show
cr
([ebuild  ) show
0 1 0 setrgbcolor
(N) show
0 0 0 setrgbcolor
(    ] ) show
0 1 0 setrgbcolor
(sys-apps/man-pages-2.01) show
0 0 0 setrgbcolor
(  ) show
cr
([ebuild  ) show
0 1 0 setrgbcolor
(N) show
0 0 0 setrgbcolor
(    ]  ) show
0 1 0 setrgbcolor
(sys-apps/man-1.5p) show
0 0 0 setrgbcolor
(  ) show
cr
([ebuild  ) show
0 1 0 setrgbcolor
(N) show
0 0 0 setrgbcolor
(    ]   ) show
0 1 0 setrgbcolor
(sys-process/cronbase-0.3.1) show
0 0 0 setrgbcolor
(  ) show
cr
([ebuild  ) show
0 1 0 setrgbcolor
(N) show
0 0 0 setrgbcolor
(    ]   ) show
0 1 0 setrgbcolor
(sys-apps/groff-1.19.1-r2) show
0 0 0 setrgbcolor
(  ) show
cr
([ebuild  ) show
0 1 0 setrgbcolor
(N) show
0 0 0 setrgbcolor
(    ]    ) show
0 1 0 setrgbcolor
(sys-apps/texinfo-4.8) show
0 0 0 setrgbcolor
(  ) show
cr
([ebuild  ) show
0 1 0 setrgbcolor
(N) show
0 0 0 setrgbcolor
(    ]     ) show
0 1 0 setrgbcolor
(sys-devel/gettext-0.14.1) show
0 0 0 setrgbcolor
(  ) show
cr
([ebuild  ) show
0 1 0 setrgbcolor
(N) show
0 0 0 setrgbcolor
(    ]      ) show
0 1 0 setrgbcolor
(sys-devel/gnuconfig-20050223) show
0 0 0 setrgbcolor
(  ) show
cr
([ebuild  ) show
0 1 0 setrgbcolor
(N) show
0 0 0 setrgbcolor
(    ]     ) show
0 1 0 setrgbcolor
(sys-libs/ncurses-5.4-r5) show
0 0 0 setrgbcolor
(  ) show
cr
([ebuild  ) show
0 1 0 setrgbcolor
(N) show
0 0 0 setrgbcolor
(    ]      ) show
0 1 0 setrgbcolor
(sys-devel/patch-2.5.9) show
0 0 0 setrgbcolor
(  ) show
cr
() show

%%EOF
