default 0
timeout 5
splashimage=(cd)/boot/grub/splash.xpm.gz

title=ZeX/OS
root (cd)
kernel (cd)/boot/kernel.bin novesa

title=ZeX/OS (VESA)
setvbe 800x600x16
root (cd)
kernel (cd)/boot/kernel.bin

title=ZeX/OS (rescue)
root (cd)
kernel (cd)/boot/kernel.bin noata novesa noeth