newmtl Texture_0
Ka 1.000000 1.000000 1.000000
Kd 1.000000 1.000000 1.000000
Ks 0.000000 0.000000 0.000000
d 1
Ns 0.000000
illum 1
map_Kd SR_123dcatch_tex_0.jpg
newmtl Texture_1
Ka 1.000000 1.000000 1.000000
Kd 1.000000 1.000000 1.000000
Ks 0.000000 0.000000 0.000000
d 1
Ns 0.000000
illum 1
map_Kd SR_123dcatch_tex_1.jpg
newmtl Untextured
Ka 0.501961 0.501961 0.501961
Kd 0.501961 0.501961 0.501961
Ks 0.000000 0.000000 0.000000
d 1
Ns 0.000000
illum 1
