------------------------------------------------------------------
Require Date: 20100626
------------------------------------------------------------------

1：所有图片命名规则混乱，需要规范。
2：开机进入的要是上次断电的程序序号和数据，目前数据好像没有保存。
3：按F1进入标签编程，要求图片正好挡住列表框，同时图片右侧出现标签的图列
那F1 完成 F2 退出，放到下方。要求触摸和按F1,F2一样有效。
4：在最后一刀按向下箭头，回到第一刀。
5：列表框的箭头拖动，那光标要求一直在中间。
6：放大和缩写还有问题，缩小到最小，在回来有问题。
7：刀后尺寸最大字体选择还是太小。
8：列表框下方的进度条不要。
9：标签编程里面，标签长度，废边长度，最小可以输入0.01.
你现在不可以输入《1.
10：左掉头，右掉头，回掉头，3个标记是互斥的，不可以同时出现
已最后一个为标准。
11：推纸标记，刀标记，压纸标记也是互斥的，不可以同时出现。
已最后一个为标准。
12：删除标记没有作用
13：插入，修改完毕后，再次输入数据的话，输入框数据要自动清0
14：第一刀是不会有到标记的，如果本来是第二刀有的，删除一刀后
第二刀的刀标记要自动清除。
15：在编程画面下，手动画面下/0会死机。如果除0结果还是等于0.
16：F2等分编程里面，等分值最小可以输入0.01.
同理右侧出现图列。
17：程序选择画面右侧第一列是程序序号
1，2，。。。。
18：程序使用次数好像没有计数。
19：进入程序画面，光标应该显示刚进入的程序序号。目前没有。
20：计算器功能，如果除0显示###，要求结果是0
21：基准画面，要求光标闪烁，目前没有闪烁吗，还需要点击，
另外同理右侧显示图列。
22：手动画面下，F3是基准功能，你现在是F2呢，F2是机器保养的一些
图片。
23：自动画面下，还是无法修改数据。
24：自动画面下 ，右侧最下方图标是+，-，++，--，
++表示批量+,--表示批量减
比如，光标在第一刀
1：1000.00
2：900.00
3：800.00
4：850.00
如果输入2，按下--，那么就是
1：998.00
2：898.00
3：798.00
4：850.00，光标在第四刀位置。

25：手动画面和自动画面有步进功能
+1，-1，按钮
放在那里，你看看？？这个步进距离可以修改的。

26：程序名那里点击可以出现最近3次使用记录的，就算
没有名字点击也可以的。


27：参数设置那里，使用上下箭头可以选择
前极限
中极限
。。。

默认被选择的字体是红色的
你现在是上下箭头选择F1，F2，
F1,F2由客户自己按键选择就可以。
