------------------------------------------------------------------
Require Date: 20100601
------------------------------------------------------------------

1： 保存尺寸那里，我又思考了很久，你看这样做可以吗？每间隔1秒或2秒，判
    断列表框数据有否改变，如果有自动保存，没有就不保存。这样1万次写寿命
    怎么都够呢。

2： 现在是不是600个程序，每个程序1000刀尺寸？我记得以前好像是这样，可不
    可以把每个程序里面的尺寸，通过usb，保存到pc机上，这样上位机可以查
    看，修改，删除，还有打印。这样的话上位机是否需要一个上位机软件，另
    外上位机也可以编写一个程序，通过usb到pxa255上。我记得这个功能和你沟
    通过。这个功能还是要的。


3： 现在我做一套按钮和按钮的底图。那么我要允许经销商按照格式更换按钮或
    底图。

4： 里面字体可以有我更换。你要提供几种字体给我一下。极个别客户可能需要
    自己喜欢的字体。

5： 背景色（上面活页）可以更换，这个背景色，在不同模式下是不一样的。我
    们现在是一样。编程模式，自动模式。我看进口机是更换了上面活页的颜色。
    们这个活页颜色是否也可以更换，并开放给经销商更换。
