\relax 
\catcode`"\active
\select@language{portuguese}
\@writefile{toc}{\select@language{portuguese}}
\@writefile{lof}{\select@language{portuguese}}
\@writefile{lot}{\select@language{portuguese}}
\@writefile{toc}{\contentsline {chapter}{\numberline {1}Introdu\IeC {\c c}\IeC {\~a}o}{3}}
\@writefile{toc}{\contentsline {chapter}{\numberline {2}Metodologia Empregada}{4}}
\newlabel{secmet}{{2}{4}}
\@writefile{toc}{\contentsline {chapter}{\numberline {3}Descri\IeC {\c c}\IeC {\~a}o da Plataforma Experimental}{5}}
\@writefile{toc}{\contentsline {section}{\numberline {3.1}Cliente}{5}}
\@writefile{toc}{\contentsline {section}{\numberline {3.2}Servidor}{5}}
\@writefile{toc}{\contentsline {chapter}{\numberline {4}An\IeC {\'a}lise}{7}}
\@writefile{toc}{\contentsline {section}{\numberline {4.1}Facilidade de Implementa\IeC {\c c}\IeC {\~a}o}{7}}
\@writefile{toc}{\contentsline {section}{\numberline {4.2}Facilidade de Uso}{7}}
\@writefile{toc}{\contentsline {section}{\numberline {4.3}Desempenho}{7}}
\newlabel{tabconf}{{4.3}{7}}
\@writefile{lot}{\contentsline {table}{\numberline {4.1}{\ignorespaces M\IeC {\'e}dia, Desvio Padr\IeC {\~a}o e Intervalo de Confian\IeC {\c c}a de cada um dos m\IeC {\'e}todos (em ns.)}}{7}}
\@writefile{toc}{\contentsline {section}{\numberline {4.4}Compara\IeC {\c c}\IeC {\~a}o Qualitativa}{8}}
\newlabel{tabqual}{{4.4}{8}}
\@writefile{lot}{\contentsline {table}{\numberline {4.2}{\ignorespaces Compara\IeC {\c c}\IeC {\~a}o qualitativa das abordagens}}{8}}
\@writefile{toc}{\contentsline {section}{\numberline {4.5}Discuss\IeC {\~a}o}{8}}
\@writefile{toc}{\contentsline {chapter}{\numberline {5}Principais Problemas Encontrados}{9}}
\newlabel{problemas}{{5}{9}}
\@writefile{toc}{\contentsline {chapter}{\numberline {6}Conclus\IeC {\~a}o}{10}}
