a:84:{i:0;a:3:{i:0;s:14:"document_start";i:1;a:0:{}i:2;i:0;}i:1;a:3:{i:0;s:6:"p_open";i:1;a:0:{}i:2;i:0;}i:2;a:3:{i:0;s:7:"p_close";i:1;a:0:{}i:2;i:1;}i:3;a:3:{i:0;s:12:"section_edit";i:1;a:4:{i:0;i:-1;i:1;i:0;i:2;i:1;i:3;s:0:"";}i:2;i:1;}i:4;a:3:{i:0;s:6:"header";i:1;a:3:{i:0;s:38:"Ata da Reunião de 01 de julho de 2008";i:1;i:1;i:2;i:1;}i:2;i:1;}i:5;a:3:{i:0;s:12:"section_open";i:1;a:1:{i:0;i:1;}i:2;i:1;}i:6;a:3:{i:0;s:10:"listu_open";i:1;a:0:{}i:2;i:54;}i:7;a:3:{i:0;s:13:"listitem_open";i:1;a:1:{i:0;i:1;}i:2;i:54;}i:8;a:3:{i:0;s:16:"listcontent_open";i:1;a:0:{}i:2;i:54;}i:9;a:3:{i:0;s:5:"cdata";i:1;a:1:{i:0;s:86:" Presentes: Antônio, Bruno,Felipe, Gabriel, Kauê, Leonardo, Lucas, Marcela, Matheus.";}i:2;i:58;}i:10;a:3:{i:0;s:17:"listcontent_close";i:1;a:0:{}i:2;i:144;}i:11;a:3:{i:0;s:14:"listitem_close";i:1;a:0:{}i:2;i:144;}i:12;a:3:{i:0;s:13:"listitem_open";i:1;a:1:{i:0;i:1;}i:2;i:144;}i:13;a:3:{i:0;s:16:"listcontent_open";i:1;a:0:{}i:2;i:144;}i:14;a:3:{i:0;s:5:"cdata";i:1;a:1:{i:0;s:26:" Ausentes: Dante (Canadá)";}i:2;i:148;}i:15;a:3:{i:0;s:17:"listcontent_close";i:1;a:0:{}i:2;i:174;}i:16;a:3:{i:0;s:14:"listitem_close";i:1;a:0:{}i:2;i:174;}i:17;a:3:{i:0;s:11:"listu_close";i:1;a:0:{}i:2;i:174;}i:18;a:3:{i:0;s:10:"listu_open";i:1;a:0:{}i:2;i:175;}i:19;a:3:{i:0;s:13:"listitem_open";i:1;a:1:{i:0;i:1;}i:2;i:175;}i:20;a:3:{i:0;s:16:"listcontent_open";i:1;a:0:{}i:2;i:175;}i:21;a:3:{i:0;s:5:"cdata";i:1;a:1:{i:0;s:17:" Relator: Matheus";}i:2;i:179;}i:22;a:3:{i:0;s:17:"listcontent_close";i:1;a:0:{}i:2;i:196;}i:23;a:3:{i:0;s:14:"listitem_close";i:1;a:0:{}i:2;i:196;}i:24;a:3:{i:0;s:11:"listu_close";i:1;a:0:{}i:2;i:196;}i:25;a:3:{i:0;s:13:"section_close";i:1;a:0:{}i:2;i:198;}i:26;a:3:{i:0;s:12:"section_edit";i:1;a:4:{i:0;i:1;i:1;i:197;i:2;i:1;i:3;s:38:"Ata da Reunião de 01 de julho de 2008";}i:2;i:198;}i:27;a:3:{i:0;s:6:"header";i:1;a:3:{i:0;s:42:"1. Detalhes sobre verba do RoboEDU (Bruno)";i:1;i:2;i:2;i:198;}i:2;i:198;}i:28;a:3:{i:0;s:12:"section_open";i:1;a:1:{i:0;i:2;}i:2;i:198;}i:29;a:3:{i:0;s:6:"p_open";i:1;a:0:{}i:2;i:252;}i:30;a:3:{i:0;s:5:"cdata";i:1;a:1:{i:0;s:194:"
O Bruno tem detalhes sobre os gastos da verba do RoboEDU. Ele já analisou boa parte, mas ainda não tudo. Disse que alguns gastos dizem de quem foi e quanto foi, mas não diz no que foi gasto.";}i:2;i:253;}i:31;a:3:{i:0;s:7:"p_close";i:1;a:0:{}i:2;i:447;}i:32;a:3:{i:0;s:13:"section_close";i:1;a:0:{}i:2;i:449;}i:33;a:3:{i:0;s:12:"section_edit";i:1;a:4:{i:0;i:198;i:1;i:448;i:2;i:2;i:3;s:42:"1. Detalhes sobre verba do RoboEDU (Bruno)";}i:2;i:449;}i:34;a:3:{i:0;s:6:"header";i:1;a:3:{i:0;s:40:"2. COBRANÇA -&gt; ônibus SULPET (Mizu)";i:1;i:2;i:2;i:449;}i:2;i:449;}i:35;a:3:{i:0;s:12:"section_open";i:1;a:1:{i:0;i:2;}i:2;i:449;}i:36;a:3:{i:0;s:6:"p_open";i:1;a:0:{}i:2;i:501;}i:37;a:3:{i:0;s:5:"cdata";i:1;a:1:{i:0;s:76:"
O Mizu disse que o Antônio, Arthur e Marcela ainda não pagaram o ônibus.";}i:2;i:502;}i:38;a:3:{i:0;s:7:"p_close";i:1;a:0:{}i:2;i:578;}i:39;a:3:{i:0;s:13:"section_close";i:1;a:0:{}i:2;i:580;}i:40;a:3:{i:0;s:12:"section_edit";i:1;a:4:{i:0;i:449;i:1;i:579;i:2;i:2;i:3;s:40:"2. COBRANÇA -&gt; ônibus SULPET (Mizu)";}i:2;i:580;}i:41;a:3:{i:0;s:6:"header";i:1;a:3:{i:0;s:53:"3. Justificativa para falta na ultima reuniao (Bruno)";i:1;i:2;i:2;i:580;}i:2;i:580;}i:42;a:3:{i:0;s:12:"section_open";i:1;a:1:{i:0;i:2;}i:2;i:580;}i:43;a:3:{i:0;s:6:"p_open";i:1;a:0:{}i:2;i:645;}i:44;a:3:{i:0;s:5:"cdata";i:1;a:1:{i:0;s:141:"
Bruno: Ele teve prova antes e depois precisava acabar um trabalho para entregar no mesmo dia. Foi decidido que conta como falta justificada.";}i:2;i:646;}i:45;a:3:{i:0;s:7:"p_close";i:1;a:0:{}i:2;i:787;}i:46;a:3:{i:0;s:13:"section_close";i:1;a:0:{}i:2;i:789;}i:47;a:3:{i:0;s:12:"section_edit";i:1;a:4:{i:0;i:580;i:1;i:788;i:2;i:2;i:3;s:53:"3. Justificativa para falta na ultima reuniao (Bruno)";}i:2;i:789;}i:48;a:3:{i:0;s:6:"header";i:1;a:3:{i:0;s:45:"Extra: Antônio e as horas mínimas na semana";i:1;i:2;i:2;i:789;}i:2;i:789;}i:49;a:3:{i:0;s:12:"section_open";i:1;a:1:{i:0;i:2;}i:2;i:789;}i:50;a:3:{i:0;s:6:"p_open";i:1;a:0:{}i:2;i:846;}i:51;a:3:{i:0;s:5:"cdata";i:1;a:1:{i:0;s:181:"
O Antônio não cumpriu as 6 horas da semana na sala e fechou em casa. Como está era uma semana cheia pra todo mundo foi decidido que não será tomado nenhuma atitude a respeito.";}i:2;i:847;}i:52;a:3:{i:0;s:7:"p_close";i:1;a:0:{}i:2;i:1028;}i:53;a:3:{i:0;s:13:"section_close";i:1;a:0:{}i:2;i:1030;}i:54;a:3:{i:0;s:12:"section_edit";i:1;a:4:{i:0;i:789;i:1;i:1029;i:2;i:2;i:3;s:45:"Extra: Antônio e as horas mínimas na semana";}i:2;i:1030;}i:55;a:3:{i:0;s:6:"header";i:1;a:3:{i:0;s:24:"Extra: Bolsa da Rosália";i:1;i:2;i:2;i:1030;}i:2;i:1030;}i:56;a:3:{i:0;s:12:"section_open";i:1;a:1:{i:0;i:2;}i:2;i:1030;}i:57;a:3:{i:0;s:6:"p_open";i:1;a:0:{}i:2;i:1066;}i:58;a:3:{i:0;s:5:"cdata";i:1;a:1:{i:0;s:96:"
A Rosália precisa ser desligada o mais rápido possível para ela poder se inscrever em outra.";}i:2;i:1067;}i:59;a:3:{i:0;s:7:"p_close";i:1;a:0:{}i:2;i:1163;}i:60;a:3:{i:0;s:13:"section_close";i:1;a:0:{}i:2;i:1165;}i:61;a:3:{i:0;s:12:"section_edit";i:1;a:4:{i:0;i:1030;i:1;i:1164;i:2;i:2;i:3;s:24:"Extra: Bolsa da Rosália";}i:2;i:1165;}i:62;a:3:{i:0;s:6:"header";i:1;a:3:{i:0;s:9:"Extra: IA";i:1;i:2;i:2;i:1165;}i:2;i:1165;}i:63;a:3:{i:0;s:12:"section_open";i:1;a:1:{i:0;i:2;}i:2;i:1165;}i:64;a:3:{i:0;s:6:"p_open";i:1;a:0:{}i:2;i:1186;}i:65;a:3:{i:0;s:5:"cdata";i:1;a:1:{i:0;s:40:"
Reunião próxima terça, 08/07, 12:30.";}i:2;i:1187;}i:66;a:3:{i:0;s:7:"p_close";i:1;a:0:{}i:2;i:1227;}i:67;a:3:{i:0;s:13:"section_close";i:1;a:0:{}i:2;i:1229;}i:68;a:3:{i:0;s:12:"section_edit";i:1;a:4:{i:0;i:1165;i:1;i:1228;i:2;i:2;i:3;s:9:"Extra: IA";}i:2;i:1229;}i:69;a:3:{i:0;s:6:"header";i:1;a:3:{i:0;s:41:"Extra: Seminário de Sistema de Extensão";i:1;i:2;i:2;i:1229;}i:2;i:1229;}i:70;a:3:{i:0;s:12:"section_open";i:1;a:1:{i:0;i:2;}i:2;i:1229;}i:71;a:3:{i:0;s:6:"p_open";i:1;a:0:{}i:2;i:1282;}i:72;a:3:{i:0;s:5:"cdata";i:1;a:1:{i:0;s:35:"
O Mizu vai fazer um para os novos.";}i:2;i:1283;}i:73;a:3:{i:0;s:7:"p_close";i:1;a:0:{}i:2;i:1318;}i:74;a:3:{i:0;s:13:"section_close";i:1;a:0:{}i:2;i:1320;}i:75;a:3:{i:0;s:12:"section_edit";i:1;a:4:{i:0;i:1229;i:1;i:1319;i:2;i:2;i:3;s:41:"Extra: Seminário de Sistema de Extensão";}i:2;i:1320;}i:76;a:3:{i:0;s:6:"header";i:1;a:3:{i:0;s:43:"4. Ação para salão de Extensão (Felipe)";i:1;i:2;i:2;i:1320;}i:2;i:1320;}i:77;a:3:{i:0;s:12:"section_open";i:1;a:1:{i:0;i:2;}i:2;i:1320;}i:78;a:3:{i:0;s:6:"p_open";i:1;a:0:{}i:2;i:1375;}i:79;a:3:{i:0;s:5:"cdata";i:1;a:1:{i:0;s:182:"
O Felipe pediu para decidirem o que será apresentado no salão de Extensão. Para isso é necessário escolher alguma ação que está no sistema. Ele fará sobre o curso de linux.";}i:2;i:1376;}i:80;a:3:{i:0;s:7:"p_close";i:1;a:0:{}i:2;i:1558;}i:81;a:3:{i:0;s:13:"section_close";i:1;a:0:{}i:2;i:1559;}i:82;a:3:{i:0;s:12:"section_edit";i:1;a:4:{i:0;i:1320;i:1;i:0;i:2;i:2;i:3;s:43:"4. Ação para salão de Extensão (Felipe)";}i:2;i:1559;}i:83;a:3:{i:0;s:12:"document_end";i:1;a:0:{}i:2;i:1559;}}