a:161:{i:0;a:3:{i:0;s:14:"document_start";i:1;a:0:{}i:2;i:0;}i:1;a:3:{i:0;s:6:"p_open";i:1;a:0:{}i:2;i:0;}i:2;a:3:{i:0;s:11:"strong_open";i:1;a:0:{}i:2;i:1;}i:3;a:3:{i:0;s:5:"cdata";i:1;a:1:{i:0;s:5:"Data:";}i:2;i:3;}i:4;a:3:{i:0;s:12:"strong_close";i:1;a:0:{}i:2;i:8;}i:5;a:3:{i:0;s:5:"cdata";i:1;a:1:{i:0;s:10:" 06/01/05 ";}i:2;i:10;}i:6;a:3:{i:0;s:11:"strong_open";i:1;a:0:{}i:2;i:20;}i:7;a:3:{i:0;s:5:"cdata";i:1;a:1:{i:0;s:8:"Relator:";}i:2;i:22;}i:8;a:3:{i:0;s:12:"strong_close";i:1;a:0:{}i:2;i:30;}i:9;a:3:{i:0;s:5:"cdata";i:1;a:1:{i:0;s:8:" Robert ";}i:2;i:32;}i:10;a:3:{i:0;s:11:"strong_open";i:1;a:0:{}i:2;i:40;}i:11;a:3:{i:0;s:5:"cdata";i:1;a:1:{i:0;s:10:"Presentes:";}i:2;i:42;}i:12;a:3:{i:0;s:12:"strong_close";i:1;a:0:{}i:2;i:52;}i:13;a:3:{i:0;s:5:"cdata";i:1;a:1:{i:0;s:76:" Dante, Diego, Wagner, Nondillo, Vinícius, João, Robert, Lilian e Gustavo.";}i:2;i:54;}i:14;a:3:{i:0;s:7:"p_close";i:1;a:0:{}i:2;i:130;}i:15;a:3:{i:0;s:6:"p_open";i:1;a:0:{}i:2;i:130;}i:16;a:3:{i:0;s:5:"cdata";i:1;a:1:{i:0;s:2:"1.";}i:2;i:132;}i:17;a:3:{i:0;s:11:"strong_open";i:1;a:0:{}i:2;i:134;}i:18;a:3:{i:0;s:5:"cdata";i:1;a:1:{i:0;s:15:"Visita do CLAA:";}i:2;i:136;}i:19;a:3:{i:0;s:12:"strong_close";i:1;a:0:{}i:2;i:151;}i:20;a:3:{i:0;s:5:"cdata";i:1;a:1:{i:0;s:1:"
";}i:2;i:153;}i:21;a:3:{i:0;s:7:"p_close";i:1;a:0:{}i:2;i:154;}i:22;a:3:{i:0;s:10:"listu_open";i:1;a:0:{}i:2;i:154;}i:23;a:3:{i:0;s:13:"listitem_open";i:1;a:1:{i:0;i:1;}i:2;i:154;}i:24;a:3:{i:0;s:16:"listcontent_open";i:1;a:0:{}i:2;i:154;}i:25;a:3:{i:0;s:5:"cdata";i:1;a:1:{i:0;s:64:" Quarta-feira (12/01/05) às 14h todos deverão estar presentes;";}i:2;i:158;}i:26;a:3:{i:0;s:17:"listcontent_close";i:1;a:0:{}i:2;i:222;}i:27;a:3:{i:0;s:14:"listitem_close";i:1;a:0:{}i:2;i:222;}i:28;a:3:{i:0;s:13:"listitem_open";i:1;a:1:{i:0;i:1;}i:2;i:222;}i:29;a:3:{i:0;s:16:"listcontent_open";i:1;a:0:{}i:2;i:222;}i:30;a:3:{i:0;s:5:"cdata";i:1;a:1:{i:0;s:23:" Precisamos enfatizar: ";}i:2;i:226;}i:31;a:3:{i:0;s:13:"emphasis_open";i:1;a:0:{}i:2;i:249;}i:32;a:3:{i:0;s:12:"internallink";i:1;a:2:{i:0;s:18:"/trac/wiki/RoboPet";i:1;s:8:"RoboPet?";}i:2;i:251;}i:33;a:3:{i:0;s:14:"emphasis_close";i:1;a:0:{}i:2;i:282;}i:34;a:3:{i:0;s:5:"cdata";i:1;a:1:{i:0;s:84:" (integração com alunos de pós-graduação, ida à Rio Grande, convite da UNICAMP";}i:2;i:284;}i:35;a:3:{i:0;s:6:"entity";i:1;a:1:{i:0;s:3:"...";}i:2;i:368;}i:36;a:3:{i:0;s:5:"cdata";i:1;a:1:{i:0;s:275:"), mini-curso de Linux, projeto de extensão, integração entre os dois cursos (CIC e ECP), presença nos eventos da Reforma Universitária, grande renovação do grupo, o processo de seleção dos petianos inclui professores, recepção aos franceses, participação no SIC";}i:2;i:371;}i:37;a:3:{i:0;s:6:"entity";i:1;a:1:{i:0;s:3:"...";}i:2;i:646;}i:38;a:3:{i:0;s:5:"cdata";i:1;a:1:{i:0;s:2:" ;";}i:2;i:649;}i:39;a:3:{i:0;s:17:"listcontent_close";i:1;a:0:{}i:2;i:651;}i:40;a:3:{i:0;s:14:"listitem_close";i:1;a:0:{}i:2;i:651;}i:41;a:3:{i:0;s:13:"listitem_open";i:1;a:1:{i:0;i:1;}i:2;i:651;}i:42;a:3:{i:0;s:16:"listcontent_open";i:1;a:0:{}i:2;i:651;}i:43;a:3:{i:0;s:5:"cdata";i:1;a:1:{i:0;s:97:" Nondillo ficou encarregado de contatar a comissão de professores a estarem presentes na visita.";}i:2;i:655;}i:44;a:3:{i:0;s:17:"listcontent_close";i:1;a:0:{}i:2;i:752;}i:45;a:3:{i:0;s:14:"listitem_close";i:1;a:0:{}i:2;i:752;}i:46;a:3:{i:0;s:11:"listu_close";i:1;a:0:{}i:2;i:752;}i:47;a:3:{i:0;s:6:"p_open";i:1;a:0:{}i:2;i:752;}i:48;a:3:{i:0;s:5:"cdata";i:1;a:1:{i:0;s:3:"
2.";}i:2;i:753;}i:49;a:3:{i:0;s:11:"strong_open";i:1;a:0:{}i:2;i:756;}i:50;a:3:{i:0;s:5:"cdata";i:1;a:1:{i:0;s:49:"Relatório de atividades 2004 (mar/04 à fev/05):";}i:2;i:758;}i:51;a:3:{i:0;s:12:"strong_close";i:1;a:0:{}i:2;i:807;}i:52;a:3:{i:0;s:5:"cdata";i:1;a:1:{i:0;s:1:"
";}i:2;i:809;}i:53;a:3:{i:0;s:7:"p_close";i:1;a:0:{}i:2;i:810;}i:54;a:3:{i:0;s:10:"listu_open";i:1;a:0:{}i:2;i:810;}i:55;a:3:{i:0;s:13:"listitem_open";i:1;a:1:{i:0;i:1;}i:2;i:810;}i:56;a:3:{i:0;s:16:"listcontent_open";i:1;a:0:{}i:2;i:810;}i:57;a:3:{i:0;s:5:"cdata";i:1;a:1:{i:0;s:55:" Comissão de elaboração: Wagner, Vinícius e Robert;";}i:2;i:814;}i:58;a:3:{i:0;s:17:"listcontent_close";i:1;a:0:{}i:2;i:869;}i:59;a:3:{i:0;s:14:"listitem_close";i:1;a:0:{}i:2;i:869;}i:60;a:3:{i:0;s:13:"listitem_open";i:1;a:1:{i:0;i:1;}i:2;i:869;}i:61;a:3:{i:0;s:16:"listcontent_open";i:1;a:0:{}i:2;i:869;}i:62;a:3:{i:0;s:5:"cdata";i:1;a:1:{i:0;s:37:" Prazo de entrega: até 15 de março.";}i:2;i:873;}i:63;a:3:{i:0;s:17:"listcontent_close";i:1;a:0:{}i:2;i:910;}i:64;a:3:{i:0;s:14:"listitem_close";i:1;a:0:{}i:2;i:910;}i:65;a:3:{i:0;s:11:"listu_close";i:1;a:0:{}i:2;i:910;}i:66;a:3:{i:0;s:6:"p_open";i:1;a:0:{}i:2;i:910;}i:67;a:3:{i:0;s:5:"cdata";i:1;a:1:{i:0;s:3:"
3.";}i:2;i:911;}i:68;a:3:{i:0;s:11:"strong_open";i:1;a:0:{}i:2;i:914;}i:69;a:3:{i:0;s:5:"cdata";i:1;a:1:{i:0;s:51:"Planejamento de atividades 2005 (mar/05 à fev/06):";}i:2;i:916;}i:70;a:3:{i:0;s:12:"strong_close";i:1;a:0:{}i:2;i:967;}i:71;a:3:{i:0;s:5:"cdata";i:1;a:1:{i:0;s:1:"
";}i:2;i:969;}i:72;a:3:{i:0;s:7:"p_close";i:1;a:0:{}i:2;i:970;}i:73;a:3:{i:0;s:10:"listu_open";i:1;a:0:{}i:2;i:970;}i:74;a:3:{i:0;s:13:"listitem_open";i:1;a:1:{i:0;i:1;}i:2;i:970;}i:75;a:3:{i:0;s:16:"listcontent_open";i:1;a:0:{}i:2;i:970;}i:76;a:3:{i:0;s:5:"cdata";i:1;a:1:{i:0;s:52:" Comissão de elaboração: Nondillo, Diego e João;";}i:2;i:974;}i:77;a:3:{i:0;s:17:"listcontent_close";i:1;a:0:{}i:2;i:1026;}i:78;a:3:{i:0;s:14:"listitem_close";i:1;a:0:{}i:2;i:1026;}i:79;a:3:{i:0;s:13:"listitem_open";i:1;a:1:{i:0;i:1;}i:2;i:1026;}i:80;a:3:{i:0;s:16:"listcontent_open";i:1;a:0:{}i:2;i:1026;}i:81;a:3:{i:0;s:5:"cdata";i:1;a:1:{i:0;s:37:" Prazo de entrega: até 30 de março;";}i:2;i:1030;}i:82;a:3:{i:0;s:17:"listcontent_close";i:1;a:0:{}i:2;i:1067;}i:83;a:3:{i:0;s:14:"listitem_close";i:1;a:0:{}i:2;i:1067;}i:84;a:3:{i:0;s:13:"listitem_open";i:1;a:1:{i:0;i:1;}i:2;i:1067;}i:85;a:3:{i:0;s:16:"listcontent_open";i:1;a:0:{}i:2;i:1067;}i:86;a:3:{i:0;s:5:"cdata";i:1;a:1:{i:0;s:66:" Planejar seminários mais técnicos como atividades de extensão.";}i:2;i:1071;}i:87;a:3:{i:0;s:17:"listcontent_close";i:1;a:0:{}i:2;i:1137;}i:88;a:3:{i:0;s:14:"listitem_close";i:1;a:0:{}i:2;i:1137;}i:89;a:3:{i:0;s:11:"listu_close";i:1;a:0:{}i:2;i:1137;}i:90;a:3:{i:0;s:6:"p_open";i:1;a:0:{}i:2;i:1137;}i:91;a:3:{i:0;s:5:"cdata";i:1;a:1:{i:0;s:3:"
4.";}i:2;i:1138;}i:92;a:3:{i:0;s:11:"strong_open";i:1;a:0:{}i:2;i:1141;}i:93;a:3:{i:0;s:5:"cdata";i:1;a:1:{i:0;s:5:"ENAD:";}i:2;i:1143;}i:94;a:3:{i:0;s:12:"strong_close";i:1;a:0:{}i:2;i:1148;}i:95;a:3:{i:0;s:5:"cdata";i:1;a:1:{i:0;s:1:"
";}i:2;i:1150;}i:96;a:3:{i:0;s:7:"p_close";i:1;a:0:{}i:2;i:1151;}i:97;a:3:{i:0;s:10:"listu_open";i:1;a:0:{}i:2;i:1151;}i:98;a:3:{i:0;s:13:"listitem_open";i:1;a:1:{i:0;i:1;}i:2;i:1151;}i:99;a:3:{i:0;s:16:"listcontent_open";i:1;a:0:{}i:2;i:1151;}i:100;a:3:{i:0;s:5:"cdata";i:1;a:1:{i:0;s:67:" Lilian ficou encarregada de obter informações antes das férias.";}i:2;i:1155;}i:101;a:3:{i:0;s:17:"listcontent_close";i:1;a:0:{}i:2;i:1222;}i:102;a:3:{i:0;s:14:"listitem_close";i:1;a:0:{}i:2;i:1222;}i:103;a:3:{i:0;s:11:"listu_close";i:1;a:0:{}i:2;i:1222;}i:104;a:3:{i:0;s:6:"p_open";i:1;a:0:{}i:2;i:1222;}i:105;a:3:{i:0;s:5:"cdata";i:1;a:1:{i:0;s:3:"
5.";}i:2;i:1223;}i:106;a:3:{i:0;s:11:"strong_open";i:1;a:0:{}i:2;i:1226;}i:107;a:3:{i:0;s:5:"cdata";i:1;a:1:{i:0;s:8:"Robopet:";}i:2;i:1228;}i:108;a:3:{i:0;s:12:"strong_close";i:1;a:0:{}i:2;i:1236;}i:109;a:3:{i:0;s:5:"cdata";i:1;a:1:{i:0;s:1:"
";}i:2;i:1238;}i:110;a:3:{i:0;s:7:"p_close";i:1;a:0:{}i:2;i:1239;}i:111;a:3:{i:0;s:10:"listu_open";i:1;a:0:{}i:2;i:1239;}i:112;a:3:{i:0;s:13:"listitem_open";i:1;a:1:{i:0;i:1;}i:2;i:1239;}i:113;a:3:{i:0;s:16:"listcontent_open";i:1;a:0:{}i:2;i:1239;}i:114;a:3:{i:0;s:5:"cdata";i:1;a:1:{i:0;s:25:" Filipe precisa deixar a ";}i:2;i:1243;}i:115;a:3:{i:0;s:18:"doublequoteopening";i:1;a:0:{}i:2;i:1268;}i:116;a:3:{i:0;s:5:"cdata";i:1;a:1:{i:0;s:17:"maleta com coisas";}i:2;i:1269;}i:117;a:3:{i:0;s:18:"doublequoteclosing";i:1;a:0:{}i:2;i:1286;}i:118;a:3:{i:0;s:5:"cdata";i:1;a:1:{i:0;s:66:" do futebol de robôs e o CD com as modificações feitas por ele.";}i:2;i:1287;}i:119;a:3:{i:0;s:17:"listcontent_close";i:1;a:0:{}i:2;i:1353;}i:120;a:3:{i:0;s:14:"listitem_close";i:1;a:0:{}i:2;i:1353;}i:121;a:3:{i:0;s:11:"listu_close";i:1;a:0:{}i:2;i:1353;}i:122;a:3:{i:0;s:6:"p_open";i:1;a:0:{}i:2;i:1353;}i:123;a:3:{i:0;s:5:"cdata";i:1;a:1:{i:0;s:3:"
6.";}i:2;i:1354;}i:124;a:3:{i:0;s:11:"strong_open";i:1;a:0:{}i:2;i:1357;}i:125;a:3:{i:0;s:5:"cdata";i:1;a:1:{i:0;s:16:"Outros Assuntos:";}i:2;i:1359;}i:126;a:3:{i:0;s:12:"strong_close";i:1;a:0:{}i:2;i:1375;}i:127;a:3:{i:0;s:5:"cdata";i:1;a:1:{i:0;s:1:"
";}i:2;i:1377;}i:128;a:3:{i:0;s:7:"p_close";i:1;a:0:{}i:2;i:1378;}i:129;a:3:{i:0;s:10:"listu_open";i:1;a:0:{}i:2;i:1378;}i:130;a:3:{i:0;s:13:"listitem_open";i:1;a:1:{i:0;i:1;}i:2;i:1378;}i:131;a:3:{i:0;s:16:"listcontent_open";i:1;a:0:{}i:2;i:1378;}i:132;a:3:{i:0;s:5:"cdata";i:1;a:1:{i:0;s:43:" Dante propõe um cadastro dos ex-petianos;";}i:2;i:1382;}i:133;a:3:{i:0;s:17:"listcontent_close";i:1;a:0:{}i:2;i:1425;}i:134;a:3:{i:0;s:14:"listitem_close";i:1;a:0:{}i:2;i:1425;}i:135;a:3:{i:0;s:13:"listitem_open";i:1;a:1:{i:0;i:1;}i:2;i:1425;}i:136;a:3:{i:0;s:16:"listcontent_open";i:1;a:0:{}i:2;i:1425;}i:137;a:3:{i:0;s:5:"cdata";i:1;a:1:{i:0;s:91:" Um ano de PET: possibilita tentativa de aquisição de 4 créditos eletivos e certificado;";}i:2;i:1429;}i:138;a:3:{i:0;s:17:"listcontent_close";i:1;a:0:{}i:2;i:1520;}i:139;a:3:{i:0;s:14:"listitem_close";i:1;a:0:{}i:2;i:1520;}i:140;a:3:{i:0;s:13:"listitem_open";i:1;a:1:{i:0;i:1;}i:2;i:1520;}i:141;a:3:{i:0;s:16:"listcontent_open";i:1;a:0:{}i:2;i:1520;}i:142;a:3:{i:0;s:5:"cdata";i:1;a:1:{i:0;s:24:" Ficou agendada a peça ";}i:2;i:1524;}i:143;a:3:{i:0;s:13:"emphasis_open";i:1;a:0:{}i:2;i:1548;}i:144;a:3:{i:0;s:5:"cdata";i:1;a:1:{i:0;s:18:"Os homens de Perto";}i:2;i:1550;}i:145;a:3:{i:0;s:14:"emphasis_close";i:1;a:0:{}i:2;i:1568;}i:146;a:3:{i:0;s:5:"cdata";i:1;a:1:{i:0;s:27:" para quarta-feira às 21h;";}i:2;i:1570;}i:147;a:3:{i:0;s:17:"listcontent_close";i:1;a:0:{}i:2;i:1597;}i:148;a:3:{i:0;s:14:"listitem_close";i:1;a:0:{}i:2;i:1597;}i:149;a:3:{i:0;s:13:"listitem_open";i:1;a:1:{i:0;i:1;}i:2;i:1597;}i:150;a:3:{i:0;s:16:"listcontent_open";i:1;a:0:{}i:2;i:1597;}i:151;a:3:{i:0;s:5:"cdata";i:1;a:1:{i:0;s:106:" Até 25 de janeiro os interessados devem enviar relatórios técnicos para participar da Bienal (PET-BR);";}i:2;i:1601;}i:152;a:3:{i:0;s:17:"listcontent_close";i:1;a:0:{}i:2;i:1707;}i:153;a:3:{i:0;s:14:"listitem_close";i:1;a:0:{}i:2;i:1707;}i:154;a:3:{i:0;s:13:"listitem_open";i:1;a:1:{i:0;i:1;}i:2;i:1707;}i:155;a:3:{i:0;s:16:"listcontent_open";i:1;a:0:{}i:2;i:1707;}i:156;a:3:{i:0;s:5:"cdata";i:1;a:1:{i:0;s:71:" Wagner ficou encarregado de incluir os novos petianos na lista PET-BR.";}i:2;i:1711;}i:157;a:3:{i:0;s:17:"listcontent_close";i:1;a:0:{}i:2;i:1782;}i:158;a:3:{i:0;s:14:"listitem_close";i:1;a:0:{}i:2;i:1782;}i:159;a:3:{i:0;s:11:"listu_close";i:1;a:0:{}i:2;i:1782;}i:160;a:3:{i:0;s:12:"document_end";i:1;a:0:{}i:2;i:1782;}}