a:231:{i:0;a:3:{i:0;s:14:"document_start";i:1;a:0:{}i:2;i:0;}i:1;a:3:{i:0;s:6:"p_open";i:1;a:0:{}i:2;i:0;}i:2;a:3:{i:0;s:7:"p_close";i:1;a:0:{}i:2;i:1;}i:3;a:3:{i:0;s:12:"section_edit";i:1;a:4:{i:0;i:-1;i:1;i:0;i:2;i:1;i:3;s:0:"";}i:2;i:1;}i:4;a:3:{i:0;s:6:"header";i:1;a:3:{i:0;s:38:"Ata da Reunião de 12 de junho de 2008";i:1;i:1;i:2;i:1;}i:2;i:1;}i:5;a:3:{i:0;s:12:"section_open";i:1;a:1:{i:0;i:1;}i:2;i:1;}i:6;a:3:{i:0;s:10:"listu_open";i:1;a:0:{}i:2;i:54;}i:7;a:3:{i:0;s:13:"listitem_open";i:1;a:1:{i:0;i:1;}i:2;i:54;}i:8;a:3:{i:0;s:16:"listcontent_open";i:1;a:0:{}i:2;i:54;}i:9;a:3:{i:0;s:5:"cdata";i:1;a:1:{i:0;s:94:" Presentes: Antônio, Bruno, Felipe, Gabriel, Kauê, Leonardo, Lucas, Marcela, Matheus, Dante.";}i:2;i:58;}i:10;a:3:{i:0;s:17:"listcontent_close";i:1;a:0:{}i:2;i:152;}i:11;a:3:{i:0;s:14:"listitem_close";i:1;a:0:{}i:2;i:152;}i:12;a:3:{i:0;s:13:"listitem_open";i:1;a:1:{i:0;i:1;}i:2;i:152;}i:13;a:3:{i:0;s:16:"listcontent_open";i:1;a:0:{}i:2;i:152;}i:14;a:3:{i:0;s:5:"cdata";i:1;a:1:{i:0;s:18:" Ausentes: nenhum;";}i:2;i:156;}i:15;a:3:{i:0;s:17:"listcontent_close";i:1;a:0:{}i:2;i:174;}i:16;a:3:{i:0;s:14:"listitem_close";i:1;a:0:{}i:2;i:174;}i:17;a:3:{i:0;s:11:"listu_close";i:1;a:0:{}i:2;i:174;}i:18;a:3:{i:0;s:10:"listu_open";i:1;a:0:{}i:2;i:175;}i:19;a:3:{i:0;s:13:"listitem_open";i:1;a:1:{i:0;i:1;}i:2;i:175;}i:20;a:3:{i:0;s:16:"listcontent_open";i:1;a:0:{}i:2;i:175;}i:21;a:3:{i:0;s:5:"cdata";i:1;a:1:{i:0;s:15:" Relator: Lucas";}i:2;i:179;}i:22;a:3:{i:0;s:17:"listcontent_close";i:1;a:0:{}i:2;i:194;}i:23;a:3:{i:0;s:14:"listitem_close";i:1;a:0:{}i:2;i:194;}i:24;a:3:{i:0;s:11:"listu_close";i:1;a:0:{}i:2;i:194;}i:25;a:3:{i:0;s:6:"p_open";i:1;a:0:{}i:2;i:194;}i:26;a:3:{i:0;s:5:"cdata";i:1;a:1:{i:0;s:1:"
";}i:2;i:195;}i:27;a:3:{i:0;s:9:"linebreak";i:1;a:0:{}i:2;i:196;}i:28;a:3:{i:0;s:7:"p_close";i:1;a:0:{}i:2;i:198;}i:29;a:3:{i:0;s:13:"section_close";i:1;a:0:{}i:2;i:200;}i:30;a:3:{i:0;s:12:"section_edit";i:1;a:4:{i:0;i:1;i:1;i:199;i:2;i:1;i:3;s:38:"Ata da Reunião de 12 de junho de 2008";}i:2;i:200;}i:31;a:3:{i:0;s:6:"header";i:1;a:3:{i:0;s:24:"1) Reclamação (portal)";i:1;i:2;i:2;i:200;}i:2;i:200;}i:32;a:3:{i:0;s:12:"section_open";i:1;a:1:{i:0;i:2;}i:2;i:200;}i:33;a:3:{i:0;s:10:"quote_open";i:1;a:0:{}i:2;i:237;}i:34;a:3:{i:0;s:5:"cdata";i:1;a:1:{i:0;s:355:" Portal reclamou da dificuldade que muitas vezes tem de trabalhar no PET, por causa do barulho e do uso indevido dos computadores por Petianos e Não-Petianos. Um problema tem sido recorrente não se restringindo a um horário específico. O PET não é uma sala de jogos, mas um local para o trabalho, e devemos evitar situações como a de terça-feira.";}i:2;i:239;}i:35;a:3:{i:0;s:9:"linebreak";i:1;a:0:{}i:2;i:594;}i:36;a:3:{i:0;s:5:"cdata";i:1;a:1:{i:0;s:295:"  Como a regra de não se jogar antes das 19h00 na sala não está sendo respeitada, Dante sugeriu uma proibição dos jogos no PET durante três meses. O grupo achou a regra um pouco drástica, e decidiu-se, por sugestão de Antônio, reforçar a proibição com cartazes e avisos nos quadros. ";}i:2;i:596;}i:37;a:3:{i:0;s:9:"linebreak";i:1;a:0:{}i:2;i:891;}i:38;a:3:{i:0;s:5:"cdata";i:1;a:1:{i:0;s:396:"  Para garantir mais produtividade e o trabalho dos petianos, foram reservados os computadores Juliana, Katyucha e Isabela para serem utilizados apenas por petianos, já que algumas vezes o número de pessoas na sala é tão grande que até mesmo a locomoção fica prejudicada. As visitas são bem vindas, mas devemos tomar uma atitude mais dura, para que o ambiente de trabalho seja preservado.";}i:2;i:893;}i:39;a:3:{i:0;s:11:"quote_close";i:1;a:0:{}i:2;i:1289;}i:40;a:3:{i:0;s:6:"p_open";i:1;a:0:{}i:2;i:1289;}i:41;a:3:{i:0;s:5:"cdata";i:1;a:1:{i:0;s:1:"
";}i:2;i:1290;}i:42;a:3:{i:0;s:9:"linebreak";i:1;a:0:{}i:2;i:1291;}i:43;a:3:{i:0;s:7:"p_close";i:1;a:0:{}i:2;i:1293;}i:44;a:3:{i:0;s:13:"section_close";i:1;a:0:{}i:2;i:1295;}i:45;a:3:{i:0;s:12:"section_edit";i:1;a:4:{i:0;i:200;i:1;i:1294;i:2;i:2;i:3;s:24:"1) Reclamação (portal)";}i:2;i:1295;}i:46;a:3:{i:0;s:6:"header";i:1;a:3:{i:0;s:51:"2) Semana Acadêmica -&gt; Curso de Python (Portal)";i:1;i:2;i:2;i:1295;}i:2;i:1295;}i:47;a:3:{i:0;s:12:"section_open";i:1;a:1:{i:0;i:2;}i:2;i:1295;}i:48;a:3:{i:0;s:10:"quote_open";i:1;a:0:{}i:2;i:1359;}i:49;a:3:{i:0;s:5:"cdata";i:1;a:1:{i:0;s:116:" Portal comentou que o curso, de caráter introdutório, foi extremamente bem recebido, mesmo tendo curta duração.";}i:2;i:1361;}i:50;a:3:{i:0;s:11:"quote_close";i:1;a:0:{}i:2;i:1477;}i:51;a:3:{i:0;s:6:"p_open";i:1;a:0:{}i:2;i:1477;}i:52;a:3:{i:0;s:5:"cdata";i:1;a:1:{i:0;s:1:"
";}i:2;i:1478;}i:53;a:3:{i:0;s:9:"linebreak";i:1;a:0:{}i:2;i:1479;}i:54;a:3:{i:0;s:7:"p_close";i:1;a:0:{}i:2;i:1481;}i:55;a:3:{i:0;s:13:"section_close";i:1;a:0:{}i:2;i:1483;}i:56;a:3:{i:0;s:12:"section_edit";i:1;a:4:{i:0;i:1295;i:1;i:1482;i:2;i:2;i:3;s:51:"2) Semana Acadêmica -&gt; Curso de Python (Portal)";}i:2;i:1483;}i:57;a:3:{i:0;s:6:"header";i:1;a:3:{i:0;s:68:"3) Salão de Graduação -&gt; Extensão da Oficina de LaTeX (Kauê)";i:1;i:2;i:2;i:1483;}i:2;i:1483;}i:58;a:3:{i:0;s:12:"section_open";i:1;a:1:{i:0;i:2;}i:2;i:1483;}i:59;a:3:{i:0;s:10:"quote_open";i:1;a:0:{}i:2;i:1564;}i:60;a:3:{i:0;s:5:"cdata";i:1;a:1:{i:0;s:244:" Kauê achou váida a sugestão de criar uma oficina mais extensa de LaTeX e pediu um voluntário para lhe ajudar o material (posto ocupado por Portal). O curso será dado na próxima SEMAC, provaelmente com um serminário interno para o grupo.";}i:2;i:1566;}i:61;a:3:{i:0;s:11:"quote_close";i:1;a:0:{}i:2;i:1810;}i:62;a:3:{i:0;s:6:"p_open";i:1;a:0:{}i:2;i:1810;}i:63;a:3:{i:0;s:5:"cdata";i:1;a:1:{i:0;s:1:"
";}i:2;i:1811;}i:64;a:3:{i:0;s:9:"linebreak";i:1;a:0:{}i:2;i:1812;}i:65;a:3:{i:0;s:7:"p_close";i:1;a:0:{}i:2;i:1814;}i:66;a:3:{i:0;s:13:"section_close";i:1;a:0:{}i:2;i:1816;}i:67;a:3:{i:0;s:12:"section_edit";i:1;a:4:{i:0;i:1483;i:1;i:1815;i:2;i:2;i:3;s:68:"3) Salão de Graduação -&gt; Extensão da Oficina de LaTeX (Kauê)";}i:2;i:1816;}i:68;a:3:{i:0;s:6:"header";i:1;a:3:{i:0;s:40:"4) Desculpas pelo atraso da ata (Portal)";i:1;i:2;i:2;i:1816;}i:2;i:1816;}i:69;a:3:{i:0;s:12:"section_open";i:1;a:1:{i:0;i:2;}i:2;i:1816;}i:70;a:3:{i:0;s:10:"quote_open";i:1;a:0:{}i:2;i:1869;}i:71;a:3:{i:0;s:5:"cdata";i:1;a:1:{i:0;s:149:" Portal pediu desculpas pela demora da Ata e justificou o traso pelo acúmulo de trabalho. O grupo aceitou a justificativa e uma falta será anotada.";}i:2;i:1871;}i:72;a:3:{i:0;s:11:"quote_close";i:1;a:0:{}i:2;i:2020;}i:73;a:3:{i:0;s:6:"p_open";i:1;a:0:{}i:2;i:2020;}i:74;a:3:{i:0;s:5:"cdata";i:1;a:1:{i:0;s:1:"
";}i:2;i:2021;}i:75;a:3:{i:0;s:9:"linebreak";i:1;a:0:{}i:2;i:2022;}i:76;a:3:{i:0;s:5:"cdata";i:1;a:1:{i:0;s:67:"  -&gt; Neste momento, Marcela e Portal foram para o curso de C++. ";}i:2;i:2024;}i:77;a:3:{i:0;s:9:"linebreak";i:1;a:0:{}i:2;i:2091;}i:78;a:3:{i:0;s:7:"p_close";i:1;a:0:{}i:2;i:2093;}i:79;a:3:{i:0;s:13:"section_close";i:1;a:0:{}i:2;i:2095;}i:80;a:3:{i:0;s:12:"section_edit";i:1;a:4:{i:0;i:1816;i:1;i:2094;i:2;i:2;i:3;s:40:"4) Desculpas pelo atraso da ata (Portal)";}i:2;i:2095;}i:81;a:3:{i:0;s:6:"header";i:1;a:3:{i:0;s:32:"5) Folha de Efetividade (Felipe)";i:1;i:2;i:2;i:2095;}i:2;i:2095;}i:82;a:3:{i:0;s:12:"section_open";i:1;a:1:{i:0;i:2;}i:2;i:2095;}i:83;a:3:{i:0;s:10:"quote_open";i:1;a:0:{}i:2;i:2140;}i:84;a:3:{i:0;s:5:"cdata";i:1;a:1:{i:0;s:74:" Felipe terminou a folha de efetividade e a levará quando for mais perto.";}i:2;i:2142;}i:85;a:3:{i:0;s:11:"quote_close";i:1;a:0:{}i:2;i:2216;}i:86;a:3:{i:0;s:6:"p_open";i:1;a:0:{}i:2;i:2216;}i:87;a:3:{i:0;s:5:"cdata";i:1;a:1:{i:0;s:1:"
";}i:2;i:2217;}i:88;a:3:{i:0;s:9:"linebreak";i:1;a:0:{}i:2;i:2218;}i:89;a:3:{i:0;s:7:"p_close";i:1;a:0:{}i:2;i:2220;}i:90;a:3:{i:0;s:13:"section_close";i:1;a:0:{}i:2;i:2222;}i:91;a:3:{i:0;s:12:"section_edit";i:1;a:4:{i:0;i:2095;i:1;i:2221;i:2;i:2;i:3;s:32:"5) Folha de Efetividade (Felipe)";}i:2;i:2222;}i:92;a:3:{i:0;s:6:"header";i:1;a:3:{i:0;s:29:"6) Compra de Motores (Felipe)";i:1;i:2;i:2;i:2222;}i:2;i:2222;}i:93;a:3:{i:0;s:12:"section_open";i:1;a:1:{i:0;i:2;}i:2;i:2222;}i:94;a:3:{i:0;s:10:"quote_open";i:1;a:0:{}i:2;i:2264;}i:95;a:3:{i:0;s:5:"cdata";i:1;a:1:{i:0;s:137:" Felipe irá comprar motores para um novo protótipo do RoboPET. Ele encontrou motores de R$20,00 e irá encomendá-los. O caixa pagará.";}i:2;i:2266;}i:96;a:3:{i:0;s:11:"quote_close";i:1;a:0:{}i:2;i:2403;}i:97;a:3:{i:0;s:6:"p_open";i:1;a:0:{}i:2;i:2403;}i:98;a:3:{i:0;s:5:"cdata";i:1;a:1:{i:0;s:1:"
";}i:2;i:2404;}i:99;a:3:{i:0;s:9:"linebreak";i:1;a:0:{}i:2;i:2405;}i:100;a:3:{i:0;s:7:"p_close";i:1;a:0:{}i:2;i:2407;}i:101;a:3:{i:0;s:13:"section_close";i:1;a:0:{}i:2;i:2409;}i:102;a:3:{i:0;s:12:"section_edit";i:1;a:4:{i:0;i:2222;i:1;i:2408;i:2;i:2;i:3;s:29:"6) Compra de Motores (Felipe)";}i:2;i:2409;}i:103;a:3:{i:0;s:6:"header";i:1;a:3:{i:0;s:33:"7) Horas do Curso de C++ (Felipe)";i:1;i:2;i:2;i:2409;}i:2;i:2409;}i:104;a:3:{i:0;s:12:"section_open";i:1;a:1:{i:0;i:2;}i:2;i:2409;}i:105;a:3:{i:0;s:10:"quote_open";i:1;a:0:{}i:2;i:2455;}i:106;a:3:{i:0;s:5:"cdata";i:1;a:1:{i:0;s:249:" Felipe deixou o ponto na Pauta passada pois achou que não conseguiria terminar as horas do mês, mas isso não se tornou verdade. Como ele já tem 46h no mês, Antônio e o grupo concordadaram que se faltar algum tempo ele será poupado de faltas.";}i:2;i:2457;}i:107;a:3:{i:0;s:11:"quote_close";i:1;a:0:{}i:2;i:2706;}i:108;a:3:{i:0;s:6:"p_open";i:1;a:0:{}i:2;i:2706;}i:109;a:3:{i:0;s:5:"cdata";i:1;a:1:{i:0;s:1:"
";}i:2;i:2707;}i:110;a:3:{i:0;s:9:"linebreak";i:1;a:0:{}i:2;i:2708;}i:111;a:3:{i:0;s:7:"p_close";i:1;a:0:{}i:2;i:2710;}i:112;a:3:{i:0;s:13:"section_close";i:1;a:0:{}i:2;i:2712;}i:113;a:3:{i:0;s:12:"section_edit";i:1;a:4:{i:0;i:2409;i:1;i:2711;i:2;i:2;i:3;s:33:"7) Horas do Curso de C++ (Felipe)";}i:2;i:2712;}i:114;a:3:{i:0;s:6:"header";i:1;a:3:{i:0;s:29:"8) Key Scan Utility? (Felipe)";i:1;i:2;i:2;i:2712;}i:2;i:2712;}i:115;a:3:{i:0;s:12:"section_open";i:1;a:1:{i:0;i:2;}i:2;i:2712;}i:116;a:3:{i:0;s:10:"quote_open";i:1;a:0:{}i:2;i:2754;}i:117;a:3:{i:0;s:5:"cdata";i:1;a:1:{i:0;s:118:" Felipe gostaria de saber o que faz o programa que encontrou na Isabela. O programa faz parte do Nero, gravador de CD.";}i:2;i:2756;}i:118;a:3:{i:0;s:11:"quote_close";i:1;a:0:{}i:2;i:2874;}i:119;a:3:{i:0;s:6:"p_open";i:1;a:0:{}i:2;i:2874;}i:120;a:3:{i:0;s:5:"cdata";i:1;a:1:{i:0;s:1:"
";}i:2;i:2875;}i:121;a:3:{i:0;s:9:"linebreak";i:1;a:0:{}i:2;i:2876;}i:122;a:3:{i:0;s:7:"p_close";i:1;a:0:{}i:2;i:2878;}i:123;a:3:{i:0;s:13:"section_close";i:1;a:0:{}i:2;i:2880;}i:124;a:3:{i:0;s:12:"section_edit";i:1;a:4:{i:0;i:2712;i:1;i:2879;i:2;i:2;i:3;s:29:"8) Key Scan Utility? (Felipe)";}i:2;i:2880;}i:125;a:3:{i:0;s:6:"header";i:1;a:3:{i:0;s:32:"9) Material de consumo (Matheus)";i:1;i:2;i:2;i:2880;}i:2;i:2880;}i:126;a:3:{i:0;s:12:"section_open";i:1;a:1:{i:0;i:2;}i:2;i:2880;}i:127;a:3:{i:0;s:10:"quote_open";i:1;a:0:{}i:2;i:2925;}i:128;a:3:{i:0;s:5:"cdata";i:1;a:1:{i:0;s:69:" Matheus terminou a lista (R$1500) e levará para o Ezequiel amanhã.";}i:2;i:2927;}i:129;a:3:{i:0;s:11:"quote_close";i:1;a:0:{}i:2;i:2996;}i:130;a:3:{i:0;s:6:"p_open";i:1;a:0:{}i:2;i:2996;}i:131;a:3:{i:0;s:5:"cdata";i:1;a:1:{i:0;s:1:"
";}i:2;i:2997;}i:132;a:3:{i:0;s:9:"linebreak";i:1;a:0:{}i:2;i:2998;}i:133;a:3:{i:0;s:7:"p_close";i:1;a:0:{}i:2;i:3000;}i:134;a:3:{i:0;s:13:"section_close";i:1;a:0:{}i:2;i:3002;}i:135;a:3:{i:0;s:12:"section_edit";i:1;a:4:{i:0;i:2880;i:1;i:3001;i:2;i:2;i:3;s:32:"9) Material de consumo (Matheus)";}i:2;i:3002;}i:136;a:3:{i:0;s:6:"header";i:1;a:3:{i:0;s:43:"10) Aulas no colégio de alpicação (Mizu)";i:1;i:2;i:2;i:3002;}i:2;i:3002;}i:137;a:3:{i:0;s:12:"section_open";i:1;a:1:{i:0;i:2;}i:2;i:3002;}i:138;a:3:{i:0;s:10:"quote_open";i:1;a:0:{}i:2;i:3058;}i:139;a:3:{i:0;s:5:"cdata";i:1;a:1:{i:0;s:246:" Mizu comentou que já combinou com a professora Estrázulas para um curso de robótica para professores, de duração de 7 encontros semanais às sextas-feiras. O curso tem previsão para começar em Agosto e os interessados em participar foram:";}i:2;i:3060;}i:140;a:3:{i:0;s:11:"quote_close";i:1;a:0:{}i:2;i:3306;}i:141;a:3:{i:0;s:6:"p_open";i:1;a:0:{}i:2;i:3306;}i:142;a:3:{i:0;s:5:"cdata";i:1;a:1:{i:0;s:142:"
Antônio, Bruno e Felipe, com Matheus e Leonardo se oferecendo para ajudar com slides e pesquisas. Uma reunião será marcada mais a frente. ";}i:2;i:3307;}i:143;a:3:{i:0;s:9:"linebreak";i:1;a:0:{}i:2;i:3449;}i:144;a:3:{i:0;s:5:"cdata";i:1;a:1:{i:0;s:1:"
";}i:2;i:3451;}i:145;a:3:{i:0;s:7:"p_close";i:1;a:0:{}i:2;i:3452;}i:146;a:3:{i:0;s:10:"quote_open";i:1;a:0:{}i:2;i:3452;}i:147;a:3:{i:0;s:5:"cdata";i:1;a:1:{i:0;s:191:" -&gt; Mizu também aproveitouo para falar que já combinou com a professora Luciene para dar aulas sobre o LEGO Mindstorms aos seus alunos no início de Julho. Felipe o auxiliará na tarefa.";}i:2;i:3454;}i:148;a:3:{i:0;s:11:"quote_close";i:1;a:0:{}i:2;i:3645;}i:149;a:3:{i:0;s:6:"p_open";i:1;a:0:{}i:2;i:3645;}i:150;a:3:{i:0;s:5:"cdata";i:1;a:1:{i:0;s:1:"
";}i:2;i:3646;}i:151;a:3:{i:0;s:9:"linebreak";i:1;a:0:{}i:2;i:3647;}i:152;a:3:{i:0;s:7:"p_close";i:1;a:0:{}i:2;i:3649;}i:153;a:3:{i:0;s:13:"section_close";i:1;a:0:{}i:2;i:3651;}i:154;a:3:{i:0;s:12:"section_edit";i:1;a:4:{i:0;i:3002;i:1;i:3650;i:2;i:2;i:3;s:43:"10) Aulas no colégio de alpicação (Mizu)";}i:2;i:3651;}i:155;a:3:{i:0;s:6:"header";i:1;a:3:{i:0;s:25:"11) Painéis SBPC (Dante)";i:1;i:2;i:2;i:3651;}i:2;i:3651;}i:156;a:3:{i:0;s:12:"section_open";i:1;a:1:{i:0;i:2;}i:2;i:3651;}i:157;a:3:{i:0;s:10:"quote_open";i:1;a:0:{}i:2;i:3689;}i:158;a:3:{i:0;s:5:"cdata";i:1;a:1:{i:0;s:244:" Dante reviu quais painéis estavam prontos e sugeriu algumas mudanças e contatos, com o deadline para o dia 20. Ele também aproveitou para comentar que conheceu o atual secretário de ensino médio do MEC e lhe mostrou o projeto do ROBOEDU. ";}i:2;i:3691;}i:159;a:3:{i:0;s:9:"linebreak";i:1;a:0:{}i:2;i:3935;}i:160;a:3:{i:0;s:5:"cdata";i:1;a:1:{i:0;s:207:"  Aproveitando a deixa, o grupo também concordou que irá convidar o professor Simões (com quem os nossos rádios estão), na sua próxima vinda ao estado, para nos visitar e conhecer nossos laboratórios.";}i:2;i:3937;}i:161;a:3:{i:0;s:11:"quote_close";i:1;a:0:{}i:2;i:4144;}i:162;a:3:{i:0;s:6:"p_open";i:1;a:0:{}i:2;i:4144;}i:163;a:3:{i:0;s:5:"cdata";i:1;a:1:{i:0;s:1:"
";}i:2;i:4145;}i:164;a:3:{i:0;s:9:"linebreak";i:1;a:0:{}i:2;i:4146;}i:165;a:3:{i:0;s:7:"p_close";i:1;a:0:{}i:2;i:4148;}i:166;a:3:{i:0;s:13:"section_close";i:1;a:0:{}i:2;i:4150;}i:167;a:3:{i:0;s:12:"section_edit";i:1;a:4:{i:0;i:3651;i:1;i:4149;i:2;i:2;i:3;s:25:"11) Painéis SBPC (Dante)";}i:2;i:4150;}i:168;a:3:{i:0;s:6:"header";i:1;a:3:{i:0;s:23:"12) Caixa do PET (Mizu)";i:1;i:2;i:2;i:4150;}i:2;i:4150;}i:169;a:3:{i:0;s:12:"section_open";i:1;a:1:{i:0;i:2;}i:2;i:4150;}i:170;a:3:{i:0;s:10:"quote_open";i:1;a:0:{}i:2;i:4186;}i:171;a:3:{i:0;s:5:"cdata";i:1;a:1:{i:0;s:207:" Mizu confirmou o valor do caixa do PET e disse que está esperando o dinheiro que sobrar dos cursos. Ele também disse que a contabilidade está acabada e pode mostrar o fluxo de caixa para os interessados.";}i:2;i:4188;}i:172;a:3:{i:0;s:11:"quote_close";i:1;a:0:{}i:2;i:4395;}i:173;a:3:{i:0;s:6:"p_open";i:1;a:0:{}i:2;i:4395;}i:174;a:3:{i:0;s:5:"cdata";i:1;a:1:{i:0;s:1:"
";}i:2;i:4396;}i:175;a:3:{i:0;s:9:"linebreak";i:1;a:0:{}i:2;i:4397;}i:176;a:3:{i:0;s:7:"p_close";i:1;a:0:{}i:2;i:4399;}i:177;a:3:{i:0;s:13:"section_close";i:1;a:0:{}i:2;i:4401;}i:178;a:3:{i:0;s:12:"section_edit";i:1;a:4:{i:0;i:4150;i:1;i:4400;i:2;i:2;i:3;s:23:"12) Caixa do PET (Mizu)";}i:2;i:4401;}i:179;a:3:{i:0;s:6:"header";i:1;a:3:{i:0;s:33:"13) Votação-comentários (Mizu)";i:1;i:2;i:2;i:4401;}i:2;i:4401;}i:180;a:3:{i:0;s:12:"section_open";i:1;a:1:{i:0;i:2;}i:2;i:4401;}i:181;a:3:{i:0;s:10:"quote_open";i:1;a:0:{}i:2;i:4447;}i:182;a:3:{i:0;s:5:"cdata";i:1;a:1:{i:0;s:156:" Mizu perguntou ao grupo se já haviam votado e o que acharam das eleições. Dante e Bruno comentaram também sobre o que acharam dos debates em que foram.";}i:2;i:4449;}i:183;a:3:{i:0;s:11:"quote_close";i:1;a:0:{}i:2;i:4605;}i:184;a:3:{i:0;s:6:"p_open";i:1;a:0:{}i:2;i:4605;}i:185;a:3:{i:0;s:5:"cdata";i:1;a:1:{i:0;s:1:"
";}i:2;i:4606;}i:186;a:3:{i:0;s:9:"linebreak";i:1;a:0:{}i:2;i:4607;}i:187;a:3:{i:0;s:7:"p_close";i:1;a:0:{}i:2;i:4609;}i:188;a:3:{i:0;s:13:"section_close";i:1;a:0:{}i:2;i:4611;}i:189;a:3:{i:0;s:12:"section_edit";i:1;a:4:{i:0;i:4401;i:1;i:4610;i:2;i:2;i:3;s:33:"13) Votação-comentários (Mizu)";}i:2;i:4611;}i:190;a:3:{i:0;s:6:"header";i:1;a:3:{i:0;s:28:"14) Lembrança ENAPET (Mizu)";i:1;i:2;i:2;i:4611;}i:2;i:4611;}i:191;a:3:{i:0;s:12:"section_open";i:1;a:1:{i:0;i:2;}i:2;i:4611;}i:192;a:3:{i:0;s:10:"quote_open";i:1;a:0:{}i:2;i:4652;}i:193;a:3:{i:0;s:5:"cdata";i:1;a:1:{i:0;s:267:" Mizu avisou a todos para se inscreverem no ENAPET o quanto antes e explicou a forma que o ressarcimento será feito: A PROGRAD fará um ressarcimento do ônibus e das incrições, para quem precisar de dinheiro antes, o caixa do PET também poderá arcar com cursos.";}i:2;i:4654;}i:194;a:3:{i:0;s:11:"quote_close";i:1;a:0:{}i:2;i:4921;}i:195;a:3:{i:0;s:6:"p_open";i:1;a:0:{}i:2;i:4921;}i:196;a:3:{i:0;s:5:"cdata";i:1;a:1:{i:0;s:1:"
";}i:2;i:4922;}i:197;a:3:{i:0;s:9:"linebreak";i:1;a:0:{}i:2;i:4923;}i:198;a:3:{i:0;s:7:"p_close";i:1;a:0:{}i:2;i:4925;}i:199;a:3:{i:0;s:13:"section_close";i:1;a:0:{}i:2;i:4927;}i:200;a:3:{i:0;s:12:"section_edit";i:1;a:4:{i:0;i:4611;i:1;i:4926;i:2;i:2;i:3;s:28:"14) Lembrança ENAPET (Mizu)";}i:2;i:4927;}i:201;a:3:{i:0;s:6:"header";i:1;a:3:{i:0;s:21:"15) PET Café (Bruno)";i:1;i:2;i:2;i:4927;}i:2;i:4927;}i:202;a:3:{i:0;s:12:"section_open";i:1;a:1:{i:0;i:2;}i:2;i:4927;}i:203;a:3:{i:0;s:10:"quote_open";i:1;a:0:{}i:2;i:4961;}i:204;a:3:{i:0;s:5:"cdata";i:1;a:1:{i:0;s:20:" Cobrança de Junho.";}i:2;i:4963;}i:205;a:3:{i:0;s:11:"quote_close";i:1;a:0:{}i:2;i:4983;}i:206;a:3:{i:0;s:6:"p_open";i:1;a:0:{}i:2;i:4983;}i:207;a:3:{i:0;s:5:"cdata";i:1;a:1:{i:0;s:1:"
";}i:2;i:4984;}i:208;a:3:{i:0;s:9:"linebreak";i:1;a:0:{}i:2;i:4985;}i:209;a:3:{i:0;s:7:"p_close";i:1;a:0:{}i:2;i:4987;}i:210;a:3:{i:0;s:13:"section_close";i:1;a:0:{}i:2;i:4989;}i:211;a:3:{i:0;s:12:"section_edit";i:1;a:4:{i:0;i:4927;i:1;i:4988;i:2;i:2;i:3;s:21:"15) PET Café (Bruno)";}i:2;i:4989;}i:212;a:3:{i:0;s:6:"header";i:1;a:3:{i:0;s:20:"16) PET Kart (Bruno)";i:1;i:2;i:2;i:4989;}i:2;i:4989;}i:213;a:3:{i:0;s:12:"section_open";i:1;a:1:{i:0;i:2;}i:2;i:4989;}i:214;a:3:{i:0;s:10:"quote_open";i:1;a:0:{}i:2;i:5022;}i:215;a:3:{i:0;s:5:"cdata";i:1;a:1:{i:0;s:142:" Sexta, dia 20, Bruno e Antônio irão correr de Kart e convidaram o grupo a ir com eles. Interessados, basta enviarem algum e-mail para eles.";}i:2;i:5024;}i:216;a:3:{i:0;s:11:"quote_close";i:1;a:0:{}i:2;i:5166;}i:217;a:3:{i:0;s:6:"p_open";i:1;a:0:{}i:2;i:5166;}i:218;a:3:{i:0;s:5:"cdata";i:1;a:1:{i:0;s:1:"
";}i:2;i:5167;}i:219;a:3:{i:0;s:9:"linebreak";i:1;a:0:{}i:2;i:5168;}i:220;a:3:{i:0;s:7:"p_close";i:1;a:0:{}i:2;i:5170;}i:221;a:3:{i:0;s:13:"section_close";i:1;a:0:{}i:2;i:5172;}i:222;a:3:{i:0;s:12:"section_edit";i:1;a:4:{i:0;i:4989;i:1;i:5171;i:2;i:2;i:3;s:20:"16) PET Kart (Bruno)";}i:2;i:5172;}i:223;a:3:{i:0;s:6:"header";i:1;a:3:{i:0;s:26:"17) Portal CENAPET (Dante)";i:1;i:2;i:2;i:5172;}i:2;i:5172;}i:224;a:3:{i:0;s:12:"section_open";i:1;a:1:{i:0;i:2;}i:2;i:5172;}i:225;a:3:{i:0;s:10:"quote_open";i:1;a:0:{}i:2;i:5211;}i:226;a:3:{i:0;s:5:"cdata";i:1;a:1:{i:0;s:57:" Dante verificou se alguns documentos já estavam online.";}i:2;i:5213;}i:227;a:3:{i:0;s:11:"quote_close";i:1;a:0:{}i:2;i:5270;}i:228;a:3:{i:0;s:13:"section_close";i:1;a:0:{}i:2;i:5271;}i:229;a:3:{i:0;s:12:"section_edit";i:1;a:4:{i:0;i:5172;i:1;i:0;i:2;i:2;i:3;s:26:"17) Portal CENAPET (Dante)";}i:2;i:5271;}i:230;a:3:{i:0;s:12:"document_end";i:1;a:0:{}i:2;i:5271;}}