a:220:{i:0;a:3:{i:0;s:14:"document_start";i:1;a:0:{}i:2;i:0;}i:1;a:3:{i:0;s:6:"p_open";i:1;a:0:{}i:2;i:0;}i:2;a:3:{i:0;s:7:"p_close";i:1;a:0:{}i:2;i:1;}i:3;a:3:{i:0;s:12:"section_edit";i:1;a:4:{i:0;i:-1;i:1;i:0;i:2;i:1;i:3;s:0:"";}i:2;i:1;}i:4;a:3:{i:0;s:6:"header";i:1;a:3:{i:0;s:29:"Ata da reunião de 17/10/2006";i:1;i:1;i:2;i:1;}i:2;i:1;}i:5;a:3:{i:0;s:12:"section_open";i:1;a:1:{i:0;i:1;}i:2;i:1;}i:6;a:3:{i:0;s:6:"p_open";i:1;a:0:{}i:2;i:44;}i:7;a:3:{i:0;s:5:"cdata";i:1;a:1:{i:0;s:1:"
";}i:2;i:45;}i:8;a:3:{i:0;s:11:"strong_open";i:1;a:0:{}i:2;i:46;}i:9;a:3:{i:0;s:5:"cdata";i:1;a:1:{i:0;s:11:"Presentes: ";}i:2;i:48;}i:10;a:3:{i:0;s:12:"strong_close";i:1;a:0:{}i:2;i:59;}i:11;a:3:{i:0;s:5:"cdata";i:1;a:1:{i:0;s:101:"Alexandre, Dante, Fabiano, Felipe, Gabriela, Lucas Mizusaki, Marcelo, Marcos, Pablo, Ricardo, Thiago.";}i:2;i:61;}i:12;a:3:{i:0;s:7:"p_close";i:1;a:0:{}i:2;i:162;}i:13;a:3:{i:0;s:6:"p_open";i:1;a:0:{}i:2;i:162;}i:14;a:3:{i:0;s:11:"strong_open";i:1;a:0:{}i:2;i:164;}i:15;a:3:{i:0;s:5:"cdata";i:1;a:1:{i:0;s:10:"Ausentes: ";}i:2;i:166;}i:16;a:3:{i:0;s:12:"strong_close";i:1;a:0:{}i:2;i:176;}i:17;a:3:{i:0;s:5:"cdata";i:1;a:1:{i:0;s:8:" Nenhum.";}i:2;i:178;}i:18;a:3:{i:0;s:7:"p_close";i:1;a:0:{}i:2;i:186;}i:19;a:3:{i:0;s:6:"p_open";i:1;a:0:{}i:2;i:186;}i:20;a:3:{i:0;s:11:"strong_open";i:1;a:0:{}i:2;i:188;}i:21;a:3:{i:0;s:5:"cdata";i:1;a:1:{i:0;s:9:"Relator: ";}i:2;i:190;}i:22;a:3:{i:0;s:12:"strong_close";i:1;a:0:{}i:2;i:199;}i:23;a:3:{i:0;s:5:"cdata";i:1;a:1:{i:0;s:15:"Lucas Mizusaki.";}i:2;i:201;}i:24;a:3:{i:0;s:7:"p_close";i:1;a:0:{}i:2;i:216;}i:25;a:3:{i:0;s:13:"section_close";i:1;a:0:{}i:2;i:218;}i:26;a:3:{i:0;s:12:"section_edit";i:1;a:4:{i:0;i:1;i:1;i:217;i:2;i:1;i:3;s:29:"Ata da reunião de 17/10/2006";}i:2;i:218;}i:27;a:3:{i:0;s:6:"header";i:1;a:3:{i:0;s:11:"1) Interpet";i:1;i:3;i:2;i:218;}i:2;i:218;}i:28;a:3:{i:0;s:12:"section_open";i:1;a:1:{i:0;i:3;}i:2;i:218;}i:29;a:3:{i:0;s:6:"p_open";i:1;a:0:{}i:2;i:239;}i:30;a:3:{i:0;s:5:"cdata";i:1;a:1:{i:0;s:361:"
Após uma rápida discussão sobre o motivo pelo qual não são cobradas horas pendentes pelo Interpets, que se dá porque todos os bolsistas irão ao menos uma vez ao envento, o grupo decidiu, por contraste visual, revogar essa regra. Essa decisão ficou válida somente para os interpets, sendo que os interpetões continuam sem contar como horas pendentes.
";}i:2;i:240;}i:31;a:3:{i:0;s:7:"p_close";i:1;a:0:{}i:2;i:601;}i:32;a:3:{i:0;s:10:"listu_open";i:1;a:0:{}i:2;i:601;}i:33;a:3:{i:0;s:13:"listitem_open";i:1;a:1:{i:0;i:1;}i:2;i:601;}i:34;a:3:{i:0;s:16:"listcontent_open";i:1;a:0:{}i:2;i:601;}i:35;a:3:{i:0;s:5:"cdata";i:1;a:1:{i:0;s:265:" Nesse momento, Marcelo Zambiasi perguntou se é válido o trabalho em casa, pois muitas vezes é mais prático ou mais conveniente. A resposta foi de que é, mas para casos específicos e esporádicos, pois os bolsistas ainda devem contemplar seu horário na sala.";}i:2;i:605;}i:36;a:3:{i:0;s:17:"listcontent_close";i:1;a:0:{}i:2;i:870;}i:37;a:3:{i:0;s:14:"listitem_close";i:1;a:0:{}i:2;i:870;}i:38;a:3:{i:0;s:11:"listu_close";i:1;a:0:{}i:2;i:870;}i:39;a:3:{i:0;s:6:"p_open";i:1;a:0:{}i:2;i:870;}i:40;a:3:{i:0;s:5:"cdata";i:1;a:1:{i:0;s:66:"
Sobre a discussão do interpet, forma vistos os seguintes itens:
";}i:2;i:871;}i:41;a:3:{i:0;s:7:"p_close";i:1;a:0:{}i:2;i:937;}i:42;a:3:{i:0;s:10:"listu_open";i:1;a:0:{}i:2;i:937;}i:43;a:3:{i:0;s:13:"listitem_open";i:1;a:1:{i:0;i:1;}i:2;i:937;}i:44;a:3:{i:0;s:16:"listcontent_open";i:1;a:0:{}i:2;i:937;}i:45;a:3:{i:0;s:5:"cdata";i:1;a:1:{i:0;s:240:" 1) Relatos do ENAPET: Foi relatado que os outros grupos também desgotaram da extensão das discussões sore o regimento da CENAPET e gostariam de mais discussões entre áreas e de um espaço para publicações e trabalhos dos grupos PET.";}i:2;i:941;}i:46;a:3:{i:0;s:17:"listcontent_close";i:1;a:0:{}i:2;i:1181;}i:47;a:3:{i:0;s:14:"listitem_close";i:1;a:0:{}i:2;i:1181;}i:48;a:3:{i:0;s:13:"listitem_open";i:1;a:1:{i:0;i:1;}i:2;i:1181;}i:49;a:3:{i:0;s:16:"listcontent_open";i:1;a:0:{}i:2;i:1181;}i:50;a:3:{i:0;s:5:"cdata";i:1;a:1:{i:0;s:139:" 2) Estágios Extra Curriculares: Quase todos os grupos são a favor desses estágios, com excessão da Geografia que é totalmente contra.";}i:2;i:1185;}i:51;a:3:{i:0;s:17:"listcontent_close";i:1;a:0:{}i:2;i:1324;}i:52;a:3:{i:0;s:14:"listitem_close";i:1;a:0:{}i:2;i:1324;}i:53;a:3:{i:0;s:13:"listitem_open";i:1;a:1:{i:0;i:1;}i:2;i:1324;}i:54;a:3:{i:0;s:16:"listcontent_open";i:1;a:0:{}i:2;i:1324;}i:55;a:3:{i:0;s:5:"cdata";i:1;a:1:{i:0;s:128:" 3) INTERPETs: Sobre o agendamento das atividades, ficou decidido que é melhor rotacionar entre finais de semana e dias úteis.";}i:2;i:1328;}i:56;a:3:{i:0;s:17:"listcontent_close";i:1;a:0:{}i:2;i:1456;}i:57;a:3:{i:0;s:14:"listitem_close";i:1;a:0:{}i:2;i:1456;}i:58;a:3:{i:0;s:13:"listitem_open";i:1;a:1:{i:0;i:1;}i:2;i:1456;}i:59;a:3:{i:0;s:16:"listcontent_open";i:1;a:0:{}i:2;i:1456;}i:60;a:3:{i:0;s:5:"cdata";i:1;a:1:{i:0;s:145:" 4) Planejamento: Ele deev ser mandado para Brasília até o dia 30/10, e, por isso, ele tem até 6ª feira para ser revisado pelo comitê local.";}i:2;i:1460;}i:61;a:3:{i:0;s:17:"listcontent_close";i:1;a:0:{}i:2;i:1605;}i:62;a:3:{i:0;s:14:"listitem_close";i:1;a:0:{}i:2;i:1605;}i:63;a:3:{i:0;s:11:"listu_close";i:1;a:0:{}i:2;i:1605;}i:64;a:3:{i:0;s:13:"section_close";i:1;a:0:{}i:2;i:1607;}i:65;a:3:{i:0;s:12:"section_edit";i:1;a:4:{i:0;i:218;i:1;i:1606;i:2;i:3;i:3;s:11:"1) Interpet";}i:2;i:1607;}i:66;a:3:{i:0;s:6:"header";i:1;a:3:{i:0;s:44:"2) Ponto de Interrupção -&gt; Planejamento";i:1;i:3;i:2;i:1607;}i:2;i:1607;}i:67;a:3:{i:0;s:12:"section_open";i:1;a:1:{i:0;i:3;}i:2;i:1607;}i:68;a:3:{i:0;s:10:"quote_open";i:1;a:0:{}i:2;i:1662;}i:69;a:3:{i:0;s:10:"quote_open";i:1;a:0:{}i:2;i:1662;}i:70;a:3:{i:0;s:5:"cdata";i:1;a:1:{i:0;s:114:" O nosso planejamento já foi assinado pelo prof. Weber e ainda aguarda a revisão e a assinatura do prof. Johann.";}i:2;i:1665;}i:71;a:3:{i:0;s:11:"quote_close";i:1;a:0:{}i:2;i:1779;}i:72;a:3:{i:0;s:11:"quote_close";i:1;a:0:{}i:2;i:1779;}i:73;a:3:{i:0;s:10:"listu_open";i:1;a:0:{}i:2;i:1780;}i:74;a:3:{i:0;s:13:"listitem_open";i:1;a:1:{i:0;i:1;}i:2;i:1780;}i:75;a:3:{i:0;s:16:"listcontent_open";i:1;a:0:{}i:2;i:1780;}i:76;a:3:{i:0;s:5:"cdata";i:1;a:1:{i:0;s:321:" 5) Salão de Graduação: Pôster institucional e resumo do trabalho de cada grupo, além de uma apresentação oral de 15 minutos. Há uma dúvida pois está escrito que é um pôster por grupo, logo ficou decidido que devemos rever isso o quanto antes. Responsáveis: Felipe Flores, Alexandre Capra e Marcelo Zambiasi.";}i:2;i:1784;}i:77;a:3:{i:0;s:17:"listcontent_close";i:1;a:0:{}i:2;i:2105;}i:78;a:3:{i:0;s:14:"listitem_close";i:1;a:0:{}i:2;i:2105;}i:79;a:3:{i:0;s:13:"listitem_open";i:1;a:1:{i:0;i:1;}i:2;i:2105;}i:80;a:3:{i:0;s:16:"listcontent_open";i:1;a:0:{}i:2;i:2105;}i:81;a:3:{i:0;s:5:"cdata";i:1;a:1:{i:0;s:100:" 6) Projeto Rondon: Não participaremos, os grupos que coordenavam já fizeram a escolha do pessoal.";}i:2;i:2109;}i:82;a:3:{i:0;s:17:"listcontent_close";i:1;a:0:{}i:2;i:2209;}i:83;a:3:{i:0;s:14:"listitem_close";i:1;a:0:{}i:2;i:2209;}i:84;a:3:{i:0;s:13:"listitem_open";i:1;a:1:{i:0;i:1;}i:2;i:2209;}i:85;a:3:{i:0;s:16:"listcontent_open";i:1;a:0:{}i:2;i:2209;}i:86;a:3:{i:0;s:5:"cdata";i:1;a:1:{i:0;s:57:" 7) Sulpet: Início dos preparos já estão sendo feitos.";}i:2;i:2213;}i:87;a:3:{i:0;s:17:"listcontent_close";i:1;a:0:{}i:2;i:2270;}i:88;a:3:{i:0;s:14:"listitem_close";i:1;a:0:{}i:2;i:2270;}i:89;a:3:{i:0;s:11:"listu_close";i:1;a:0:{}i:2;i:2270;}i:90;a:3:{i:0;s:13:"section_close";i:1;a:0:{}i:2;i:2272;}i:91;a:3:{i:0;s:12:"section_edit";i:1;a:4:{i:0;i:1607;i:1;i:2271;i:2;i:3;i:3;s:44:"2) Ponto de Interrupção -&gt; Planejamento";}i:2;i:2272;}i:92;a:3:{i:0;s:6:"header";i:1;a:3:{i:0;s:16:"3)Site do PETgeo";i:1;i:3;i:2;i:2272;}i:2;i:2272;}i:93;a:3:{i:0;s:12:"section_open";i:1;a:1:{i:0;i:3;}i:2;i:2272;}i:94;a:3:{i:0;s:6:"p_open";i:1;a:0:{}i:2;i:2298;}i:95;a:3:{i:0;s:5:"cdata";i:1;a:1:{i:0;s:140:"
Marcos disse que recebeu um e-mail dizendo que o site do PETgeo já está pronto, Pablo já sabia disso e já o havia linkado com o portal.";}i:2;i:2299;}i:96;a:3:{i:0;s:7:"p_close";i:1;a:0:{}i:2;i:2439;}i:97;a:3:{i:0;s:13:"section_close";i:1;a:0:{}i:2;i:2441;}i:98;a:3:{i:0;s:12:"section_edit";i:1;a:4:{i:0;i:2272;i:1;i:2440;i:2;i:3;i:3;s:16:"3)Site do PETgeo";}i:2;i:2441;}i:99;a:3:{i:0;s:6:"header";i:1;a:3:{i:0;s:23:"4)Salão Jovem da UFRGS";i:1;i:3;i:2;i:2441;}i:2;i:2441;}i:100;a:3:{i:0;s:12:"section_open";i:1;a:1:{i:0;i:3;}i:2;i:2441;}i:101;a:3:{i:0;s:6:"p_open";i:1;a:0:{}i:2;i:2474;}i:102;a:3:{i:0;s:5:"cdata";i:1;a:1:{i:0;s:111:"
Após a definição de nossa participação no Salão, finalmente foi organizado o horário de apresentação.";}i:2;i:2475;}i:103;a:3:{i:0;s:7:"p_close";i:1;a:0:{}i:2;i:2586;}i:104;a:3:{i:0;s:13:"section_close";i:1;a:0:{}i:2;i:2588;}i:105;a:3:{i:0;s:12:"section_edit";i:1;a:4:{i:0;i:2441;i:1;i:2587;i:2;i:3;i:3;s:23:"4)Salão Jovem da UFRGS";}i:2;i:2588;}i:106;a:3:{i:0;s:6:"header";i:1;a:3:{i:0;s:42:"5)Cumprimento horário Gabi semana passada";i:1;i:3;i:2;i:2588;}i:2;i:2588;}i:107;a:3:{i:0;s:12:"section_open";i:1;a:1:{i:0;i:3;}i:2;i:2588;}i:108;a:3:{i:0;s:6:"p_open";i:1;a:0:{}i:2;i:2640;}i:109;a:3:{i:0;s:5:"cdata";i:1;a:1:{i:0;s:154:"
Como havia o feriadão e a semana estava cheia de provas, a Gabriela não conseguiu completar as seis horas mínimas na semana passada porque não notou.";}i:2;i:2641;}i:110;a:3:{i:0;s:7:"p_close";i:1;a:0:{}i:2;i:2795;}i:111;a:3:{i:0;s:13:"section_close";i:1;a:0:{}i:2;i:2797;}i:112;a:3:{i:0;s:12:"section_edit";i:1;a:4:{i:0;i:2588;i:1;i:2796;i:2;i:3;i:3;s:42:"5)Cumprimento horário Gabi semana passada";}i:2;i:2797;}i:113;a:3:{i:0;s:6:"header";i:1;a:3:{i:0;s:42:"6) Curso de C/Robótica na escola técnica";i:1;i:3;i:2;i:2797;}i:2;i:2797;}i:114;a:3:{i:0;s:12:"section_open";i:1;a:1:{i:0;i:3;}i:2;i:2797;}i:115;a:3:{i:0;s:6:"p_open";i:1;a:0:{}i:2;i:2849;}i:116;a:3:{i:0;s:5:"cdata";i:1;a:1:{i:0;s:353:"
Os responsáveis pelo trabalho na escola técnica comentaram que a professora queria um curso de C avançado voltado para a robótica e mais uma palestra do prof. Dante. A palestra irá ser realizda, mas ainda falta definir o que será lecionado no curso, Thiago comentou que possuímos o PIC e o rádio e devemos levar esse material para a professora.";}i:2;i:2850;}i:117;a:3:{i:0;s:7:"p_close";i:1;a:0:{}i:2;i:3203;}i:118;a:3:{i:0;s:13:"section_close";i:1;a:0:{}i:2;i:3205;}i:119;a:3:{i:0;s:12:"section_edit";i:1;a:4:{i:0;i:2797;i:1;i:3204;i:2;i:3;i:3;s:42:"6) Curso de C/Robótica na escola técnica";}i:2;i:3205;}i:120;a:3:{i:0;s:6:"header";i:1;a:3:{i:0;s:25:"7) Seleção de Bolsistas";i:1;i:3;i:2;i:3205;}i:2;i:3205;}i:121;a:3:{i:0;s:12:"section_open";i:1;a:1:{i:0;i:3;}i:2;i:3205;}i:122;a:3:{i:0;s:6:"p_open";i:1;a:0:{}i:2;i:3240;}i:123;a:3:{i:0;s:5:"cdata";i:1;a:1:{i:0;s:196:"
Como o Johann não pode participar da seleção, ficou decidido que ela será feita pelos profs. Weber, Dante e pela comissão de seleção. Um roteiro está sendo feito para acelerar entrevista.";}i:2;i:3241;}i:124;a:3:{i:0;s:7:"p_close";i:1;a:0:{}i:2;i:3437;}i:125;a:3:{i:0;s:13:"section_close";i:1;a:0:{}i:2;i:3439;}i:126;a:3:{i:0;s:12:"section_edit";i:1;a:4:{i:0;i:3205;i:1;i:3438;i:2;i:3;i:3;s:25:"7) Seleção de Bolsistas";}i:2;i:3439;}i:127;a:3:{i:0;s:6:"header";i:1;a:3:{i:0;s:31:"8) Avaliação do Grupo - Dante";i:1;i:3;i:2;i:3439;}i:2;i:3439;}i:128;a:3:{i:0;s:12:"section_open";i:1;a:1:{i:0;i:3;}i:2;i:3439;}i:129;a:3:{i:0;s:13:"section_close";i:1;a:0:{}i:2;i:3482;}i:130;a:3:{i:0;s:12:"section_edit";i:1;a:4:{i:0;i:3439;i:1;i:3481;i:2;i:3;i:3;s:31:"8) Avaliação do Grupo - Dante";}i:2;i:3482;}i:131;a:3:{i:0;s:6:"header";i:1;a:3:{i:0;s:31:"9) Avaliação do Dante - Grupo";i:1;i:3;i:2;i:3482;}i:2;i:3482;}i:132;a:3:{i:0;s:12:"section_open";i:1;a:1:{i:0;i:3;}i:2;i:3482;}i:133;a:3:{i:0;s:6:"p_open";i:1;a:0:{}i:2;i:3523;}i:134;a:3:{i:0;s:5:"cdata";i:1;a:1:{i:0;s:83:"
Esses pontos foram cancelados por causa do curto tempo e da extensão da reunião.";}i:2;i:3524;}i:135;a:3:{i:0;s:7:"p_close";i:1;a:0:{}i:2;i:3607;}i:136;a:3:{i:0;s:13:"section_close";i:1;a:0:{}i:2;i:3609;}i:137;a:3:{i:0;s:12:"section_edit";i:1;a:4:{i:0;i:3482;i:1;i:3608;i:2;i:3;i:3;s:31:"9) Avaliação do Dante - Grupo";}i:2;i:3609;}i:138;a:3:{i:0;s:6:"header";i:1;a:3:{i:0;s:32:"10) Comissão dos 18 anos do PET";i:1;i:3;i:2;i:3609;}i:2;i:3609;}i:139;a:3:{i:0;s:12:"section_open";i:1;a:1:{i:0;i:3;}i:2;i:3609;}i:140;a:3:{i:0;s:6:"p_open";i:1;a:0:{}i:2;i:3651;}i:141;a:3:{i:0;s:5:"cdata";i:1;a:1:{i:0;s:199:"
Informalmente está pronto, Marcos está mandando e-mails sobre o debate, mas ainda não obteve resposta. Eles também estão retomando o contato com Mandel e vão guardar os pôsteres para o museu.";}i:2;i:3652;}i:142;a:3:{i:0;s:7:"p_close";i:1;a:0:{}i:2;i:3851;}i:143;a:3:{i:0;s:13:"section_close";i:1;a:0:{}i:2;i:3853;}i:144;a:3:{i:0;s:12:"section_edit";i:1;a:4:{i:0;i:3609;i:1;i:3852;i:2;i:3;i:3;s:32:"10) Comissão dos 18 anos do PET";}i:2;i:3853;}i:145;a:3:{i:0;s:6:"header";i:1;a:3:{i:0;s:33:"11) Atividades dos novos Petianos";i:1;i:3;i:2;i:3853;}i:2;i:3853;}i:146;a:3:{i:0;s:12:"section_open";i:1;a:1:{i:0;i:3;}i:2;i:3853;}i:147;a:3:{i:0;s:6:"p_open";i:1;a:0:{}i:2;i:3896;}i:148;a:3:{i:0;s:5:"cdata";i:1;a:1:{i:0;s:239:"
Como os novos bolsistas participarão da nova reunião, vimos as atividades nas quais eles podem ser encaminhados: Uma pesquisa sobre tecnologias de Acessibilidade, Inclusão digital, Manutenção do Site e Banco de dados dos Ex-petianos.";}i:2;i:3897;}i:149;a:3:{i:0;s:7:"p_close";i:1;a:0:{}i:2;i:4136;}i:150;a:3:{i:0;s:13:"section_close";i:1;a:0:{}i:2;i:4138;}i:151;a:3:{i:0;s:12:"section_edit";i:1;a:4:{i:0;i:3853;i:1;i:4137;i:2;i:3;i:3;s:33:"11) Atividades dos novos Petianos";}i:2;i:4138;}i:152;a:3:{i:0;s:6:"header";i:1;a:3:{i:0;s:34:"12) Banco de dados dos Ex-petianos";i:1;i:3;i:2;i:4138;}i:2;i:4138;}i:153;a:3:{i:0;s:12:"section_open";i:1;a:1:{i:0;i:3;}i:2;i:4138;}i:154;a:3:{i:0;s:6:"p_open";i:1;a:0:{}i:2;i:4182;}i:155;a:3:{i:0;s:5:"cdata";i:1;a:1:{i:0;s:120:"
A pesquisa já está em andamento, a página já está no trac e está sendo planejado um churrasco com os ex-petianos.";}i:2;i:4183;}i:156;a:3:{i:0;s:7:"p_close";i:1;a:0:{}i:2;i:4303;}i:157;a:3:{i:0;s:13:"section_close";i:1;a:0:{}i:2;i:4305;}i:158;a:3:{i:0;s:12:"section_edit";i:1;a:4:{i:0;i:4138;i:1;i:4304;i:2;i:3;i:3;s:34:"12) Banco de dados dos Ex-petianos";}i:2;i:4305;}i:159;a:3:{i:0;s:6:"header";i:1;a:3:{i:0;s:22:"13) Encontro no Tubino";i:1;i:3;i:2;i:4305;}i:2;i:4305;}i:160;a:3:{i:0;s:12:"section_open";i:1;a:1:{i:0;i:3;}i:2;i:4305;}i:161;a:3:{i:0;s:6:"p_open";i:1;a:0:{}i:2;i:4337;}i:162;a:3:{i:0;s:5:"cdata";i:1;a:1:{i:0;s:280:"
Capre, Estevão, Fabiano, Ricardo, Alessandro e Lucas Mizusaki participaram, foi dada a história da robótica e o material de física. Também foram agendados os próximos encontros: dias 27/10 10/11 e 24/11 (ou dia 17/11, para coincidir com a comemoração dos 18 anos do PET).";}i:2;i:4338;}i:163;a:3:{i:0;s:7:"p_close";i:1;a:0:{}i:2;i:4618;}i:164;a:3:{i:0;s:13:"section_close";i:1;a:0:{}i:2;i:4620;}i:165;a:3:{i:0;s:12:"section_edit";i:1;a:4:{i:0;i:4305;i:1;i:4619;i:2;i:3;i:3;s:22:"13) Encontro no Tubino";}i:2;i:4620;}i:166;a:3:{i:0;s:6:"header";i:1;a:3:{i:0;s:19:"14) Gravador de PIC";i:1;i:3;i:2;i:4620;}i:2;i:4620;}i:167;a:3:{i:0;s:12:"section_open";i:1;a:1:{i:0;i:3;}i:2;i:4620;}i:168;a:3:{i:0;s:6:"p_open";i:1;a:0:{}i:2;i:4649;}i:169;a:3:{i:0;s:5:"cdata";i:1;a:1:{i:0;s:81:"
Comprado mas houve problemas na recepção, foi pedido o reenvio dele por Sedex.";}i:2;i:4650;}i:170;a:3:{i:0;s:7:"p_close";i:1;a:0:{}i:2;i:4731;}i:171;a:3:{i:0;s:13:"section_close";i:1;a:0:{}i:2;i:4733;}i:172;a:3:{i:0;s:12:"section_edit";i:1;a:4:{i:0;i:4620;i:1;i:4732;i:2;i:3;i:3;s:19:"14) Gravador de PIC";}i:2;i:4733;}i:173;a:3:{i:0;s:6:"header";i:1;a:3:{i:0;s:18:"15) Atas Atrasadas";i:1;i:3;i:2;i:4733;}i:2;i:4733;}i:174;a:3:{i:0;s:12:"section_open";i:1;a:1:{i:0;i:3;}i:2;i:4733;}i:175;a:3:{i:0;s:6:"p_open";i:1;a:0:{}i:2;i:4761;}i:176;a:3:{i:0;s:5:"cdata";i:1;a:1:{i:0;s:127:"
Foi comentado que o tempo para a colocação das Atas no trac é de dois dias, logo todos devemos ser mais assíduos com isso.";}i:2;i:4762;}i:177;a:3:{i:0;s:7:"p_close";i:1;a:0:{}i:2;i:4889;}i:178;a:3:{i:0;s:13:"section_close";i:1;a:0:{}i:2;i:4891;}i:179;a:3:{i:0;s:12:"section_edit";i:1;a:4:{i:0;i:4733;i:1;i:4890;i:2;i:3;i:3;s:18:"15) Atas Atrasadas";}i:2;i:4891;}i:180;a:3:{i:0;s:6:"header";i:1;a:3:{i:0;s:30:"16) Responsável pelo Hardware";i:1;i:3;i:2;i:4891;}i:2;i:4891;}i:181;a:3:{i:0;s:12:"section_open";i:1;a:1:{i:0;i:3;}i:2;i:4891;}i:182;a:3:{i:0;s:6:"p_open";i:1;a:0:{}i:2;i:4931;}i:183;a:3:{i:0;s:5:"cdata";i:1;a:1:{i:0;s:84:"
Com a saída do Estevão, Capra ficou como sendo o novo responsável pelo Hardware.";}i:2;i:4932;}i:184;a:3:{i:0;s:7:"p_close";i:1;a:0:{}i:2;i:5016;}i:185;a:3:{i:0;s:13:"section_close";i:1;a:0:{}i:2;i:5018;}i:186;a:3:{i:0;s:12:"section_edit";i:1;a:4:{i:0;i:4891;i:1;i:5017;i:2;i:3;i:3;s:30:"16) Responsável pelo Hardware";}i:2;i:5018;}i:187;a:3:{i:0;s:6:"header";i:1;a:3:{i:0;s:13:"17) Gabinetes";i:1;i:3;i:2;i:5018;}i:2;i:5018;}i:188;a:3:{i:0;s:12:"section_open";i:1;a:1:{i:0;i:3;}i:2;i:5018;}i:189;a:3:{i:0;s:6:"p_open";i:1;a:0:{}i:2;i:5041;}i:190;a:3:{i:0;s:5:"cdata";i:1;a:1:{i:0;s:55:"
Já foram comprados, só falta trazê-los para a sala.";}i:2;i:5042;}i:191;a:3:{i:0;s:7:"p_close";i:1;a:0:{}i:2;i:5097;}i:192;a:3:{i:0;s:13:"section_close";i:1;a:0:{}i:2;i:5099;}i:193;a:3:{i:0;s:12:"section_edit";i:1;a:4:{i:0;i:5018;i:1;i:5098;i:2;i:3;i:3;s:13:"17) Gabinetes";}i:2;i:5099;}i:194;a:3:{i:0;s:6:"header";i:1;a:3:{i:0;s:17:"18) Salão da PUC";i:1;i:3;i:2;i:5099;}i:2;i:5099;}i:195;a:3:{i:0;s:12:"section_open";i:1;a:1:{i:0;i:3;}i:2;i:5099;}i:196;a:3:{i:0;s:6:"p_open";i:1;a:0:{}i:2;i:5126;}i:197;a:3:{i:0;s:5:"cdata";i:1;a:1:{i:0;s:312:"
Os pôsteres já estão na gráfica e os slides estão sendo acabados. Devemos ter um dos responsáveis e o orientador na abertura do salão, e isso ainda está para ser visto. O prof. Dante está vendo se podemos participar do projeto LIFAPOR de livros falados para ver se fazemos livros falados dos pôsteres.";}i:2;i:5127;}i:198;a:3:{i:0;s:7:"p_close";i:1;a:0:{}i:2;i:5439;}i:199;a:3:{i:0;s:13:"section_close";i:1;a:0:{}i:2;i:5441;}i:200;a:3:{i:0;s:12:"section_edit";i:1;a:4:{i:0;i:5099;i:1;i:5440;i:2;i:3;i:3;s:17:"18) Salão da PUC";}i:2;i:5441;}i:201;a:3:{i:0;s:6:"header";i:1;a:3:{i:0;s:17:"19) Apoio Cenapet";i:1;i:3;i:2;i:5441;}i:2;i:5441;}i:202;a:3:{i:0;s:12:"section_open";i:1;a:1:{i:0;i:3;}i:2;i:5441;}i:203;a:3:{i:0;s:6:"p_open";i:1;a:0:{}i:2;i:5468;}i:204;a:3:{i:0;s:5:"cdata";i:1;a:1:{i:0;s:130:"
Dante relatou a reunião, que foi ruim graças à relação do MEC com o PET. Ele pediu para que acompamnhássemos esse problema.";}i:2;i:5469;}i:205;a:3:{i:0;s:7:"p_close";i:1;a:0:{}i:2;i:5599;}i:206;a:3:{i:0;s:13:"section_close";i:1;a:0:{}i:2;i:5601;}i:207;a:3:{i:0;s:12:"section_edit";i:1;a:4:{i:0;i:5441;i:1;i:5600;i:2;i:3;i:3;s:17:"19) Apoio Cenapet";}i:2;i:5601;}i:208;a:3:{i:0;s:6:"header";i:1;a:3:{i:0;s:12:"21) Frigobar";i:1;i:3;i:2;i:5601;}i:2;i:5601;}i:209;a:3:{i:0;s:12:"section_open";i:1;a:1:{i:0;i:3;}i:2;i:5601;}i:210;a:3:{i:0;s:6:"p_open";i:1;a:0:{}i:2;i:5623;}i:211;a:3:{i:0;s:5:"cdata";i:1;a:1:{i:0;s:197:"
Foi comentado se seria válido usar o resto do dinheiro do projeto das escolas técnicas par comprar um frigobar. Não é, mas ele pode ser comprado com uma colboração entre o PET e os petianos.";}i:2;i:5624;}i:212;a:3:{i:0;s:7:"p_close";i:1;a:0:{}i:2;i:5821;}i:213;a:3:{i:0;s:13:"section_close";i:1;a:0:{}i:2;i:5823;}i:214;a:3:{i:0;s:12:"section_edit";i:1;a:4:{i:0;i:5601;i:1;i:5822;i:2;i:3;i:3;s:12:"21) Frigobar";}i:2;i:5823;}i:215;a:3:{i:0;s:6:"header";i:1;a:3:{i:0;s:52:"21) Discussão sorbe os relatórios do mês anterior";i:1;i:3;i:2;i:5823;}i:2;i:5823;}i:216;a:3:{i:0;s:12:"section_open";i:1;a:1:{i:0;i:3;}i:2;i:5823;}i:217;a:3:{i:0;s:13:"section_close";i:1;a:0:{}i:2;i:5886;}i:218;a:3:{i:0;s:12:"section_edit";i:1;a:4:{i:0;i:5823;i:1;i:0;i:2;i:3;i:3;s:52:"21) Discussão sorbe os relatórios do mês anterior";}i:2;i:5886;}i:219;a:3:{i:0;s:12:"document_end";i:1;a:0:{}i:2;i:5886;}}