a:169:{i:0;a:3:{i:0;s:14:"document_start";i:1;a:0:{}i:2;i:0;}i:1;a:3:{i:0;s:6:"p_open";i:1;a:0:{}i:2;i:0;}i:2;a:3:{i:0;s:7:"p_close";i:1;a:0:{}i:2;i:1;}i:3;a:3:{i:0;s:12:"section_edit";i:1;a:4:{i:0;i:-1;i:1;i:0;i:2;i:1;i:3;s:0:"";}i:2;i:1;}i:4;a:3:{i:0;s:6:"header";i:1;a:3:{i:0;s:29:"Ata da reunião de 03/01/2007";i:1;i:1;i:2;i:1;}i:2;i:1;}i:5;a:3:{i:0;s:12:"section_open";i:1;a:1:{i:0;i:1;}i:2;i:1;}i:6;a:3:{i:0;s:6:"p_open";i:1;a:0:{}i:2;i:44;}i:7;a:3:{i:0;s:5:"cdata";i:1;a:1:{i:0;s:1:"
";}i:2;i:45;}i:8;a:3:{i:0;s:11:"strong_open";i:1;a:0:{}i:2;i:46;}i:9;a:3:{i:0;s:5:"cdata";i:1;a:1:{i:0;s:11:"Presentes: ";}i:2;i:48;}i:10;a:3:{i:0;s:12:"strong_close";i:1;a:0:{}i:2;i:59;}i:11;a:3:{i:0;s:5:"cdata";i:1;a:1:{i:0;s:110:"Alexandre, Antônio, Bruno, Dante, Felipe, Gabriela, Ismael, Lucas Mizusaki, Marcelo, Marcos, Ricardo, Victor.";}i:2;i:61;}i:12;a:3:{i:0;s:7:"p_close";i:1;a:0:{}i:2;i:171;}i:13;a:3:{i:0;s:6:"p_open";i:1;a:0:{}i:2;i:171;}i:14;a:3:{i:0;s:11:"strong_open";i:1;a:0:{}i:2;i:173;}i:15;a:3:{i:0;s:5:"cdata";i:1;a:1:{i:0;s:10:"Ausentes: ";}i:2;i:175;}i:16;a:3:{i:0;s:12:"strong_close";i:1;a:0:{}i:2;i:185;}i:17;a:3:{i:0;s:5:"cdata";i:1;a:1:{i:0;s:44:" Thiago, Portal e Fabiano (os 3 de férias).";}i:2;i:187;}i:18;a:3:{i:0;s:7:"p_close";i:1;a:0:{}i:2;i:231;}i:19;a:3:{i:0;s:6:"p_open";i:1;a:0:{}i:2;i:231;}i:20;a:3:{i:0;s:11:"strong_open";i:1;a:0:{}i:2;i:233;}i:21;a:3:{i:0;s:5:"cdata";i:1;a:1:{i:0;s:9:"Relator: ";}i:2;i:235;}i:22;a:3:{i:0;s:12:"strong_close";i:1;a:0:{}i:2;i:244;}i:23;a:3:{i:0;s:5:"cdata";i:1;a:1:{i:0;s:7:"Victor.";}i:2;i:246;}i:24;a:3:{i:0;s:7:"p_close";i:1;a:0:{}i:2;i:253;}i:25;a:3:{i:0;s:13:"section_close";i:1;a:0:{}i:2;i:255;}i:26;a:3:{i:0;s:12:"section_edit";i:1;a:4:{i:0;i:1;i:1;i:254;i:2;i:1;i:3;s:29:"Ata da reunião de 03/01/2007";}i:2;i:255;}i:27;a:3:{i:0;s:6:"header";i:1;a:3:{i:0;s:44:"1) Remoção das peças do museu da sala 107";i:1;i:3;i:2;i:255;}i:2;i:255;}i:28;a:3:{i:0;s:12:"section_open";i:1;a:1:{i:0;i:3;}i:2;i:255;}i:29;a:3:{i:0;s:6:"p_open";i:1;a:0:{}i:2;i:309;}i:30;a:3:{i:0;s:5:"cdata";i:1;a:1:{i:0;s:159:"
A situação encontra-se indefinida. Dante recebe ligação da Silvânia e fica de tratar em reunião com o professor Flávio sobre o que fazer com as peças.";}i:2;i:310;}i:31;a:3:{i:0;s:7:"p_close";i:1;a:0:{}i:2;i:469;}i:32;a:3:{i:0;s:13:"section_close";i:1;a:0:{}i:2;i:471;}i:33;a:3:{i:0;s:12:"section_edit";i:1;a:4:{i:0;i:255;i:1;i:470;i:2;i:3;i:3;s:44:"1) Remoção das peças do museu da sala 107";}i:2;i:471;}i:34;a:3:{i:0;s:6:"header";i:1;a:3:{i:0;s:14:"2) Curso de C#";i:1;i:3;i:2;i:471;}i:2;i:471;}i:35;a:3:{i:0;s:12:"section_open";i:1;a:1:{i:0;i:3;}i:2;i:471;}i:36;a:3:{i:0;s:6:"p_open";i:1;a:0:{}i:2;i:495;}i:37;a:3:{i:0;s:5:"cdata";i:1;a:1:{i:0;s:68:"
Flores mandou email para o diretor tecnoPuc e não recebeu resposta";}i:2;i:496;}i:38;a:3:{i:0;s:6:"entity";i:1;a:1:{i:0;s:3:"...";}i:2;i:564;}i:39;a:3:{i:0;s:5:"cdata";i:1;a:1:{i:0;s:105:" Então mandou novo email, porém este com anexo para a professora Giraffa.. Também nao recebeu retorno.";}i:2;i:567;}i:40;a:3:{i:0;s:7:"p_close";i:1;a:0:{}i:2;i:672;}i:41;a:3:{i:0;s:13:"section_close";i:1;a:0:{}i:2;i:674;}i:42;a:3:{i:0;s:12:"section_edit";i:1;a:4:{i:0;i:471;i:1;i:673;i:2;i:3;i:3;s:14:"2) Curso de C#";}i:2;i:674;}i:43;a:3:{i:0;s:6:"header";i:1;a:3:{i:0;s:11:"3) Câmeras";i:1;i:3;i:2;i:674;}i:2;i:674;}i:44;a:3:{i:0;s:12:"section_open";i:1;a:1:{i:0;i:3;}i:2;i:674;}i:45;a:3:{i:0;s:6:"p_open";i:1;a:0:{}i:2;i:695;}i:46;a:3:{i:0;s:5:"cdata";i:1;a:1:{i:0;s:38:"
Ainda nao ficou decidido o que fazer.";}i:2;i:696;}i:47;a:3:{i:0;s:7:"p_close";i:1;a:0:{}i:2;i:734;}i:48;a:3:{i:0;s:13:"section_close";i:1;a:0:{}i:2;i:736;}i:49;a:3:{i:0;s:12:"section_edit";i:1;a:4:{i:0;i:674;i:1;i:735;i:2;i:3;i:3;s:11:"3) Câmeras";}i:2;i:736;}i:50;a:3:{i:0;s:6:"header";i:1;a:3:{i:0;s:23:"4) Planejamento PROGRAD";i:1;i:3;i:2;i:736;}i:2;i:736;}i:51;a:3:{i:0;s:12:"section_open";i:1;a:1:{i:0;i:3;}i:2;i:736;}i:52;a:3:{i:0;s:6:"p_open";i:1;a:0:{}i:2;i:769;}i:53;a:3:{i:0;s:5:"cdata";i:1;a:1:{i:0;s:59:"
Amanhã Ismael mandará o planejamento do mês de janeiro.";}i:2;i:770;}i:54;a:3:{i:0;s:7:"p_close";i:1;a:0:{}i:2;i:829;}i:55;a:3:{i:0;s:13:"section_close";i:1;a:0:{}i:2;i:831;}i:56;a:3:{i:0;s:12:"section_edit";i:1;a:4:{i:0;i:736;i:1;i:830;i:2;i:3;i:3;s:23:"4) Planejamento PROGRAD";}i:2;i:831;}i:57;a:3:{i:0;s:6:"header";i:1;a:3:{i:0;s:33:"5) Partes do Trac não utilizadas";i:1;i:3;i:2;i:831;}i:2;i:831;}i:58;a:3:{i:0;s:12:"section_open";i:1;a:1:{i:0;i:3;}i:2;i:831;}i:59;a:3:{i:0;s:6:"p_open";i:1;a:0:{}i:2;i:874;}i:60;a:3:{i:0;s:5:"cdata";i:1;a:1:{i:0;s:70:"
Gabi pegará os links não utilizados e botará eles em outra seção";}i:2;i:875;}i:61;a:3:{i:0;s:7:"p_close";i:1;a:0:{}i:2;i:945;}i:62;a:3:{i:0;s:13:"section_close";i:1;a:0:{}i:2;i:947;}i:63;a:3:{i:0;s:12:"section_edit";i:1;a:4:{i:0;i:831;i:1;i:946;i:2;i:3;i:3;s:33:"5) Partes do Trac não utilizadas";}i:2;i:947;}i:64;a:3:{i:0;s:6:"header";i:1;a:3:{i:0;s:47:"6) Cumprimentos de horários parciais de verão";i:1;i:3;i:2;i:947;}i:2;i:947;}i:65;a:3:{i:0;s:12:"section_open";i:1;a:1:{i:0;i:3;}i:2;i:947;}i:66;a:3:{i:0;s:6:"p_open";i:1;a:0:{}i:2;i:1004;}i:67;a:3:{i:0;s:5:"cdata";i:1;a:1:{i:0;s:144:"
Felipe montou uma tabela (está no mural) indicando as horas já feitas (em dezembro) e as horas a serem cumpridas pelos petianos (em janeiro).";}i:2;i:1005;}i:68;a:3:{i:0;s:7:"p_close";i:1;a:0:{}i:2;i:1149;}i:69;a:3:{i:0;s:13:"section_close";i:1;a:0:{}i:2;i:1151;}i:70;a:3:{i:0;s:12:"section_edit";i:1;a:4:{i:0;i:947;i:1;i:1150;i:2;i:3;i:3;s:47:"6) Cumprimentos de horários parciais de verão";}i:2;i:1151;}i:71;a:3:{i:0;s:6:"header";i:1;a:3:{i:0;s:52:"7) Marcação da discussão dos relatórios semanais";i:1;i:3;i:2;i:1151;}i:2;i:1151;}i:72;a:3:{i:0;s:12:"section_open";i:1;a:1:{i:0;i:3;}i:2;i:1151;}i:73;a:3:{i:0;s:6:"p_open";i:1;a:0:{}i:2;i:1213;}i:74;a:3:{i:0;s:5:"cdata";i:1;a:1:{i:0;s:58:"
Foi marcado para terça-feira da semana que vem às 14:30";}i:2;i:1214;}i:75;a:3:{i:0;s:7:"p_close";i:1;a:0:{}i:2;i:1272;}i:76;a:3:{i:0;s:13:"section_close";i:1;a:0:{}i:2;i:1274;}i:77;a:3:{i:0;s:12:"section_edit";i:1;a:4:{i:0;i:1151;i:1;i:1273;i:2;i:3;i:3;s:52:"7) Marcação da discussão dos relatórios semanais";}i:2;i:1274;}i:78;a:3:{i:0;s:6:"header";i:1;a:3:{i:0;s:84:"8) Certificado de participação no Pet de Tércio / Créditos complementares do PET";i:1;i:3;i:2;i:1274;}i:2;i:1274;}i:79;a:3:{i:0;s:12:"section_open";i:1;a:1:{i:0;i:3;}i:2;i:1274;}i:80;a:3:{i:0;s:6:"p_open";i:1;a:0:{}i:2;i:1368;}i:81;a:3:{i:0;s:5:"cdata";i:1;a:1:{i:0;s:156:"
Flores conseguiu o certificado do Tércio e o Dante assinou. Quanto aos créditos complementares, Dante acha que são 4 créditos se ficar pelo menos 1 ano";}i:2;i:1369;}i:82;a:3:{i:0;s:7:"p_close";i:1;a:0:{}i:2;i:1525;}i:83;a:3:{i:0;s:13:"section_close";i:1;a:0:{}i:2;i:1527;}i:84;a:3:{i:0;s:12:"section_edit";i:1;a:4:{i:0;i:1274;i:1;i:1526;i:2;i:3;i:3;s:84:"8) Certificado de participação no Pet de Tércio / Créditos complementares do PET";}i:2;i:1527;}i:85;a:3:{i:0;s:6:"header";i:1;a:3:{i:0;s:23:"9) Acesso a impressoras";i:1;i:3;i:2;i:1527;}i:2;i:1527;}i:86;a:3:{i:0;s:12:"section_open";i:1;a:1:{i:0;i:3;}i:2;i:1527;}i:87;a:3:{i:0;s:6:"p_open";i:1;a:0:{}i:2;i:1560;}i:88;a:3:{i:0;s:5:"cdata";i:1;a:1:{i:0;s:86:"
Existe um benefício para bolsistas de usarem mais impressoras.. Felipe vai pesquisar";}i:2;i:1561;}i:89;a:3:{i:0;s:7:"p_close";i:1;a:0:{}i:2;i:1647;}i:90;a:3:{i:0;s:13:"section_close";i:1;a:0:{}i:2;i:1649;}i:91;a:3:{i:0;s:12:"section_edit";i:1;a:4:{i:0;i:1527;i:1;i:1648;i:2;i:3;i:3;s:23:"9) Acesso a impressoras";}i:2;i:1649;}i:92;a:3:{i:0;s:6:"header";i:1;a:3:{i:0;s:32:"10) Férias de janeiro/fevereiro";i:1;i:3;i:2;i:1649;}i:2;i:1649;}i:93;a:3:{i:0;s:12:"section_open";i:1;a:1:{i:0;i:3;}i:2;i:1649;}i:94;a:3:{i:0;s:6:"p_open";i:1;a:0:{}i:2;i:1691;}i:95;a:3:{i:0;s:5:"cdata";i:1;a:1:{i:0;s:101:"
Fabiano está de férias (1 semana) Portal está de férias (2 semanas) Irão recuperar em fevereiro";}i:2;i:1692;}i:96;a:3:{i:0;s:7:"p_close";i:1;a:0:{}i:2;i:1793;}i:97;a:3:{i:0;s:13:"section_close";i:1;a:0:{}i:2;i:1795;}i:98;a:3:{i:0;s:12:"section_edit";i:1;a:4:{i:0;i:1649;i:1;i:1794;i:2;i:3;i:3;s:32:"10) Férias de janeiro/fevereiro";}i:2;i:1795;}i:99;a:3:{i:0;s:6:"header";i:1;a:3:{i:0;s:41:"11) Relatório de extensão do curso de C";i:1;i:3;i:2;i:1795;}i:2;i:1795;}i:100;a:3:{i:0;s:12:"section_open";i:1;a:1:{i:0;i:3;}i:2;i:1795;}i:101;a:3:{i:0;s:6:"p_open";i:1;a:0:{}i:2;i:1846;}i:102;a:3:{i:0;s:5:"cdata";i:1;a:1:{i:0;s:60:"
Devido a espera das senhas, o cadastramento começará hoje";}i:2;i:1847;}i:103;a:3:{i:0;s:7:"p_close";i:1;a:0:{}i:2;i:1907;}i:104;a:3:{i:0;s:13:"section_close";i:1;a:0:{}i:2;i:1909;}i:105;a:3:{i:0;s:12:"section_edit";i:1;a:4:{i:0;i:1795;i:1;i:1908;i:2;i:3;i:3;s:41:"11) Relatório de extensão do curso de C";}i:2;i:1909;}i:106;a:3:{i:0;s:6:"header";i:1;a:3:{i:0;s:33:"12) Atualizações do site do PET";i:1;i:3;i:2;i:1909;}i:2;i:1909;}i:107;a:3:{i:0;s:12:"section_open";i:1;a:1:{i:0;i:3;}i:2;i:1909;}i:108;a:3:{i:0;s:6:"p_open";i:1;a:0:{}i:2;i:1952;}i:109;a:3:{i:0;s:5:"cdata";i:1;a:1:{i:0;s:114:"
Quem tiver idéias para o colocar no site do pet, podem enviar. Sugestões para o portal também são bem vindas.";}i:2;i:1953;}i:110;a:3:{i:0;s:7:"p_close";i:1;a:0:{}i:2;i:2067;}i:111;a:3:{i:0;s:13:"section_close";i:1;a:0:{}i:2;i:2069;}i:112;a:3:{i:0;s:12:"section_edit";i:1;a:4:{i:0;i:1909;i:1;i:2068;i:2;i:3;i:3;s:33:"12) Atualizações do site do PET";}i:2;i:2069;}i:113;a:3:{i:0;s:6:"header";i:1;a:3:{i:0;s:36:"13) Cadastramento do projeto RoboEDU";i:1;i:3;i:2;i:2069;}i:2;i:2069;}i:114;a:3:{i:0;s:12:"section_open";i:1;a:1:{i:0;i:3;}i:2;i:2069;}i:115;a:3:{i:0;s:6:"p_open";i:1;a:0:{}i:2;i:2115;}i:116;a:3:{i:0;s:5:"cdata";i:1;a:1:{i:0;s:30:"
Gabi vai acabar de cadastrar.";}i:2;i:2116;}i:117;a:3:{i:0;s:7:"p_close";i:1;a:0:{}i:2;i:2146;}i:118;a:3:{i:0;s:13:"section_close";i:1;a:0:{}i:2;i:2148;}i:119;a:3:{i:0;s:12:"section_edit";i:1;a:4:{i:0;i:2069;i:1;i:2147;i:2;i:3;i:3;s:36:"13) Cadastramento do projeto RoboEDU";}i:2;i:2148;}i:120;a:3:{i:0;s:6:"header";i:1;a:3:{i:0;s:41:"14) Reunião da proposta SETEC - lembrete";i:1;i:3;i:2;i:2148;}i:2;i:2148;}i:121;a:3:{i:0;s:12:"section_open";i:1;a:1:{i:0;i:3;}i:2;i:2148;}i:122;a:3:{i:0;s:6:"p_open";i:1;a:0:{}i:2;i:2199;}i:123;a:3:{i:0;s:5:"cdata";i:1;a:1:{i:0;s:24:"
É quarta-feira que vem";}i:2;i:2200;}i:124;a:3:{i:0;s:7:"p_close";i:1;a:0:{}i:2;i:2224;}i:125;a:3:{i:0;s:13:"section_close";i:1;a:0:{}i:2;i:2226;}i:126;a:3:{i:0;s:12:"section_edit";i:1;a:4:{i:0;i:2148;i:1;i:2225;i:2;i:3;i:3;s:41:"14) Reunião da proposta SETEC - lembrete";}i:2;i:2226;}i:127;a:3:{i:0;s:6:"header";i:1;a:3:{i:0;s:14:"15) Gogo Board";i:1;i:3;i:2;i:2226;}i:2;i:2226;}i:128;a:3:{i:0;s:12:"section_open";i:1;a:1:{i:0;i:3;}i:2;i:2226;}i:129;a:3:{i:0;s:6:"p_open";i:1;a:0:{}i:2;i:2250;}i:130;a:3:{i:0;s:5:"cdata";i:1;a:1:{i:0;s:63:"
Kit didático.. Mizusaki vai comprar peças para montar 3 kits";}i:2;i:2251;}i:131;a:3:{i:0;s:7:"p_close";i:1;a:0:{}i:2;i:2314;}i:132;a:3:{i:0;s:13:"section_close";i:1;a:0:{}i:2;i:2316;}i:133;a:3:{i:0;s:12:"section_edit";i:1;a:4:{i:0;i:2226;i:1;i:2315;i:2;i:3;i:3;s:14:"15) Gogo Board";}i:2;i:2316;}i:134;a:3:{i:0;s:6:"header";i:1;a:3:{i:0;s:18:"16) Futibas do PET";i:1;i:3;i:2;i:2316;}i:2;i:2316;}i:135;a:3:{i:0;s:12:"section_open";i:1;a:1:{i:0;i:3;}i:2;i:2316;}i:136;a:3:{i:0;s:6:"p_open";i:1;a:0:{}i:2;i:2344;}i:137;a:3:{i:0;s:5:"cdata";i:1;a:1:{i:0;s:47:"
Será terça-feira que vem na planet às 18:30";}i:2;i:2345;}i:138;a:3:{i:0;s:7:"p_close";i:1;a:0:{}i:2;i:2392;}i:139;a:3:{i:0;s:13:"section_close";i:1;a:0:{}i:2;i:2394;}i:140;a:3:{i:0;s:12:"section_edit";i:1;a:4:{i:0;i:2316;i:1;i:2393;i:2;i:3;i:3;s:18:"16) Futibas do PET";}i:2;i:2394;}i:141;a:3:{i:0;s:6:"header";i:1;a:3:{i:0;s:53:"17) Análise dos desempenhos dos petianos no semestre";i:1;i:3;i:2;i:2394;}i:2;i:2394;}i:142;a:3:{i:0;s:12:"section_open";i:1;a:1:{i:0;i:3;}i:2;i:2394;}i:143;a:3:{i:0;s:6:"p_open";i:1;a:0:{}i:2;i:2457;}i:144;a:3:{i:0;s:5:"cdata";i:1;a:1:{i:0;s:76:"
Conceitos foram bons, algumas reprovações mas ninguem precisa sair do PET";}i:2;i:2458;}i:145;a:3:{i:0;s:7:"p_close";i:1;a:0:{}i:2;i:2534;}i:146;a:3:{i:0;s:13:"section_close";i:1;a:0:{}i:2;i:2536;}i:147;a:3:{i:0;s:12:"section_edit";i:1;a:4:{i:0;i:2394;i:1;i:2535;i:2;i:3;i:3;s:53:"17) Análise dos desempenhos dos petianos no semestre";}i:2;i:2536;}i:148;a:3:{i:0;s:6:"header";i:1;a:3:{i:0;s:24:"18) Atividades Culturais";i:1;i:3;i:2;i:2536;}i:2;i:2536;}i:149;a:3:{i:0;s:12:"section_open";i:1;a:1:{i:0;i:3;}i:2;i:2536;}i:150;a:3:{i:0;s:10:"listu_open";i:1;a:0:{}i:2;i:2571;}i:151;a:3:{i:0;s:13:"listitem_open";i:1;a:1:{i:0;i:1;}i:2;i:2571;}i:152;a:3:{i:0;s:16:"listcontent_open";i:1;a:0:{}i:2;i:2571;}i:153;a:3:{i:0;s:5:"cdata";i:1;a:1:{i:0;s:102:" Terça-feira após reunião dos relatórios e antes do futbol será visto o filme das Torres Gêmeas.";}i:2;i:2575;}i:154;a:3:{i:0;s:17:"listcontent_close";i:1;a:0:{}i:2;i:2677;}i:155;a:3:{i:0;s:14:"listitem_close";i:1;a:0:{}i:2;i:2677;}i:156;a:3:{i:0;s:13:"listitem_open";i:1;a:1:{i:0;i:1;}i:2;i:2677;}i:157;a:3:{i:0;s:16:"listcontent_open";i:1;a:0:{}i:2;i:2677;}i:158;a:3:{i:0;s:5:"cdata";i:1;a:1:{i:0;s:56:" Semana que vem, Gabi trará os horários para assistir ";}i:2;i:2681;}i:159;a:3:{i:0;s:18:"doublequoteopening";i:1;a:0:{}i:2;i:2737;}i:160;a:3:{i:0;s:5:"cdata";i:1;a:1:{i:0;s:19:"Tangos e Tragédias";}i:2;i:2738;}i:161;a:3:{i:0;s:18:"doublequoteclosing";i:1;a:0:{}i:2;i:2757;}i:162;a:3:{i:0;s:5:"cdata";i:1;a:1:{i:0;s:1:".";}i:2;i:2758;}i:163;a:3:{i:0;s:17:"listcontent_close";i:1;a:0:{}i:2;i:2759;}i:164;a:3:{i:0;s:14:"listitem_close";i:1;a:0:{}i:2;i:2759;}i:165;a:3:{i:0;s:11:"listu_close";i:1;a:0:{}i:2;i:2759;}i:166;a:3:{i:0;s:13:"section_close";i:1;a:0:{}i:2;i:2760;}i:167;a:3:{i:0;s:12:"section_edit";i:1;a:4:{i:0;i:2536;i:1;i:0;i:2;i:3;i:3;s:24:"18) Atividades Culturais";}i:2;i:2760;}i:168;a:3:{i:0;s:12:"document_end";i:1;a:0:{}i:2;i:2760;}}