a:138:{i:0;a:3:{i:0;s:14:"document_start";i:1;a:0:{}i:2;i:0;}i:1;a:3:{i:0;s:6:"p_open";i:1;a:0:{}i:2;i:0;}i:2;a:3:{i:0;s:7:"p_close";i:1;a:0:{}i:2;i:1;}i:3;a:3:{i:0;s:12:"section_edit";i:1;a:4:{i:0;i:-1;i:1;i:0;i:2;i:1;i:3;s:0:"";}i:2;i:1;}i:4;a:3:{i:0;s:6:"header";i:1;a:3:{i:0;s:29:"Ata da Reunião de 08/08/2006";i:1;i:1;i:2;i:1;}i:2;i:1;}i:5;a:3:{i:0;s:12:"section_open";i:1;a:1:{i:0;i:1;}i:2;i:1;}i:6;a:3:{i:0;s:6:"p_open";i:1;a:0:{}i:2;i:44;}i:7;a:3:{i:0;s:5:"cdata";i:1;a:1:{i:0;s:140:"
Presentes: Alexandre, Dante, Estevão, Fabiano, Felipe, Gabriela, Lucas Cavalheiro, Lucas Mizusaki, Marcelo, Marcos, Pablo, Ricardo, Thiago";}i:2;i:45;}i:8;a:3:{i:0;s:7:"p_close";i:1;a:0:{}i:2;i:185;}i:9;a:3:{i:0;s:6:"p_open";i:1;a:0:{}i:2;i:185;}i:10;a:3:{i:0;s:5:"cdata";i:1;a:1:{i:0;s:11:"Ausentes: -";}i:2;i:187;}i:11;a:3:{i:0;s:7:"p_close";i:1;a:0:{}i:2;i:198;}i:12;a:3:{i:0;s:6:"p_open";i:1;a:0:{}i:2;i:198;}i:13;a:3:{i:0;s:5:"cdata";i:1;a:1:{i:0;s:23:"Relator: Lucas Mizusaki";}i:2;i:200;}i:14;a:3:{i:0;s:7:"p_close";i:1;a:0:{}i:2;i:223;}i:15;a:3:{i:0;s:13:"section_close";i:1;a:0:{}i:2;i:225;}i:16;a:3:{i:0;s:12:"section_edit";i:1;a:4:{i:0;i:1;i:1;i:224;i:2;i:1;i:3;s:29:"Ata da Reunião de 08/08/2006";}i:2;i:225;}i:17;a:3:{i:0;s:6:"header";i:1;a:3:{i:0;s:25:"1. Escolha do Novo Líder";i:1;i:2;i:2;i:225;}i:2;i:225;}i:18;a:3:{i:0;s:12:"section_open";i:1;a:1:{i:0;i:2;}i:2;i:225;}i:19;a:3:{i:0;s:6:"p_open";i:1;a:0:{}i:2;i:262;}i:20;a:3:{i:0;s:5:"cdata";i:1;a:1:{i:0;s:976:"
Foi votado o novo líder do PET. Fabiano fez um breve relato incentivando os outros petianos a se candidatarem ao cargo de líder, citando as qualidades de liderança, comunicação e responsabilidade que lhe foram desenvolvidas durante esse período. Os candidatos ao cargo foram Felipe Nunes Flores e Thiago Addevico Presa. Thiago no seu discurso de campanha disse que Fabiano havia sido um líder perfeito qu seempre manteve suas opiniões, mas respeitaca a dos outros e que seu desejo sendo líder era o de adquirir as boas quaidades que Fabiano ressaltara como inerentes ao cargo. Felipe ressaltou, na sua campanha, que Fabiano foi o único líder que ele viu, mas que foi o que ele esperava de um líder, ele também disse que o motivo de sua candidatura também era o de adquirir as boas qualidades. Os resultados da votação (secreta) foram 8 votos para Felipe e 5 para Thiago. Fabiano transferiu o cargo em seguida sendo o vencedor recebido com uma salva de palmas.";}i:2;i:263;}i:21;a:3:{i:0;s:7:"p_close";i:1;a:0:{}i:2;i:1239;}i:22;a:3:{i:0;s:13:"section_close";i:1;a:0:{}i:2;i:1241;}i:23;a:3:{i:0;s:12:"section_edit";i:1;a:4:{i:0;i:225;i:1;i:1240;i:2;i:2;i:3;s:25:"1. Escolha do Novo Líder";}i:2;i:1241;}i:24;a:3:{i:0;s:6:"header";i:1;a:3:{i:0;s:16:"2. Publicações";i:1;i:2;i:2;i:1241;}i:2;i:1241;}i:25;a:3:{i:0;s:12:"section_open";i:1;a:1:{i:0;i:2;}i:2;i:1241;}i:26;a:3:{i:0;s:6:"p_open";i:1;a:0:{}i:2;i:1269;}i:27;a:3:{i:0;s:5:"cdata";i:1;a:1:{i:0;s:110:"
Thiago e Nondillo estão trabalhando com publicações para o PET. O trabalho de Thiago é um artigo sobre o ";}i:2;i:1270;}i:28;a:3:{i:0;s:12:"internallink";i:1;a:2:{i:0;s:18:"/trac/wiki/RoboEdu";i:1;s:8:"RoboEdu?";}i:2;i:1380;}i:29;a:3:{i:0;s:5:"cdata";i:1;a:1:{i:0;s:102:" para ser publicado no SBIC. O seu relato sobre o andamento do trabalho foi de que ele (e a equipe do ";}i:2;i:1411;}i:30;a:3:{i:0;s:12:"internallink";i:1;a:2:{i:0;s:18:"/trac/wiki/RoboEdu";i:1;s:8:"RoboEdu?";}i:2;i:1513;}i:31;a:3:{i:0;s:5:"cdata";i:1;a:1:{i:0;s:418:") estavam se centrado numa explicação do conceito do Playful Learning que tem muitas relações com o conceito do projeto. Foram recebidas algumas sugestões, sendo elas: colocar algo um pouco mais técnico sobre o projeto do robô e a procura de um pedagogo para apresentar o trabalho. Foi decidido que ele seria enviado também para o salão de iniciação científica da PUC e para o salão de extensão da UFRGS.";}i:2;i:1544;}i:32;a:3:{i:0;s:7:"p_close";i:1;a:0:{}i:2;i:1962;}i:33;a:3:{i:0;s:13:"section_close";i:1;a:0:{}i:2;i:1964;}i:34;a:3:{i:0;s:12:"section_edit";i:1;a:4:{i:0;i:1241;i:1;i:1963;i:2;i:2;i:3;s:16:"2. Publicações";}i:2;i:1964;}i:35;a:3:{i:0;s:6:"header";i:1;a:3:{i:0;s:18:"3. Horas Pendentes";i:1;i:2;i:2;i:1964;}i:2;i:1964;}i:36;a:3:{i:0;s:12:"section_open";i:1;a:1:{i:0;i:2;}i:2;i:1964;}i:37;a:3:{i:0;s:6:"p_open";i:1;a:0:{}i:2;i:1994;}i:38;a:3:{i:0;s:5:"cdata";i:1;a:1:{i:0;s:136:"
Fabiano disse que ficou decidido que seriam dadas 1:30 pela visita à TECNOPUC e que não serão pedidas horas pendentes pelas férias.";}i:2;i:1995;}i:39;a:3:{i:0;s:7:"p_close";i:1;a:0:{}i:2;i:2131;}i:40;a:3:{i:0;s:13:"section_close";i:1;a:0:{}i:2;i:2133;}i:41;a:3:{i:0;s:12:"section_edit";i:1;a:4:{i:0;i:1964;i:1;i:2132;i:2;i:2;i:3;s:18:"3. Horas Pendentes";}i:2;i:2133;}i:42;a:3:{i:0;s:6:"header";i:1;a:3:{i:0;s:22:"4. Trabalhos pendentes";i:1;i:2;i:2;i:2133;}i:2;i:2133;}i:43;a:3:{i:0;s:12:"section_open";i:1;a:1:{i:0;i:2;}i:2;i:2133;}i:44;a:3:{i:0;s:6:"p_open";i:1;a:0:{}i:2;i:2167;}i:45;a:3:{i:0;s:5:"cdata";i:1;a:1:{i:0;s:378:"
Fabiano também comentou que não se lembra exatamente de todos os trabalhos que ficaram pendentes no final do semestre passado e ressaltou que todos deveriam checar as antigas atas para reverem suas tarefas. Também foi discutida a necessidade de vermos as lojas aonde sãocomprados os materiais de consumo do PEt, para que possamos especificar melhor as nossas requisições.";}i:2;i:2168;}i:46;a:3:{i:0;s:7:"p_close";i:1;a:0:{}i:2;i:2546;}i:47;a:3:{i:0;s:13:"section_close";i:1;a:0:{}i:2;i:2548;}i:48;a:3:{i:0;s:12:"section_edit";i:1;a:4:{i:0;i:2133;i:1;i:2547;i:2;i:2;i:3;s:22:"4. Trabalhos pendentes";}i:2;i:2548;}i:49;a:3:{i:0;s:6:"header";i:1;a:3:{i:0;s:26:"5. Horários das reuniões";i:1;i:2;i:2;i:2548;}i:2;i:2548;}i:50;a:3:{i:0;s:12:"section_open";i:1;a:1:{i:0;i:2;}i:2;i:2548;}i:51;a:3:{i:0;s:6:"p_open";i:1;a:0:{}i:2;i:2586;}i:52;a:3:{i:0;s:5:"cdata";i:1;a:1:{i:0;s:77:"
Ficou decidido que o novo horário da reunião seria terça-feira às 17:20.";}i:2;i:2587;}i:53;a:3:{i:0;s:7:"p_close";i:1;a:0:{}i:2;i:2664;}i:54;a:3:{i:0;s:13:"section_close";i:1;a:0:{}i:2;i:2666;}i:55;a:3:{i:0;s:12:"section_edit";i:1;a:4:{i:0;i:2548;i:1;i:2665;i:2;i:2;i:3;s:26:"5. Horários das reuniões";}i:2;i:2666;}i:56;a:3:{i:0;s:6:"header";i:1;a:3:{i:0;s:39:"6. Aquisição de itens do PET pelo PET";i:1;i:2;i:2;i:2666;}i:2;i:2666;}i:57;a:3:{i:0;s:12:"section_open";i:1;a:1:{i:0;i:2;}i:2;i:2666;}i:58;a:3:{i:0;s:6:"p_open";i:1;a:0:{}i:2;i:2717;}i:59;a:3:{i:0;s:5:"cdata";i:1;a:1:{i:0;s:368:"
Ao receber o dinheiro do último curso de JAVA realizado pelo PET, Thiago disse lhe foi sugerido que o PET usasse o dinheiro do minicurso (ou parte dele) para comprar algum material permanente sobre o assunto do curso (talvez registrando o fato no próprio material). Ele disse que poderíamos nos filiar à safari, uma biblioteca online com muitos artigos técnicos.";}i:2;i:2718;}i:60;a:3:{i:0;s:7:"p_close";i:1;a:0:{}i:2;i:3086;}i:61;a:3:{i:0;s:13:"section_close";i:1;a:0:{}i:2;i:3088;}i:62;a:3:{i:0;s:12:"section_edit";i:1;a:4:{i:0;i:2666;i:1;i:3087;i:2;i:2;i:3;s:39:"6. Aquisição de itens do PET pelo PET";}i:2;i:3088;}i:63;a:3:{i:0;s:6:"header";i:1;a:3:{i:0;s:35:"7. Apresentação do TC do Nondillo";i:1;i:2;i:2;i:3088;}i:2;i:3088;}i:64;a:3:{i:0;s:12:"section_open";i:1;a:1:{i:0;i:2;}i:2;i:3088;}i:65;a:3:{i:0;s:6:"p_open";i:1;a:0:{}i:2;i:3135;}i:66;a:3:{i:0;s:5:"cdata";i:1;a:1:{i:0;s:222:"
Foi marcado a apresentação do TC do Nondillo para o dia 17/8, às 18:00. Dante comentou que no mesmo horário haverá uma palestra do professor Marcelo Gleiser que seria interessante ao menos alguns de nós assistirmos.";}i:2;i:3136;}i:67;a:3:{i:0;s:7:"p_close";i:1;a:0:{}i:2;i:3358;}i:68;a:3:{i:0;s:13:"section_close";i:1;a:0:{}i:2;i:3360;}i:69;a:3:{i:0;s:12:"section_edit";i:1;a:4:{i:0;i:3088;i:1;i:3359;i:2;i:2;i:3;s:35:"7. Apresentação do TC do Nondillo";}i:2;i:3360;}i:70;a:3:{i:0;s:6:"header";i:1;a:3:{i:0;s:14:"8. Projeto CIC";i:1;i:2;i:2;i:3360;}i:2;i:3360;}i:71;a:3:{i:0;s:12:"section_open";i:1;a:1:{i:0;i:2;}i:2;i:3360;}i:72;a:3:{i:0;s:6:"p_open";i:1;a:0:{}i:2;i:3386;}i:73;a:3:{i:0;s:5:"cdata";i:1;a:1:{i:0;s:24:"
Thiago, inspirado pelo ";}i:2;i:3387;}i:74;a:3:{i:0;s:12:"internallink";i:1;a:2:{i:0;s:18:"/trac/wiki/RoboEdu";i:1;s:8:"RoboEdu?";}i:2;i:3411;}i:75;a:3:{i:0;s:5:"cdata";i:1;a:1:{i:0;s:142:", sugeriu para os CICs que eles poderiam fazer um projeto grande. Eles combinaram de fazer um levantamento por um tema até a próxima semana.";}i:2;i:3442;}i:76;a:3:{i:0;s:7:"p_close";i:1;a:0:{}i:2;i:3584;}i:77;a:3:{i:0;s:13:"section_close";i:1;a:0:{}i:2;i:3586;}i:78;a:3:{i:0;s:12:"section_edit";i:1;a:4:{i:0;i:3360;i:1;i:3585;i:2;i:2;i:3;s:14:"8. Projeto CIC";}i:2;i:3586;}i:79;a:3:{i:0;s:6:"header";i:1;a:3:{i:0;s:21:"9. Atividade Cultural";i:1;i:2;i:2;i:3586;}i:2;i:3586;}i:80;a:3:{i:0;s:12:"section_open";i:1;a:1:{i:0;i:2;}i:2;i:3586;}i:81;a:3:{i:0;s:6:"p_open";i:1;a:0:{}i:2;i:3619;}i:82;a:3:{i:0;s:5:"cdata";i:1;a:1:{i:0;s:29:"
Foram assistidas as peças:
";}i:2;i:3620;}i:83;a:3:{i:0;s:7:"p_close";i:1;a:0:{}i:2;i:3649;}i:84;a:3:{i:0;s:10:"listu_open";i:1;a:0:{}i:2;i:3649;}i:85;a:3:{i:0;s:13:"listitem_open";i:1;a:1:{i:0;i:1;}i:2;i:3649;}i:86;a:3:{i:0;s:16:"listcontent_open";i:1;a:0:{}i:2;i:3649;}i:87;a:3:{i:0;s:5:"cdata";i:1;a:1:{i:0;s:44:" Hamlet - por Dante, Lucas Mizusaki e Thiago";}i:2;i:3653;}i:88;a:3:{i:0;s:17:"listcontent_close";i:1;a:0:{}i:2;i:3697;}i:89;a:3:{i:0;s:14:"listitem_close";i:1;a:0:{}i:2;i:3697;}i:90;a:3:{i:0;s:13:"listitem_open";i:1;a:1:{i:0;i:1;}i:2;i:3697;}i:91;a:3:{i:0;s:16:"listcontent_open";i:1;a:0:{}i:2;i:3697;}i:92;a:3:{i:0;s:5:"cdata";i:1;a:1:{i:0;s:38:" Blitz - por Estevão, Fabiano e Pablo";}i:2;i:3701;}i:93;a:3:{i:0;s:17:"listcontent_close";i:1;a:0:{}i:2;i:3739;}i:94;a:3:{i:0;s:14:"listitem_close";i:1;a:0:{}i:2;i:3739;}i:95;a:3:{i:0;s:13:"listitem_open";i:1;a:1:{i:0;i:1;}i:2;i:3739;}i:96;a:3:{i:0;s:16:"listcontent_open";i:1;a:0:{}i:2;i:3739;}i:97;a:3:{i:0;s:5:"cdata";i:1;a:1:{i:0;s:55:" Eu preciso aprender a viver só - por Lucas Cavalheiro";}i:2;i:3743;}i:98;a:3:{i:0;s:17:"listcontent_close";i:1;a:0:{}i:2;i:3798;}i:99;a:3:{i:0;s:14:"listitem_close";i:1;a:0:{}i:2;i:3798;}i:100;a:3:{i:0;s:13:"listitem_open";i:1;a:1:{i:0;i:1;}i:2;i:3798;}i:101;a:3:{i:0;s:16:"listcontent_open";i:1;a:0:{}i:2;i:3798;}i:102;a:3:{i:0;s:5:"cdata";i:1;a:1:{i:0;s:42:" Tem que ser só com você - pela Gabriela";}i:2;i:3802;}i:103;a:3:{i:0;s:17:"listcontent_close";i:1;a:0:{}i:2;i:3844;}i:104;a:3:{i:0;s:14:"listitem_close";i:1;a:0:{}i:2;i:3844;}i:105;a:3:{i:0;s:11:"listu_close";i:1;a:0:{}i:2;i:3844;}i:106;a:3:{i:0;s:6:"p_open";i:1;a:0:{}i:2;i:3844;}i:107;a:3:{i:0;s:5:"cdata";i:1;a:1:{i:0;s:277:"
Ficou decidido que aqueles que não assistiram à nenhuma peça (Alexandre, Felipe, Marcelo, Marcus e Ricardo) deveriam assistir alguma peça até a semana que vem. Algumas sugestões para os próximos projetos culturais foram o DVD do The Wall, e os filmes A Prova e O Corte.";}i:2;i:3845;}i:108;a:3:{i:0;s:7:"p_close";i:1;a:0:{}i:2;i:4122;}i:109;a:3:{i:0;s:13:"section_close";i:1;a:0:{}i:2;i:4124;}i:110;a:3:{i:0;s:12:"section_edit";i:1;a:4:{i:0;i:3586;i:1;i:4123;i:2;i:2;i:3;s:21:"9. Atividade Cultural";}i:2;i:4124;}i:111;a:3:{i:0;s:6:"header";i:1;a:3:{i:0;s:27:"10. Ceritificados do ENAPET";i:1;i:2;i:2;i:4124;}i:2;i:4124;}i:112;a:3:{i:0;s:12:"section_open";i:1;a:1:{i:0;i:2;}i:2;i:4124;}i:113;a:3:{i:0;s:6:"p_open";i:1;a:0:{}i:2;i:4163;}i:114;a:3:{i:0;s:5:"cdata";i:1;a:1:{i:0;s:124:"
Felipe nos relembrou da necessidade de entregarmos as cópias do certificado do ENAPET para serem entregues para a PROGRAD.";}i:2;i:4164;}i:115;a:3:{i:0;s:7:"p_close";i:1;a:0:{}i:2;i:4288;}i:116;a:3:{i:0;s:13:"section_close";i:1;a:0:{}i:2;i:4290;}i:117;a:3:{i:0;s:12:"section_edit";i:1;a:4:{i:0;i:4124;i:1;i:4289;i:2;i:2;i:3;s:27:"10. Ceritificados do ENAPET";}i:2;i:4290;}i:118;a:3:{i:0;s:6:"header";i:1;a:3:{i:0;s:56:"11. Relato do Fabiano sobre o resultado do Ciclo dos ECP";i:1;i:2;i:2;i:4290;}i:2;i:4290;}i:119;a:3:{i:0;s:12:"section_open";i:1;a:1:{i:0;i:2;}i:2;i:4290;}i:120;a:3:{i:0;s:6:"p_open";i:1;a:0:{}i:2;i:4358;}i:121;a:3:{i:0;s:5:"cdata";i:1;a:1:{i:0;s:34:"
Ainda não houve uma resposta da ";}i:2;i:4359;}i:122;a:3:{i:0;s:12:"internallink";i:1;a:2:{i:0;s:18:"/trac/wiki/ComGrad";i:1;s:8:"ComGrad?";}i:2;i:4393;}i:123;a:3:{i:0;s:5:"cdata";i:1;a:1:{i:0;s:67:" ECP. Dante nnos sugeriu que fôssemos um pouco mais enfáticos na ";}i:2;i:4424;}i:124;a:3:{i:0;s:18:"doublequoteopening";i:1;a:0:{}i:2;i:4491;}i:125;a:3:{i:0;s:5:"cdata";i:1;a:1:{i:0;s:9:"cobrança";}i:2;i:4492;}i:126;a:3:{i:0;s:18:"doublequoteclosing";i:1;a:0:{}i:2;i:4501;}i:127;a:3:{i:0;s:7:"p_close";i:1;a:0:{}i:2;i:4502;}i:128;a:3:{i:0;s:13:"section_close";i:1;a:0:{}i:2;i:4504;}i:129;a:3:{i:0;s:12:"section_edit";i:1;a:4:{i:0;i:4290;i:1;i:4503;i:2;i:2;i:3;s:56:"11. Relato do Fabiano sobre o resultado do Ciclo dos ECP";}i:2;i:4504;}i:130;a:3:{i:0;s:6:"header";i:1;a:3:{i:0;s:66:"12. Verificação no site do PET no MEC dos modelos dos reltórios";i:1;i:2;i:2;i:4504;}i:2;i:4504;}i:131;a:3:{i:0;s:12:"section_open";i:1;a:1:{i:0;i:2;}i:2;i:4504;}i:132;a:3:{i:0;s:6:"p_open";i:1;a:0:{}i:2;i:4582;}i:133;a:3:{i:0;s:5:"cdata";i:1;a:1:{i:0;s:59:"
Dante nos disse que deveríamos checar os modelos no site.";}i:2;i:4583;}i:134;a:3:{i:0;s:7:"p_close";i:1;a:0:{}i:2;i:4642;}i:135;a:3:{i:0;s:13:"section_close";i:1;a:0:{}i:2;i:4643;}i:136;a:3:{i:0;s:12:"section_edit";i:1;a:4:{i:0;i:4504;i:1;i:0;i:2;i:2;i:3;s:66:"12. Verificação no site do PET no MEC dos modelos dos reltórios";}i:2;i:4643;}i:137;a:3:{i:0;s:12:"document_end";i:1;a:0:{}i:2;i:4643;}}