a:133:{i:0;a:3:{i:0;s:14:"document_start";i:1;a:0:{}i:2;i:0;}i:1;a:3:{i:0;s:6:"p_open";i:1;a:0:{}i:2;i:0;}i:2;a:3:{i:0;s:11:"strong_open";i:1;a:0:{}i:2;i:1;}i:3;a:3:{i:0;s:5:"cdata";i:1;a:1:{i:0;s:5:"Data:";}i:2;i:3;}i:4;a:3:{i:0;s:12:"strong_close";i:1;a:0:{}i:2;i:8;}i:5;a:3:{i:0;s:5:"cdata";i:1;a:1:{i:0;s:10:" 04/03/05 ";}i:2;i:10;}i:6;a:3:{i:0;s:11:"strong_open";i:1;a:0:{}i:2;i:20;}i:7;a:3:{i:0;s:5:"cdata";i:1;a:1:{i:0;s:8:"Relator:";}i:2;i:22;}i:8;a:3:{i:0;s:12:"strong_close";i:1;a:0:{}i:2;i:30;}i:9;a:3:{i:0;s:5:"cdata";i:1;a:1:{i:0;s:17:" Paulo Schreiner ";}i:2;i:32;}i:10;a:3:{i:0;s:11:"strong_open";i:1;a:0:{}i:2;i:49;}i:11;a:3:{i:0;s:5:"cdata";i:1;a:1:{i:0;s:10:"Presentes:";}i:2;i:51;}i:12;a:3:{i:0;s:12:"strong_close";i:1;a:0:{}i:2;i:61;}i:13;a:3:{i:0;s:5:"cdata";i:1;a:1:{i:0;s:89:" Dante, Diego, Wagner, Nondillo, Vinícius, João, Robert, Lilian, Gustavo, Paulo, Irigon";}i:2;i:63;}i:14;a:3:{i:0;s:7:"p_close";i:1;a:0:{}i:2;i:152;}i:15;a:3:{i:0;s:6:"p_open";i:1;a:0:{}i:2;i:152;}i:16;a:3:{i:0;s:5:"cdata";i:1;a:1:{i:0;s:2:"1.";}i:2;i:154;}i:17;a:3:{i:0;s:11:"strong_open";i:1;a:0:{}i:2;i:156;}i:18;a:3:{i:0;s:5:"cdata";i:1;a:1:{i:0;s:18:"Inclusão digital:";}i:2;i:158;}i:19;a:3:{i:0;s:12:"strong_close";i:1;a:0:{}i:2;i:176;}i:20;a:3:{i:0;s:5:"cdata";i:1;a:1:{i:0;s:1:"
";}i:2;i:178;}i:21;a:3:{i:0;s:7:"p_close";i:1;a:0:{}i:2;i:179;}i:22;a:3:{i:0;s:10:"listu_open";i:1;a:0:{}i:2;i:179;}i:23;a:3:{i:0;s:13:"listitem_open";i:1;a:1:{i:0;i:1;}i:2;i:179;}i:24;a:3:{i:0;s:16:"listcontent_open";i:1;a:0:{}i:2;i:179;}i:25;a:3:{i:0;s:5:"cdata";i:1;a:1:{i:0;s:116:" Irigon sugeriu a participação de um projeto em escolas de segundo grau, para instalar laboratórios e administrar";}i:2;i:183;}i:26;a:3:{i:0;s:17:"listcontent_close";i:1;a:0:{}i:2;i:299;}i:27;a:3:{i:0;s:14:"listitem_close";i:1;a:0:{}i:2;i:299;}i:28;a:3:{i:0;s:11:"listu_close";i:1;a:0:{}i:2;i:299;}i:29;a:3:{i:0;s:6:"p_open";i:1;a:0:{}i:2;i:299;}i:30;a:3:{i:0;s:5:"cdata";i:1;a:1:{i:0;s:48:"
a rede e ministrar cursos. Aprovado pelo grupo.";}i:2;i:300;}i:31;a:3:{i:0;s:7:"p_close";i:1;a:0:{}i:2;i:348;}i:32;a:3:{i:0;s:6:"p_open";i:1;a:0:{}i:2;i:348;}i:33;a:3:{i:0;s:5:"cdata";i:1;a:1:{i:0;s:2:"2.";}i:2;i:350;}i:34;a:3:{i:0;s:11:"strong_open";i:1;a:0:{}i:2;i:352;}i:35;a:3:{i:0;s:5:"cdata";i:1;a:1:{i:0;s:23:"Horário das Reuniões:";}i:2;i:354;}i:36;a:3:{i:0;s:12:"strong_close";i:1;a:0:{}i:2;i:377;}i:37;a:3:{i:0;s:5:"cdata";i:1;a:1:{i:0;s:1:"
";}i:2;i:379;}i:38;a:3:{i:0;s:7:"p_close";i:1;a:0:{}i:2;i:380;}i:39;a:3:{i:0;s:10:"listu_open";i:1;a:0:{}i:2;i:380;}i:40;a:3:{i:0;s:13:"listitem_open";i:1;a:1:{i:0;i:1;}i:2;i:380;}i:41;a:3:{i:0;s:16:"listcontent_open";i:1;a:0:{}i:2;i:380;}i:42;a:3:{i:0;s:5:"cdata";i:1;a:1:{i:0;s:95:" A próxima reunião do grupo será realizada sexta-feira, dia 11 de março de 2005, às 14:00.";}i:2;i:384;}i:43;a:3:{i:0;s:17:"listcontent_close";i:1;a:0:{}i:2;i:479;}i:44;a:3:{i:0;s:14:"listitem_close";i:1;a:0:{}i:2;i:479;}i:45;a:3:{i:0;s:13:"listitem_open";i:1;a:1:{i:0;i:1;}i:2;i:479;}i:46;a:3:{i:0;s:16:"listcontent_open";i:1;a:0:{}i:2;i:479;}i:47;a:3:{i:0;s:5:"cdata";i:1;a:1:{i:0;s:71:" O horário das reuniões para o próximo semestre fica a ser definido.";}i:2;i:483;}i:48;a:3:{i:0;s:17:"listcontent_close";i:1;a:0:{}i:2;i:554;}i:49;a:3:{i:0;s:14:"listitem_close";i:1;a:0:{}i:2;i:554;}i:50;a:3:{i:0;s:11:"listu_close";i:1;a:0:{}i:2;i:554;}i:51;a:3:{i:0;s:6:"p_open";i:1;a:0:{}i:2;i:554;}i:52;a:3:{i:0;s:5:"cdata";i:1;a:1:{i:0;s:3:"
3.";}i:2;i:555;}i:53;a:3:{i:0;s:11:"strong_open";i:1;a:0:{}i:2;i:558;}i:54;a:3:{i:0;s:5:"cdata";i:1;a:1:{i:0;s:51:"Planejamento de atividades 2005 (mar/05 à fev/06):";}i:2;i:560;}i:55;a:3:{i:0;s:12:"strong_close";i:1;a:0:{}i:2;i:611;}i:56;a:3:{i:0;s:5:"cdata";i:1;a:1:{i:0;s:1:"
";}i:2;i:613;}i:57;a:3:{i:0;s:7:"p_close";i:1;a:0:{}i:2;i:614;}i:58;a:3:{i:0;s:10:"listu_open";i:1;a:0:{}i:2;i:614;}i:59;a:3:{i:0;s:13:"listitem_open";i:1;a:1:{i:0;i:1;}i:2;i:614;}i:60;a:3:{i:0;s:16:"listcontent_open";i:1;a:0:{}i:2;i:614;}i:61;a:3:{i:0;s:5:"cdata";i:1;a:1:{i:0;s:73:" Será realizado na próxima semana pelas respectivas equipes designadas.";}i:2;i:618;}i:62;a:3:{i:0;s:17:"listcontent_close";i:1;a:0:{}i:2;i:691;}i:63;a:3:{i:0;s:14:"listitem_close";i:1;a:0:{}i:2;i:691;}i:64;a:3:{i:0;s:13:"listitem_open";i:1;a:1:{i:0;i:1;}i:2;i:691;}i:65;a:3:{i:0;s:16:"listcontent_open";i:1;a:0:{}i:2;i:691;}i:66;a:3:{i:0;s:5:"cdata";i:1;a:1:{i:0;s:47:" Conversar com André Schneider sobre projetos.";}i:2;i:695;}i:67;a:3:{i:0;s:17:"listcontent_close";i:1;a:0:{}i:2;i:742;}i:68;a:3:{i:0;s:14:"listitem_close";i:1;a:0:{}i:2;i:742;}i:69;a:3:{i:0;s:11:"listu_close";i:1;a:0:{}i:2;i:742;}i:70;a:3:{i:0;s:6:"p_open";i:1;a:0:{}i:2;i:742;}i:71;a:3:{i:0;s:5:"cdata";i:1;a:1:{i:0;s:3:"
4.";}i:2;i:743;}i:72;a:3:{i:0;s:11:"strong_open";i:1;a:0:{}i:2;i:746;}i:73;a:3:{i:0;s:5:"cdata";i:1;a:1:{i:0;s:20:"Eleição do Líder:";}i:2;i:748;}i:74;a:3:{i:0;s:12:"strong_close";i:1;a:0:{}i:2;i:768;}i:75;a:3:{i:0;s:5:"cdata";i:1;a:1:{i:0;s:1:"
";}i:2;i:770;}i:76;a:3:{i:0;s:7:"p_close";i:1;a:0:{}i:2;i:771;}i:77;a:3:{i:0;s:10:"listu_open";i:1;a:0:{}i:2;i:771;}i:78;a:3:{i:0;s:13:"listitem_open";i:1;a:1:{i:0;i:1;}i:2;i:771;}i:79;a:3:{i:0;s:16:"listcontent_open";i:1;a:0:{}i:2;i:771;}i:80;a:3:{i:0;s:5:"cdata";i:1;a:1:{i:0;s:67:" Será realizada na primeira semana de aula, com votação secreta.";}i:2;i:775;}i:81;a:3:{i:0;s:17:"listcontent_close";i:1;a:0:{}i:2;i:842;}i:82;a:3:{i:0;s:14:"listitem_close";i:1;a:0:{}i:2;i:842;}i:83;a:3:{i:0;s:13:"listitem_open";i:1;a:1:{i:0;i:1;}i:2;i:842;}i:84;a:3:{i:0;s:16:"listcontent_open";i:1;a:0:{}i:2;i:842;}i:85;a:3:{i:0;s:5:"cdata";i:1;a:1:{i:0;s:39:" O novo líder assumirá imediatamente.";}i:2;i:846;}i:86;a:3:{i:0;s:17:"listcontent_close";i:1;a:0:{}i:2;i:885;}i:87;a:3:{i:0;s:14:"listitem_close";i:1;a:0:{}i:2;i:885;}i:88;a:3:{i:0;s:13:"listitem_open";i:1;a:1:{i:0;i:1;}i:2;i:885;}i:89;a:3:{i:0;s:16:"listcontent_open";i:1;a:0:{}i:2;i:885;}i:90;a:3:{i:0;s:5:"cdata";i:1;a:1:{i:0;s:47:" Paulo apresentou oficialmente sua candidatura.";}i:2;i:889;}i:91;a:3:{i:0;s:17:"listcontent_close";i:1;a:0:{}i:2;i:936;}i:92;a:3:{i:0;s:14:"listitem_close";i:1;a:0:{}i:2;i:936;}i:93;a:3:{i:0;s:11:"listu_close";i:1;a:0:{}i:2;i:936;}i:94;a:3:{i:0;s:6:"p_open";i:1;a:0:{}i:2;i:936;}i:95;a:3:{i:0;s:5:"cdata";i:1;a:1:{i:0;s:3:"
5.";}i:2;i:937;}i:96;a:3:{i:0;s:11:"strong_open";i:1;a:0:{}i:2;i:940;}i:97;a:3:{i:0;s:5:"cdata";i:1;a:1:{i:0;s:8:"Robopet:";}i:2;i:942;}i:98;a:3:{i:0;s:12:"strong_close";i:1;a:0:{}i:2;i:950;}i:99;a:3:{i:0;s:5:"cdata";i:1;a:1:{i:0;s:1:"
";}i:2;i:952;}i:100;a:3:{i:0;s:7:"p_close";i:1;a:0:{}i:2;i:953;}i:101;a:3:{i:0;s:10:"listu_open";i:1;a:0:{}i:2;i:953;}i:102;a:3:{i:0;s:13:"listitem_open";i:1;a:1:{i:0;i:1;}i:2;i:953;}i:103;a:3:{i:0;s:16:"listcontent_open";i:1;a:0:{}i:2;i:953;}i:104;a:3:{i:0;s:5:"cdata";i:1;a:1:{i:0;s:59:" Estação de solda será adquirida. Nondillo responsável.";}i:2;i:957;}i:105;a:3:{i:0;s:17:"listcontent_close";i:1;a:0:{}i:2;i:1016;}i:106;a:3:{i:0;s:14:"listitem_close";i:1;a:0:{}i:2;i:1016;}i:107;a:3:{i:0;s:11:"listu_close";i:1;a:0:{}i:2;i:1016;}i:108;a:3:{i:0;s:6:"p_open";i:1;a:0:{}i:2;i:1016;}i:109;a:3:{i:0;s:5:"cdata";i:1;a:1:{i:0;s:3:"
6.";}i:2;i:1017;}i:110;a:3:{i:0;s:11:"strong_open";i:1;a:0:{}i:2;i:1020;}i:111;a:3:{i:0;s:5:"cdata";i:1;a:1:{i:0;s:29:"Seleção dos novos petianos:";}i:2;i:1022;}i:112;a:3:{i:0;s:12:"strong_close";i:1;a:0:{}i:2;i:1051;}i:113;a:3:{i:0;s:5:"cdata";i:1;a:1:{i:0;s:1:"
";}i:2;i:1053;}i:114;a:3:{i:0;s:7:"p_close";i:1;a:0:{}i:2;i:1054;}i:115;a:3:{i:0;s:10:"listu_open";i:1;a:0:{}i:2;i:1054;}i:116;a:3:{i:0;s:13:"listitem_open";i:1;a:1:{i:0;i:1;}i:2;i:1054;}i:117;a:3:{i:0;s:16:"listcontent_open";i:1;a:0:{}i:2;i:1054;}i:118;a:3:{i:0;s:5:"cdata";i:1;a:1:{i:0;s:46:" Começará fim de março ou início de abril.";}i:2;i:1058;}i:119;a:3:{i:0;s:17:"listcontent_close";i:1;a:0:{}i:2;i:1104;}i:120;a:3:{i:0;s:14:"listitem_close";i:1;a:0:{}i:2;i:1104;}i:121;a:3:{i:0;s:13:"listitem_open";i:1;a:1:{i:0;i:1;}i:2;i:1104;}i:122;a:3:{i:0;s:16:"listcontent_open";i:1;a:0:{}i:2;i:1104;}i:123;a:3:{i:0;s:5:"cdata";i:1;a:1:{i:0;s:53:" Novos petianos deverão começar na metade de abril.";}i:2;i:1108;}i:124;a:3:{i:0;s:17:"listcontent_close";i:1;a:0:{}i:2;i:1161;}i:125;a:3:{i:0;s:14:"listitem_close";i:1;a:0:{}i:2;i:1161;}i:126;a:3:{i:0;s:13:"listitem_open";i:1;a:1:{i:0;i:1;}i:2;i:1161;}i:127;a:3:{i:0;s:16:"listcontent_open";i:1;a:0:{}i:2;i:1161;}i:128;a:3:{i:0;s:5:"cdata";i:1;a:1:{i:0;s:89:" Comissão respnsável por apresentar o plano na próxima reunião: Diego, Gustavo, João";}i:2;i:1165;}i:129;a:3:{i:0;s:17:"listcontent_close";i:1;a:0:{}i:2;i:1254;}i:130;a:3:{i:0;s:14:"listitem_close";i:1;a:0:{}i:2;i:1254;}i:131;a:3:{i:0;s:11:"listu_close";i:1;a:0:{}i:2;i:1254;}i:132;a:3:{i:0;s:12:"document_end";i:1;a:0:{}i:2;i:1254;}}