a:132:{i:0;a:3:{i:0;s:14:"document_start";i:1;a:0:{}i:2;i:0;}i:1;a:3:{i:0;s:6:"p_open";i:1;a:0:{}i:2;i:0;}i:2;a:3:{i:0;s:7:"p_close";i:1;a:0:{}i:2;i:1;}i:3;a:3:{i:0;s:12:"section_edit";i:1;a:4:{i:0;i:-1;i:1;i:0;i:2;i:1;i:3;s:0:"";}i:2;i:1;}i:4;a:3:{i:0;s:6:"header";i:1;a:3:{i:0;s:29:"Ata da reunião de 24/10/2006";i:1;i:1;i:2;i:1;}i:2;i:1;}i:5;a:3:{i:0;s:12:"section_open";i:1;a:1:{i:0;i:1;}i:2;i:1;}i:6;a:3:{i:0;s:6:"p_open";i:1;a:0:{}i:2;i:44;}i:7;a:3:{i:0;s:5:"cdata";i:1;a:1:{i:0;s:1:"
";}i:2;i:45;}i:8;a:3:{i:0;s:11:"strong_open";i:1;a:0:{}i:2;i:46;}i:9;a:3:{i:0;s:5:"cdata";i:1;a:1:{i:0;s:11:"Presentes: ";}i:2;i:48;}i:10;a:3:{i:0;s:12:"strong_close";i:1;a:0:{}i:2;i:59;}i:11;a:3:{i:0;s:5:"cdata";i:1;a:1:{i:0;s:127:"Alexandre, Antônio, Dante, Fabiano, Felipe, Ismael, Gabriela, Lucas Mizusaki, Marcelo, Marcos, Pablo, Portal, Ricardo, Thiago.";}i:2;i:61;}i:12;a:3:{i:0;s:7:"p_close";i:1;a:0:{}i:2;i:188;}i:13;a:3:{i:0;s:6:"p_open";i:1;a:0:{}i:2;i:188;}i:14;a:3:{i:0;s:11:"strong_open";i:1;a:0:{}i:2;i:190;}i:15;a:3:{i:0;s:5:"cdata";i:1;a:1:{i:0;s:10:"Ausentes: ";}i:2;i:192;}i:16;a:3:{i:0;s:12:"strong_close";i:1;a:0:{}i:2;i:202;}i:17;a:3:{i:0;s:5:"cdata";i:1;a:1:{i:0;s:8:" Nenhum.";}i:2;i:204;}i:18;a:3:{i:0;s:7:"p_close";i:1;a:0:{}i:2;i:212;}i:19;a:3:{i:0;s:6:"p_open";i:1;a:0:{}i:2;i:212;}i:20;a:3:{i:0;s:11:"strong_open";i:1;a:0:{}i:2;i:214;}i:21;a:3:{i:0;s:5:"cdata";i:1;a:1:{i:0;s:9:"Relator: ";}i:2;i:216;}i:22;a:3:{i:0;s:12:"strong_close";i:1;a:0:{}i:2;i:225;}i:23;a:3:{i:0;s:5:"cdata";i:1;a:1:{i:0;s:9:" Marcelo.";}i:2;i:227;}i:24;a:3:{i:0;s:7:"p_close";i:1;a:0:{}i:2;i:236;}i:25;a:3:{i:0;s:13:"section_close";i:1;a:0:{}i:2;i:238;}i:26;a:3:{i:0;s:12:"section_edit";i:1;a:4:{i:0;i:1;i:1;i:237;i:2;i:1;i:3;s:29:"Ata da reunião de 24/10/2006";}i:2;i:238;}i:27;a:3:{i:0;s:6:"header";i:1;a:3:{i:0;s:36:"1) Apresentação dos novos petianos";i:1;i:3;i:2;i:238;}i:2;i:238;}i:28;a:3:{i:0;s:12:"section_open";i:1;a:1:{i:0;i:3;}i:2;i:238;}i:29;a:3:{i:0;s:6:"p_open";i:1;a:0:{}i:2;i:284;}i:30;a:3:{i:0;s:5:"cdata";i:1;a:1:{i:0;s:173:"
Os antigos e novos petianos apresentaram-se. Após foi decidido que Thiago será padrinho de Portal, Marcelo será padrinho de Ismael e Gabriela será padrinha de Antônio.";}i:2;i:285;}i:31;a:3:{i:0;s:7:"p_close";i:1;a:0:{}i:2;i:458;}i:32;a:3:{i:0;s:13:"section_close";i:1;a:0:{}i:2;i:460;}i:33;a:3:{i:0;s:12:"section_edit";i:1;a:4:{i:0;i:238;i:1;i:459;i:2;i:3;i:3;s:36:"1) Apresentação dos novos petianos";}i:2;i:460;}i:34;a:3:{i:0;s:6:"header";i:1;a:3:{i:0;s:25:"2) Comissão de Seleção";i:1;i:3;i:2;i:460;}i:2;i:460;}i:35;a:3:{i:0;s:12:"section_open";i:1;a:1:{i:0;i:3;}i:2;i:460;}i:36;a:3:{i:0;s:6:"p_open";i:1;a:0:{}i:2;i:495;}i:37;a:3:{i:0;s:5:"cdata";i:1;a:1:{i:0;s:472:"
A comissão fez comentários gerais sobre a seleção. Foi comentado que 5 pessoas se interessaram a ser voluntários. Serão escolhidos os melhores colocados na seleção, após os selecionados, para serem voluntários. Gabriela e Capra ficarão encarregados por fazer os documentos relativos a seleção, com ajuda de Marcelo e Flores. Também fica decidido que os petianos farão 6h nesta semana e na próxima carga horária normal (12h). Dante comenta que enviará o ";}i:2;i:496;}i:38;a:3:{i:0;s:18:"doublequoteopening";i:1;a:0:{}i:2;i:968;}i:39;a:3:{i:0;s:5:"cdata";i:1;a:1:{i:0;s:11:"novo manual";}i:2;i:969;}i:40;a:3:{i:0;s:18:"doublequoteclosing";i:1;a:0:{}i:2;i:980;}i:41;a:3:{i:0;s:5:"cdata";i:1;a:1:{i:0;s:65:" ao grupo para ser analisado, especialmente pelos novos petianos.";}i:2;i:981;}i:42;a:3:{i:0;s:7:"p_close";i:1;a:0:{}i:2;i:1046;}i:43;a:3:{i:0;s:13:"section_close";i:1;a:0:{}i:2;i:1048;}i:44;a:3:{i:0;s:12:"section_edit";i:1;a:4:{i:0;i:460;i:1;i:1047;i:2;i:3;i:3;s:25:"2) Comissão de Seleção";}i:2;i:1048;}i:45;a:3:{i:0;s:6:"header";i:1;a:3:{i:0;s:18:"3) Gravador de PIC";i:1;i:3;i:2;i:1048;}i:2;i:1048;}i:46;a:3:{i:0;s:12:"section_open";i:1;a:1:{i:0;i:3;}i:2;i:1048;}i:47;a:3:{i:0;s:6:"p_open";i:1;a:0:{}i:2;i:1076;}i:48;a:3:{i:0;s:5:"cdata";i:1;a:1:{i:0;s:99:"
Pablo comenta que o vendedor reenviou sem custos adicionais o Pic e está funcionando normalmente.";}i:2;i:1077;}i:49;a:3:{i:0;s:7:"p_close";i:1;a:0:{}i:2;i:1176;}i:50;a:3:{i:0;s:13:"section_close";i:1;a:0:{}i:2;i:1178;}i:51;a:3:{i:0;s:12:"section_edit";i:1;a:4:{i:0;i:1048;i:1;i:1177;i:2;i:3;i:3;s:18:"3) Gravador de PIC";}i:2;i:1178;}i:52;a:3:{i:0;s:6:"header";i:1;a:3:{i:0;s:14:"4) Site do PET";i:1;i:3;i:2;i:1178;}i:2;i:1178;}i:53;a:3:{i:0;s:12:"section_open";i:1;a:1:{i:0;i:3;}i:2;i:1178;}i:54;a:3:{i:0;s:6:"p_open";i:1;a:0:{}i:2;i:1202;}i:55;a:3:{i:0;s:5:"cdata";i:1;a:1:{i:0;s:134:"
Pablo comenta que sairá do PET e um novo petiano terá que administrar o site. Gabriela e Antônio ficarão responsáveis pelo site.";}i:2;i:1203;}i:56;a:3:{i:0;s:7:"p_close";i:1;a:0:{}i:2;i:1337;}i:57;a:3:{i:0;s:13:"section_close";i:1;a:0:{}i:2;i:1339;}i:58;a:3:{i:0;s:12:"section_edit";i:1;a:4:{i:0;i:1178;i:1;i:1338;i:2;i:3;i:3;s:14:"4) Site do PET";}i:2;i:1339;}i:59;a:3:{i:0;s:6:"header";i:1;a:3:{i:0;s:20:"5) Portal da Cenapet";i:1;i:3;i:2;i:1339;}i:2;i:1339;}i:60;a:3:{i:0;s:12:"section_open";i:1;a:1:{i:0;i:3;}i:2;i:1339;}i:61;a:3:{i:0;s:6:"p_open";i:1;a:0:{}i:2;i:1369;}i:62;a:3:{i:0;s:5:"cdata";i:1;a:1:{i:0;s:216:"
Pablo comenta sobre o Portal da Cenapet. Gabriela e Antônio ficarão responsáveis por manter os contatos acerca do Portal com Vinicius (USP-São Carlos). Dante também explica ao novos petianos o que é a Cenapet.";}i:2;i:1370;}i:63;a:3:{i:0;s:7:"p_close";i:1;a:0:{}i:2;i:1586;}i:64;a:3:{i:0;s:13:"section_close";i:1;a:0:{}i:2;i:1588;}i:65;a:3:{i:0;s:12:"section_edit";i:1;a:4:{i:0;i:1339;i:1;i:1587;i:2;i:3;i:3;s:20:"5) Portal da Cenapet";}i:2;i:1588;}i:66;a:3:{i:0;s:6:"header";i:1;a:3:{i:0;s:45:"6) Planejamento Mensal e Folha de Efetividade";i:1;i:3;i:2;i:1588;}i:2;i:1588;}i:67;a:3:{i:0;s:12:"section_open";i:1;a:1:{i:0;i:3;}i:2;i:1588;}i:68;a:3:{i:0;s:6:"p_open";i:1;a:0:{}i:2;i:1643;}i:69;a:3:{i:0;s:5:"cdata";i:1;a:1:{i:0;s:106:"
Pablo explica o que são os dois documentos acima. Ismael ficará responsável pela confecção de ambos.";}i:2;i:1644;}i:70;a:3:{i:0;s:7:"p_close";i:1;a:0:{}i:2;i:1750;}i:71;a:3:{i:0;s:13:"section_close";i:1;a:0:{}i:2;i:1752;}i:72;a:3:{i:0;s:12:"section_edit";i:1;a:4:{i:0;i:1588;i:1;i:1751;i:2;i:3;i:3;s:45:"6) Planejamento Mensal e Folha de Efetividade";}i:2;i:1752;}i:73;a:3:{i:0;s:6:"header";i:1;a:3:{i:0;s:37:"7) Comentários Salão Jovem da UFRGS";i:1;i:3;i:2;i:1752;}i:2;i:1752;}i:74;a:3:{i:0;s:12:"section_open";i:1;a:1:{i:0;i:3;}i:2;i:1752;}i:75;a:3:{i:0;s:6:"p_open";i:1;a:0:{}i:2;i:1799;}i:76;a:3:{i:0;s:5:"cdata";i:1;a:1:{i:0;s:258:"
Mizusaki conta como foi a participação do grupo no Salão Jovem da UFRGS, comentando que foi muito interessante e o estande ficou o tempo todo com um bom público. Dante parabeniza todo o grupo pela participação, destacando a participação de Mizusaki.";}i:2;i:1800;}i:77;a:3:{i:0;s:7:"p_close";i:1;a:0:{}i:2;i:2058;}i:78;a:3:{i:0;s:13:"section_close";i:1;a:0:{}i:2;i:2060;}i:79;a:3:{i:0;s:12:"section_edit";i:1;a:4:{i:0;i:1752;i:1;i:2059;i:2;i:3;i:3;s:37:"7) Comentários Salão Jovem da UFRGS";}i:2;i:2060;}i:80;a:3:{i:0;s:6:"header";i:1;a:3:{i:0;s:34:"8) [[/trac/wiki/RoboEdu|RoboEdu?]]";i:1;i:3;i:2;i:2060;}i:2;i:2060;}i:81;a:3:{i:0;s:12:"section_open";i:1;a:1:{i:0;i:3;}i:2;i:2060;}i:82;a:3:{i:0;s:6:"p_open";i:1;a:0:{}i:2;i:2104;}i:83;a:3:{i:0;s:5:"cdata";i:1;a:1:{i:0;s:355:"
Thiago comenta o andamento do projeto em relação a Escola Técnica da UFRGS. Haverá uma visita a escola técnica nesta quinta às 19h, sendo que Thiago e Mizusaki mostrarão o código em Ruby e como se programa em robô (palestra). Mizusaki cita que a próxima visita a escola Tubino será na sexta às 15h30, e na quinta haverá reunião do grupo do ";}i:2;i:2105;}i:84;a:3:{i:0;s:12:"internallink";i:1;a:2:{i:0;s:18:"/trac/wiki/RoboEdu";i:1;s:8:"RoboEdu?";}i:2;i:2460;}i:85;a:3:{i:0;s:5:"cdata";i:1;a:1:{i:0;s:9:" às 17h.";}i:2;i:2491;}i:86;a:3:{i:0;s:7:"p_close";i:1;a:0:{}i:2;i:2500;}i:87;a:3:{i:0;s:13:"section_close";i:1;a:0:{}i:2;i:2502;}i:88;a:3:{i:0;s:12:"section_edit";i:1;a:4:{i:0;i:2060;i:1;i:2501;i:2;i:3;i:3;s:34:"8) [[/trac/wiki/RoboEdu|RoboEdu?]]";}i:2;i:2502;}i:89;a:3:{i:0;s:6:"header";i:1;a:3:{i:0;s:23:"9) Cadastro ex-petianos";i:1;i:3;i:2;i:2502;}i:2;i:2502;}i:90;a:3:{i:0;s:12:"section_open";i:1;a:1:{i:0;i:3;}i:2;i:2502;}i:91;a:3:{i:0;s:6:"p_open";i:1;a:0:{}i:2;i:2535;}i:92;a:3:{i:0;s:5:"cdata";i:1;a:1:{i:0;s:94:"
O grupo comenta como está o processo de busca e cadastramento de dados dos antigos petianos.";}i:2;i:2536;}i:93;a:3:{i:0;s:7:"p_close";i:1;a:0:{}i:2;i:2630;}i:94;a:3:{i:0;s:13:"section_close";i:1;a:0:{}i:2;i:2632;}i:95;a:3:{i:0;s:12:"section_edit";i:1;a:4:{i:0;i:2502;i:1;i:2631;i:2;i:3;i:3;s:23:"9) Cadastro ex-petianos";}i:2;i:2632;}i:96;a:3:{i:0;s:6:"header";i:1;a:3:{i:0;s:26:"10) Apresentação SIC PUC";i:1;i:3;i:2;i:2632;}i:2;i:2632;}i:97;a:3:{i:0;s:12:"section_open";i:1;a:1:{i:0;i:3;}i:2;i:2632;}i:98;a:3:{i:0;s:6:"p_open";i:1;a:0:{}i:2;i:2668;}i:99;a:3:{i:0;s:5:"cdata";i:1;a:1:{i:0;s:172:"
Marcelo comenta que amanha irá na abertura do evento e também ficará ao lado do pôster dando explicações. E na quinta, pela manhã, fará apresentação do trabalho.";}i:2;i:2669;}i:100;a:3:{i:0;s:7:"p_close";i:1;a:0:{}i:2;i:2841;}i:101;a:3:{i:0;s:13:"section_close";i:1;a:0:{}i:2;i:2843;}i:102;a:3:{i:0;s:12:"section_edit";i:1;a:4:{i:0;i:2632;i:1;i:2842;i:2;i:3;i:3;s:26:"10) Apresentação SIC PUC";}i:2;i:2843;}i:103;a:3:{i:0;s:6:"header";i:1;a:3:{i:0;s:29:"11) Comemoração 18 anos PET";i:1;i:3;i:2;i:2843;}i:2;i:2843;}i:104;a:3:{i:0;s:12:"section_open";i:1;a:1:{i:0;i:3;}i:2;i:2843;}i:105;a:3:{i:0;s:6:"p_open";i:1;a:0:{}i:2;i:2882;}i:106;a:3:{i:0;s:5:"cdata";i:1;a:1:{i:0;s:584:"
Marcos comenta que nenhum professor respondeu ao e-mail enviado por ele. Também conta como, possivelmente, será o mini-salão de IC organizado pelo PET. Diz que coletou informações sobre os pôsteres do nosso Instituto no Salão de IC da UFRGS. A mostra de pôsteres provavelmente será no horário do meio-dia, na semana do dia 13/NOV. No dia 17/NOV será o lançamento do Museu, também haverá visitas ao museu no mesmo esquema que aconteceu meses atrás com a visita da escola do Interior. E após, no dia 17, haverá uma janta de confraternização entre petianos na Faurgs.";}i:2;i:2883;}i:107;a:3:{i:0;s:7:"p_close";i:1;a:0:{}i:2;i:3467;}i:108;a:3:{i:0;s:13:"section_close";i:1;a:0:{}i:2;i:3469;}i:109;a:3:{i:0;s:12:"section_edit";i:1;a:4:{i:0;i:2843;i:1;i:3468;i:2;i:3;i:3;s:29:"11) Comemoração 18 anos PET";}i:2;i:3469;}i:110;a:3:{i:0;s:6:"header";i:1;a:3:{i:0;s:28:"12) Apoio ao NELE - Hardware";i:1;i:3;i:2;i:3469;}i:2;i:3469;}i:111;a:3:{i:0;s:12:"section_open";i:1;a:1:{i:0;i:3;}i:2;i:3469;}i:112;a:3:{i:0;s:6:"p_open";i:1;a:0:{}i:2;i:3507;}i:113;a:3:{i:0;s:5:"cdata";i:1;a:1:{i:0;s:163:"
Dante comenta que um dos novos computadores do NELE está com problemas no hardware. Antônio, com ajuda de Ricardo, prontifica-se a ir lá tentar consertar o PC.";}i:2;i:3508;}i:114;a:3:{i:0;s:7:"p_close";i:1;a:0:{}i:2;i:3671;}i:115;a:3:{i:0;s:13:"section_close";i:1;a:0:{}i:2;i:3673;}i:116;a:3:{i:0;s:12:"section_edit";i:1;a:4:{i:0;i:3469;i:1;i:3672;i:2;i:3;i:3;s:28:"12) Apoio ao NELE - Hardware";}i:2;i:3673;}i:117;a:3:{i:0;s:6:"header";i:1;a:3:{i:0;s:39:"13) Participação em Reunião do Museu";i:1;i:3;i:2;i:3673;}i:2;i:3673;}i:118;a:3:{i:0;s:12:"section_open";i:1;a:1:{i:0;i:3;}i:2;i:3673;}i:119;a:3:{i:0;s:6:"p_open";i:1;a:0:{}i:2;i:3722;}i:120;a:3:{i:0;s:5:"cdata";i:1;a:1:{i:0;s:217:"
Marcelo e Flores participarão da reunião sobre o museu na sala 214(ADM-INF) na próxima segunda-feira às 14h30. Marcelo também enviará e-mail a Valdeni sobre a possibilidade de digitalizar os pôsteres do Museu.";}i:2;i:3723;}i:121;a:3:{i:0;s:7:"p_close";i:1;a:0:{}i:2;i:3940;}i:122;a:3:{i:0;s:13:"section_close";i:1;a:0:{}i:2;i:3942;}i:123;a:3:{i:0;s:12:"section_edit";i:1;a:4:{i:0;i:3673;i:1;i:3941;i:2;i:3;i:3;s:39:"13) Participação em Reunião do Museu";}i:2;i:3942;}i:124;a:3:{i:0;s:6:"header";i:1;a:3:{i:0;s:12:"14) INTERPET";i:1;i:3;i:2;i:3942;}i:2;i:3942;}i:125;a:3:{i:0;s:12:"section_open";i:1;a:1:{i:0;i:3;}i:2;i:3942;}i:126;a:3:{i:0;s:6:"p_open";i:1;a:0:{}i:2;i:3964;}i:127;a:3:{i:0;s:5:"cdata";i:1;a:1:{i:0;s:208:"
Flores comenta comenta sobre como foi o INTERPET ocorrido minutos antes desta reunião do grupo PET Computação. Dante cita que o pessoal do DCE virá dar uma palavrinha na próxima reunião do nosso grupo.";}i:2;i:3965;}i:128;a:3:{i:0;s:7:"p_close";i:1;a:0:{}i:2;i:4173;}i:129;a:3:{i:0;s:13:"section_close";i:1;a:0:{}i:2;i:4174;}i:130;a:3:{i:0;s:12:"section_edit";i:1;a:4:{i:0;i:3942;i:1;i:0;i:2;i:3;i:3;s:12:"14) INTERPET";}i:2;i:4174;}i:131;a:3:{i:0;s:12:"document_end";i:1;a:0:{}i:2;i:4174;}}