a:118:{i:0;a:3:{i:0;s:14:"document_start";i:1;a:0:{}i:2;i:0;}i:1;a:3:{i:0;s:6:"p_open";i:1;a:0:{}i:2;i:0;}i:2;a:3:{i:0;s:5:"cdata";i:1;a:1:{i:0;s:134:"Dia: 17/12/04 Presentes: Diego, Paulo, Nondillo, Vinícius, João, Lilian, Gustavo, Robert, Wagner, Dante, Hartmann. Relator: Gustavo
";}i:2;i:1;}i:3;a:3:{i:0;s:7:"p_close";i:1;a:0:{}i:2;i:135;}i:4;a:3:{i:0;s:10:"listu_open";i:1;a:0:{}i:2;i:135;}i:5;a:3:{i:0;s:13:"listitem_open";i:1;a:1:{i:0;i:1;}i:2;i:135;}i:6;a:3:{i:0;s:16:"listcontent_open";i:1;a:0:{}i:2;i:135;}i:7;a:3:{i:0;s:5:"cdata";i:1;a:1:{i:0;s:20:" 1. Dias de Férias:";}i:2;i:139;}i:8;a:3:{i:0;s:17:"listcontent_close";i:1;a:0:{}i:2;i:159;}i:9;a:3:{i:0;s:14:"listitem_close";i:1;a:0:{}i:2;i:159;}i:10;a:3:{i:0;s:11:"listu_close";i:1;a:0:{}i:2;i:159;}i:11;a:3:{i:0;s:10:"quote_open";i:1;a:0:{}i:2;i:160;}i:12;a:3:{i:0;s:10:"quote_open";i:1;a:0:{}i:2;i:160;}i:13;a:3:{i:0;s:5:"cdata";i:1;a:1:{i:0;s:50:" Aprovado as férias de 17/01/2005 até 04/03/2005";}i:2;i:163;}i:14;a:3:{i:0;s:11:"quote_close";i:1;a:0:{}i:2;i:213;}i:15;a:3:{i:0;s:11:"quote_close";i:1;a:0:{}i:2;i:213;}i:16;a:3:{i:0;s:10:"listu_open";i:1;a:0:{}i:2;i:214;}i:17;a:3:{i:0;s:13:"listitem_open";i:1;a:1:{i:0;i:1;}i:2;i:214;}i:18;a:3:{i:0;s:16:"listcontent_open";i:1;a:0:{}i:2;i:214;}i:19;a:3:{i:0;s:5:"cdata";i:1;a:1:{i:0;s:26:" 2. Reuniões nas férias:";}i:2;i:218;}i:20;a:3:{i:0;s:17:"listcontent_close";i:1;a:0:{}i:2;i:244;}i:21;a:3:{i:0;s:14:"listitem_close";i:1;a:0:{}i:2;i:244;}i:22;a:3:{i:0;s:11:"listu_close";i:1;a:0:{}i:2;i:244;}i:23;a:3:{i:0;s:10:"quote_open";i:1;a:0:{}i:2;i:245;}i:24;a:3:{i:0;s:10:"quote_open";i:1;a:0:{}i:2;i:245;}i:25;a:3:{i:0;s:5:"cdata";i:1;a:1:{i:0;s:63:" Marcada as próximas reniões para as terças-feiras à 13:30.";}i:2;i:248;}i:26;a:3:{i:0;s:11:"quote_close";i:1;a:0:{}i:2;i:311;}i:27;a:3:{i:0;s:11:"quote_close";i:1;a:0:{}i:2;i:311;}i:28;a:3:{i:0;s:10:"listu_open";i:1;a:0:{}i:2;i:312;}i:29;a:3:{i:0;s:13:"listitem_open";i:1;a:1:{i:0;i:1;}i:2;i:312;}i:30;a:3:{i:0;s:16:"listcontent_open";i:1;a:0:{}i:2;i:312;}i:31;a:3:{i:0;s:5:"cdata";i:1;a:1:{i:0;s:24:" 3. Material de Consumo:";}i:2;i:316;}i:32;a:3:{i:0;s:17:"listcontent_close";i:1;a:0:{}i:2;i:340;}i:33;a:3:{i:0;s:14:"listitem_close";i:1;a:0:{}i:2;i:340;}i:34;a:3:{i:0;s:11:"listu_close";i:1;a:0:{}i:2;i:340;}i:35;a:3:{i:0;s:10:"listu_open";i:1;a:0:{}i:2;i:341;}i:36;a:3:{i:0;s:13:"listitem_open";i:1;a:1:{i:0;i:1;}i:2;i:341;}i:37;a:3:{i:0;s:16:"listcontent_open";i:1;a:0:{}i:2;i:341;}i:38;a:3:{i:0;s:5:"cdata";i:1;a:1:{i:0;s:20:" 4. Sujeira da Sala:";}i:2;i:345;}i:39;a:3:{i:0;s:17:"listcontent_close";i:1;a:0:{}i:2;i:365;}i:40;a:3:{i:0;s:14:"listitem_close";i:1;a:0:{}i:2;i:365;}i:41;a:3:{i:0;s:11:"listu_close";i:1;a:0:{}i:2;i:365;}i:42;a:3:{i:0;s:10:"quote_open";i:1;a:0:{}i:2;i:366;}i:43;a:3:{i:0;s:10:"quote_open";i:1;a:0:{}i:2;i:366;}i:44;a:3:{i:0;s:5:"cdata";i:1;a:1:{i:0;s:51:" Os petianos devem colocar os copos usados no lixo.";}i:2;i:369;}i:45;a:3:{i:0;s:11:"quote_close";i:1;a:0:{}i:2;i:420;}i:46;a:3:{i:0;s:11:"quote_close";i:1;a:0:{}i:2;i:420;}i:47;a:3:{i:0;s:10:"listu_open";i:1;a:0:{}i:2;i:421;}i:48;a:3:{i:0;s:13:"listitem_open";i:1;a:1:{i:0;i:1;}i:2;i:421;}i:49;a:3:{i:0;s:16:"listcontent_open";i:1;a:0:{}i:2;i:421;}i:50;a:3:{i:0;s:5:"cdata";i:1;a:1:{i:0;s:23:" 5. Projetos para 2005:";}i:2;i:425;}i:51;a:3:{i:0;s:17:"listcontent_close";i:1;a:0:{}i:2;i:448;}i:52;a:3:{i:0;s:10:"listu_open";i:1;a:0:{}i:2;i:448;}i:53;a:3:{i:0;s:13:"listitem_open";i:1;a:1:{i:0;i:2;}i:2;i:448;}i:54;a:3:{i:0;s:16:"listcontent_open";i:1;a:0:{}i:2;i:448;}i:55;a:3:{i:0;s:5:"cdata";i:1;a:1:{i:0;s:71:" Desenvolvimento de um software com parceria do Ministério do Esporte.";}i:2;i:454;}i:56;a:3:{i:0;s:17:"listcontent_close";i:1;a:0:{}i:2;i:525;}i:57;a:3:{i:0;s:14:"listitem_close";i:1;a:0:{}i:2;i:525;}i:58;a:3:{i:0;s:13:"listitem_open";i:1;a:1:{i:0;i:2;}i:2;i:525;}i:59;a:3:{i:0;s:16:"listcontent_open";i:1;a:0:{}i:2;i:525;}i:60;a:3:{i:0;s:5:"cdata";i:1;a:1:{i:0;s:63:" Software de integração de powerpoint e captura de movimento.";}i:2;i:531;}i:61;a:3:{i:0;s:17:"listcontent_close";i:1;a:0:{}i:2;i:594;}i:62;a:3:{i:0;s:14:"listitem_close";i:1;a:0:{}i:2;i:594;}i:63;a:3:{i:0;s:13:"listitem_open";i:1;a:1:{i:0;i:2;}i:2;i:594;}i:64;a:3:{i:0;s:16:"listcontent_open";i:1;a:0:{}i:2;i:594;}i:65;a:3:{i:0;s:5:"cdata";i:1;a:1:{i:0;s:60:" Projeto de realidade virtual juntamente com IA _ Simulaçao";}i:2;i:600;}i:66;a:3:{i:0;s:17:"listcontent_close";i:1;a:0:{}i:2;i:660;}i:67;a:3:{i:0;s:14:"listitem_close";i:1;a:0:{}i:2;i:660;}i:68;a:3:{i:0;s:11:"listu_close";i:1;a:0:{}i:2;i:660;}i:69;a:3:{i:0;s:14:"listitem_close";i:1;a:0:{}i:2;i:660;}i:70;a:3:{i:0;s:11:"listu_close";i:1;a:0:{}i:2;i:660;}i:71;a:3:{i:0;s:6:"p_open";i:1;a:0:{}i:2;i:660;}i:72;a:3:{i:0;s:5:"cdata";i:1;a:1:{i:0;s:26:"
6- Certificados da SNCT:
";}i:2;i:661;}i:73;a:3:{i:0;s:7:"p_close";i:1;a:0:{}i:2;i:687;}i:74;a:3:{i:0;s:10:"quote_open";i:1;a:0:{}i:2;i:687;}i:75;a:3:{i:0;s:5:"cdata";i:1;a:1:{i:0;s:68:" Diego encarregado em verificar quem tem interesse nos certificados.";}i:2;i:689;}i:76;a:3:{i:0;s:11:"quote_close";i:1;a:0:{}i:2;i:757;}i:77;a:3:{i:0;s:6:"p_open";i:1;a:0:{}i:2;i:757;}i:78;a:3:{i:0;s:5:"cdata";i:1;a:1:{i:0;s:11:"
7- ENADE:
";}i:2;i:758;}i:79;a:3:{i:0;s:7:"p_close";i:1;a:0:{}i:2;i:769;}i:80;a:3:{i:0;s:10:"quote_open";i:1;a:0:{}i:2;i:769;}i:81;a:3:{i:0;s:5:"cdata";i:1;a:1:{i:0;s:93:" Criação de uma comissão para fazer uma palestra com os escolhidos para fazerem o provão.";}i:2;i:771;}i:82;a:3:{i:0;s:11:"quote_close";i:1;a:0:{}i:2;i:864;}i:83;a:3:{i:0;s:6:"p_open";i:1;a:0:{}i:2;i:864;}i:84;a:3:{i:0;s:5:"cdata";i:1;a:1:{i:0;s:24:"
8- Seminário Técnico
";}i:2;i:865;}i:85;a:3:{i:0;s:7:"p_close";i:1;a:0:{}i:2;i:889;}i:86;a:3:{i:0;s:10:"quote_open";i:1;a:0:{}i:2;i:889;}i:87;a:3:{i:0;s:5:"cdata";i:1;a:1:{i:0;s:75:" Comentado a possibilidade de cada petiano realizar um seminário técnico.";}i:2;i:891;}i:88;a:3:{i:0;s:11:"quote_close";i:1;a:0:{}i:2;i:966;}i:89;a:3:{i:0;s:6:"p_open";i:1;a:0:{}i:2;i:966;}i:90;a:3:{i:0;s:5:"cdata";i:1;a:1:{i:0;s:24:"
9- Reunião do Robopet
";}i:2;i:967;}i:91;a:3:{i:0;s:7:"p_close";i:1;a:0:{}i:2;i:991;}i:92;a:3:{i:0;s:10:"quote_open";i:1;a:0:{}i:2;i:991;}i:93;a:3:{i:0;s:5:"cdata";i:1;a:1:{i:0;s:29:" Marcada para o dia 11/01/05.";}i:2;i:993;}i:94;a:3:{i:0;s:11:"quote_close";i:1;a:0:{}i:2;i:1022;}i:95;a:3:{i:0;s:6:"p_open";i:1;a:0:{}i:2;i:1022;}i:96;a:3:{i:0;s:5:"cdata";i:1;a:1:{i:0;s:48:"
10- Roteiro da avaliação do Pet Computação
";}i:2;i:1023;}i:97;a:3:{i:0;s:7:"p_close";i:1;a:0:{}i:2;i:1071;}i:98;a:3:{i:0;s:10:"quote_open";i:1;a:0:{}i:2;i:1071;}i:99;a:3:{i:0;s:5:"cdata";i:1;a:1:{i:0;s:79:" Apresentado pelo nondillo o dia da visita da comissão de avaliação dos pet.";}i:2;i:1073;}i:100;a:3:{i:0;s:11:"quote_close";i:1;a:0:{}i:2;i:1152;}i:101;a:3:{i:0;s:6:"p_open";i:1;a:0:{}i:2;i:1152;}i:102;a:3:{i:0;s:5:"cdata";i:1;a:1:{i:0;s:25:"
11- Dupla diplomação.
";}i:2;i:1153;}i:103;a:3:{i:0;s:7:"p_close";i:1;a:0:{}i:2;i:1178;}i:104;a:3:{i:0;s:10:"quote_open";i:1;a:0:{}i:2;i:1178;}i:105;a:3:{i:0;s:5:"cdata";i:1;a:1:{i:0;s:87:" Hartmann relatou como foi a reunião que tratou sobre o assunto da dupla diplomação.";}i:2;i:1180;}i:106;a:3:{i:0;s:11:"quote_close";i:1;a:0:{}i:2;i:1267;}i:107;a:3:{i:0;s:6:"p_open";i:1;a:0:{}i:2;i:1267;}i:108;a:3:{i:0;s:5:"cdata";i:1;a:1:{i:0;s:47:"
12- Discussão da pesquisa do IBGE sobre Fome
";}i:2;i:1268;}i:109;a:3:{i:0;s:7:"p_close";i:1;a:0:{}i:2;i:1315;}i:110;a:3:{i:0;s:10:"quote_open";i:1;a:0:{}i:2;i:1315;}i:111;a:3:{i:0;s:5:"cdata";i:1;a:1:{i:0;s:70:" Foi discutida a pesquisa do IBGE e a questão do programa do governo ";}i:2;i:1317;}i:112;a:3:{i:0;s:18:"doublequoteopening";i:1;a:0:{}i:2;i:1387;}i:113;a:3:{i:0;s:5:"cdata";i:1;a:1:{i:0;s:9:"Fome Zero";}i:2;i:1388;}i:114;a:3:{i:0;s:18:"doublequoteclosing";i:1;a:0:{}i:2;i:1397;}i:115;a:3:{i:0;s:5:"cdata";i:1;a:1:{i:0;s:1:".";}i:2;i:1398;}i:116;a:3:{i:0;s:11:"quote_close";i:1;a:0:{}i:2;i:1399;}i:117;a:3:{i:0;s:12:"document_end";i:1;a:0:{}i:2;i:1399;}}