a:131:{i:0;a:3:{i:0;s:14:"document_start";i:1;a:0:{}i:2;i:0;}i:1;a:3:{i:0;s:6:"p_open";i:1;a:0:{}i:2;i:0;}i:2;a:3:{i:0;s:7:"p_close";i:1;a:0:{}i:2;i:1;}i:3;a:3:{i:0;s:12:"section_edit";i:1;a:4:{i:0;i:-1;i:1;i:0;i:2;i:1;i:3;s:0:"";}i:2;i:1;}i:4;a:3:{i:0;s:6:"header";i:1;a:3:{i:0;s:42:"**Ata da Reunião de 08 de abril de 2008**";i:1;i:2;i:2;i:1;}i:2;i:1;}i:5;a:3:{i:0;s:12:"section_open";i:1;a:1:{i:0;i:2;}i:2;i:1;}i:6;a:3:{i:0;s:6:"p_open";i:1;a:0:{}i:2;i:55;}i:7;a:3:{i:0;s:5:"cdata";i:1;a:1:{i:0;s:154:"
Presentes: Antônio, Arthur, Bruno, Dante, Mizusaki, Portal, Matheus, Felipe, Kauê, Cassiana, Zambiasi, Marcela e Leonardo. Ausentes: Rosália (doente).";}i:2;i:56;}i:8;a:3:{i:0;s:7:"p_close";i:1;a:0:{}i:2;i:210;}i:9;a:3:{i:0;s:6:"p_open";i:1;a:0:{}i:2;i:210;}i:10;a:3:{i:0;s:5:"cdata";i:1;a:1:{i:0;s:18:"Relatora: Cassiana";}i:2;i:212;}i:11;a:3:{i:0;s:7:"p_close";i:1;a:0:{}i:2;i:230;}i:12;a:3:{i:0;s:6:"p_open";i:1;a:0:{}i:2;i:230;}i:13;a:3:{i:0;s:11:"strong_open";i:1;a:0:{}i:2;i:232;}i:14;a:3:{i:0;s:5:"cdata";i:1;a:1:{i:0;s:23:"== Objetivos ROBOPET ==";}i:2;i:234;}i:15;a:3:{i:0;s:12:"strong_close";i:1;a:0:{}i:2;i:257;}i:16;a:3:{i:0;s:7:"p_close";i:1;a:0:{}i:2;i:259;}i:17;a:3:{i:0;s:6:"p_open";i:1;a:0:{}i:2;i:259;}i:18;a:3:{i:0;s:5:"cdata";i:1;a:1:{i:0;s:102:"Objetivo Geral: Entregar, até a última reunião de junho, todos os módulos (em separado) prontos e ";}i:2;i:261;}i:19;a:3:{i:0;s:11:"strong_open";i:1;a:0:{}i:2;i:363;}i:20;a:3:{i:0;s:5:"cdata";i:1;a:1:{i:0;s:12:"documentados";}i:2;i:365;}i:21;a:3:{i:0;s:12:"strong_close";i:1;a:0:{}i:2;i:377;}i:22;a:3:{i:0;s:5:"cdata";i:1;a:1:{i:0;s:1:".";}i:2;i:379;}i:23;a:3:{i:0;s:7:"p_close";i:1;a:0:{}i:2;i:380;}i:24;a:3:{i:0;s:6:"p_open";i:1;a:0:{}i:2;i:380;}i:25;a:3:{i:0;s:5:"cdata";i:1;a:1:{i:0;s:24:"1) Objetivos Mecânica:
";}i:2;i:382;}i:26;a:3:{i:0;s:7:"p_close";i:1;a:0:{}i:2;i:406;}i:27;a:3:{i:0;s:10:"listu_open";i:1;a:0:{}i:2;i:406;}i:28;a:3:{i:0;s:13:"listitem_open";i:1;a:1:{i:0;i:1;}i:2;i:406;}i:29;a:3:{i:0;s:16:"listcontent_open";i:1;a:0:{}i:2;i:406;}i:30;a:3:{i:0;s:5:"cdata";i:1;a:1:{i:0;s:44:" desenvolver chutador para o robô do Itamir";}i:2;i:410;}i:31;a:3:{i:0;s:17:"listcontent_close";i:1;a:0:{}i:2;i:454;}i:32;a:3:{i:0;s:14:"listitem_close";i:1;a:0:{}i:2;i:454;}i:33;a:3:{i:0;s:13:"listitem_open";i:1;a:1:{i:0;i:1;}i:2;i:454;}i:34;a:3:{i:0;s:16:"listcontent_open";i:1;a:0:{}i:2;i:454;}i:35;a:3:{i:0;s:5:"cdata";i:1;a:1:{i:0;s:28:" desenhar chassi com 4 rodas";}i:2;i:458;}i:36;a:3:{i:0;s:17:"listcontent_close";i:1;a:0:{}i:2;i:486;}i:37;a:3:{i:0;s:14:"listitem_close";i:1;a:0:{}i:2;i:486;}i:38;a:3:{i:0;s:13:"listitem_open";i:1;a:1:{i:0;i:1;}i:2;i:486;}i:39;a:3:{i:0;s:16:"listcontent_open";i:1;a:0:{}i:2;i:486;}i:40;a:3:{i:0;s:5:"cdata";i:1;a:1:{i:0;s:20:" mecanismo de drible";}i:2;i:490;}i:41;a:3:{i:0;s:17:"listcontent_close";i:1;a:0:{}i:2;i:510;}i:42;a:3:{i:0;s:14:"listitem_close";i:1;a:0:{}i:2;i:510;}i:43;a:3:{i:0;s:13:"listitem_open";i:1;a:1:{i:0;i:1;}i:2;i:510;}i:44;a:3:{i:0;s:16:"listcontent_open";i:1;a:0:{}i:2;i:510;}i:45;a:3:{i:0;s:5:"cdata";i:1;a:1:{i:0;s:38:" escolher local para encomendar peças";}i:2;i:514;}i:46;a:3:{i:0;s:17:"listcontent_close";i:1;a:0:{}i:2;i:552;}i:47;a:3:{i:0;s:14:"listitem_close";i:1;a:0:{}i:2;i:552;}i:48;a:3:{i:0;s:13:"listitem_open";i:1;a:1:{i:0;i:1;}i:2;i:552;}i:49;a:3:{i:0;s:16:"listcontent_open";i:1;a:0:{}i:2;i:552;}i:50;a:3:{i:0;s:5:"cdata";i:1;a:1:{i:0;s:18:" pesquisar motores";}i:2;i:556;}i:51;a:3:{i:0;s:17:"listcontent_close";i:1;a:0:{}i:2;i:574;}i:52;a:3:{i:0;s:14:"listitem_close";i:1;a:0:{}i:2;i:574;}i:53;a:3:{i:0;s:11:"listu_close";i:1;a:0:{}i:2;i:574;}i:54;a:3:{i:0;s:10:"quote_open";i:1;a:0:{}i:2;i:575;}i:55;a:3:{i:0;s:5:"cdata";i:1;a:1:{i:0;s:61:" Até a próxima reunião apresentar um rascunho do chutador.";}i:2;i:577;}i:56;a:3:{i:0;s:11:"quote_close";i:1;a:0:{}i:2;i:638;}i:57;a:3:{i:0;s:6:"p_open";i:1;a:0:{}i:2;i:638;}i:58;a:3:{i:0;s:5:"cdata";i:1;a:1:{i:0;s:27:"
2) Objetivos Eletrônica:
";}i:2;i:639;}i:59;a:3:{i:0;s:7:"p_close";i:1;a:0:{}i:2;i:666;}i:60;a:3:{i:0;s:10:"listu_open";i:1;a:0:{}i:2;i:666;}i:61;a:3:{i:0;s:13:"listitem_open";i:1;a:1:{i:0;i:1;}i:2;i:666;}i:62;a:3:{i:0;s:16:"listcontent_open";i:1;a:0:{}i:2;i:666;}i:63;a:3:{i:0;s:5:"cdata";i:1;a:1:{i:0;s:27:" fazer mais testes na placa";}i:2;i:670;}i:64;a:3:{i:0;s:17:"listcontent_close";i:1;a:0:{}i:2;i:697;}i:65;a:3:{i:0;s:14:"listitem_close";i:1;a:0:{}i:2;i:697;}i:66;a:3:{i:0;s:13:"listitem_open";i:1;a:1:{i:0;i:1;}i:2;i:697;}i:67;a:3:{i:0;s:16:"listcontent_open";i:1;a:0:{}i:2;i:697;}i:68;a:3:{i:0;s:5:"cdata";i:1;a:1:{i:0;s:189:" trabalhar na versão beta: A: programação Circuit B: novo motor C: controle de bateria D: 2 bits para o chutador E: rádio melhorado (controle de rádio) F: comentar/melhorar código PIC";}i:2;i:701;}i:69;a:3:{i:0;s:17:"listcontent_close";i:1;a:0:{}i:2;i:890;}i:70;a:3:{i:0;s:14:"listitem_close";i:1;a:0:{}i:2;i:890;}i:71;a:3:{i:0;s:11:"listu_close";i:1;a:0:{}i:2;i:890;}i:72;a:3:{i:0;s:10:"quote_open";i:1;a:0:{}i:2;i:891;}i:73;a:3:{i:0;s:5:"cdata";i:1;a:1:{i:0;s:51:" Até a proxima reunião apresentar tópicos A e B.";}i:2;i:893;}i:74;a:3:{i:0;s:11:"quote_close";i:1;a:0:{}i:2;i:944;}i:75;a:3:{i:0;s:6:"p_open";i:1;a:0:{}i:2;i:944;}i:76;a:3:{i:0;s:5:"cdata";i:1;a:1:{i:0;s:22:"
3) Objetivos Rádio:
";}i:2;i:945;}i:77;a:3:{i:0;s:7:"p_close";i:1;a:0:{}i:2;i:967;}i:78;a:3:{i:0;s:10:"listu_open";i:1;a:0:{}i:2;i:967;}i:79;a:3:{i:0;s:13:"listitem_open";i:1;a:1:{i:0;i:1;}i:2;i:967;}i:80;a:3:{i:0;s:16:"listcontent_open";i:1;a:0:{}i:2;i:967;}i:81;a:3:{i:0;s:5:"cdata";i:1;a:1:{i:0;s:25:" pesquisar sinais do juiz";}i:2;i:971;}i:82;a:3:{i:0;s:17:"listcontent_close";i:1;a:0:{}i:2;i:996;}i:83;a:3:{i:0;s:14:"listitem_close";i:1;a:0:{}i:2;i:996;}i:84;a:3:{i:0;s:11:"listu_close";i:1;a:0:{}i:2;i:996;}i:85;a:3:{i:0;s:10:"quote_open";i:1;a:0:{}i:2;i:997;}i:86;a:3:{i:0;s:5:"cdata";i:1;a:1:{i:0;s:44:" Até a próxima reunião deve estar pronto.";}i:2;i:999;}i:87;a:3:{i:0;s:11:"quote_close";i:1;a:0:{}i:2;i:1043;}i:88;a:3:{i:0;s:6:"p_open";i:1;a:0:{}i:2;i:1043;}i:89;a:3:{i:0;s:5:"cdata";i:1;a:1:{i:0;s:18:"
4) Objetivos IA:
";}i:2;i:1044;}i:90;a:3:{i:0;s:7:"p_close";i:1;a:0:{}i:2;i:1062;}i:91;a:3:{i:0;s:10:"listu_open";i:1;a:0:{}i:2;i:1062;}i:92;a:3:{i:0;s:13:"listitem_open";i:1;a:1:{i:0;i:1;}i:2;i:1062;}i:93;a:3:{i:0;s:16:"listcontent_open";i:1;a:0:{}i:2;i:1062;}i:94;a:3:{i:0;s:5:"cdata";i:1;a:1:{i:0;s:36:" formatar entrada conforme protocolo";}i:2;i:1066;}i:95;a:3:{i:0;s:17:"listcontent_close";i:1;a:0:{}i:2;i:1102;}i:96;a:3:{i:0;s:14:"listitem_close";i:1;a:0:{}i:2;i:1102;}i:97;a:3:{i:0;s:13:"listitem_open";i:1;a:1:{i:0;i:1;}i:2;i:1102;}i:98;a:3:{i:0;s:16:"listcontent_open";i:1;a:0:{}i:2;i:1102;}i:99;a:3:{i:0;s:5:"cdata";i:1;a:1:{i:0;s:18:" estudar o código";}i:2;i:1106;}i:100;a:3:{i:0;s:17:"listcontent_close";i:1;a:0:{}i:2;i:1124;}i:101;a:3:{i:0;s:14:"listitem_close";i:1;a:0:{}i:2;i:1124;}i:102;a:3:{i:0;s:13:"listitem_open";i:1;a:1:{i:0;i:1;}i:2;i:1124;}i:103;a:3:{i:0;s:16:"listcontent_open";i:1;a:0:{}i:2;i:1124;}i:104;a:3:{i:0;s:5:"cdata";i:1;a:1:{i:0;s:38:" pesquisar protocolo de sinais do juiz";}i:2;i:1128;}i:105;a:3:{i:0;s:17:"listcontent_close";i:1;a:0:{}i:2;i:1166;}i:106;a:3:{i:0;s:14:"listitem_close";i:1;a:0:{}i:2;i:1166;}i:107;a:3:{i:0;s:11:"listu_close";i:1;a:0:{}i:2;i:1166;}i:108;a:3:{i:0;s:10:"quote_open";i:1;a:0:{}i:2;i:1167;}i:109;a:3:{i:0;s:5:"cdata";i:1;a:1:{i:0;s:65:" Até a próxima reunião deve fazer os dois primeiros objetivos.";}i:2;i:1169;}i:110;a:3:{i:0;s:11:"quote_close";i:1;a:0:{}i:2;i:1234;}i:111;a:3:{i:0;s:6:"p_open";i:1;a:0:{}i:2;i:1234;}i:112;a:3:{i:0;s:5:"cdata";i:1;a:1:{i:0;s:22:"
5) Objetivos Visão:
";}i:2;i:1235;}i:113;a:3:{i:0;s:7:"p_close";i:1;a:0:{}i:2;i:1257;}i:114;a:3:{i:0;s:10:"listu_open";i:1;a:0:{}i:2;i:1257;}i:115;a:3:{i:0;s:13:"listitem_open";i:1;a:1:{i:0;i:1;}i:2;i:1257;}i:116;a:3:{i:0;s:16:"listcontent_open";i:1;a:0:{}i:2;i:1257;}i:117;a:3:{i:0;s:5:"cdata";i:1;a:1:{i:0;s:26:" estruturação de código";}i:2;i:1261;}i:118;a:3:{i:0;s:17:"listcontent_close";i:1;a:0:{}i:2;i:1287;}i:119;a:3:{i:0;s:14:"listitem_close";i:1;a:0:{}i:2;i:1287;}i:120;a:3:{i:0;s:13:"listitem_open";i:1;a:1:{i:0;i:1;}i:2;i:1287;}i:121;a:3:{i:0;s:16:"listcontent_open";i:1;a:0:{}i:2;i:1287;}i:122;a:3:{i:0;s:5:"cdata";i:1;a:1:{i:0;s:26:" passar para Visual Studio";}i:2;i:1291;}i:123;a:3:{i:0;s:17:"listcontent_close";i:1;a:0:{}i:2;i:1317;}i:124;a:3:{i:0;s:14:"listitem_close";i:1;a:0:{}i:2;i:1317;}i:125;a:3:{i:0;s:11:"listu_close";i:1;a:0:{}i:2;i:1317;}i:126;a:3:{i:0;s:10:"quote_open";i:1;a:0:{}i:2;i:1318;}i:127;a:3:{i:0;s:5:"cdata";i:1;a:1:{i:0;s:58:" Até a próxima reunião deve apresentar esses objetivos.";}i:2;i:1320;}i:128;a:3:{i:0;s:11:"quote_close";i:1;a:0:{}i:2;i:1378;}i:129;a:3:{i:0;s:13:"section_close";i:1;a:0:{}i:2;i:1379;}i:130;a:3:{i:0;s:12:"document_end";i:1;a:0:{}i:2;i:1379;}}