a:104:{i:0;a:3:{i:0;s:14:"document_start";i:1;a:0:{}i:2;i:0;}i:1;a:3:{i:0;s:6:"p_open";i:1;a:0:{}i:2;i:0;}i:2;a:3:{i:0;s:7:"p_close";i:1;a:0:{}i:2;i:1;}i:3;a:3:{i:0;s:12:"section_edit";i:1;a:4:{i:0;i:-1;i:1;i:0;i:2;i:1;i:3;s:0:"";}i:2;i:1;}i:4;a:3:{i:0;s:6:"header";i:1;a:3:{i:0;s:41:"**Ata da Reunião de 25 de maio de 2008**";i:1;i:2;i:2;i:1;}i:2;i:1;}i:5;a:3:{i:0;s:12:"section_open";i:1;a:1:{i:0;i:2;}i:2;i:1;}i:6;a:3:{i:0;s:6:"p_open";i:1;a:0:{}i:2;i:54;}i:7;a:3:{i:0;s:5:"cdata";i:1;a:1:{i:0;s:152:"
Presentes: Antônio, Arthur, Bruno, Cassiana, Felipe, Gabriel, Leonardo, Marcela, Marcelo, Matheus, Rosália, Kauê, Dante. Ausentes: Lucas (Interpet).";}i:2;i:55;}i:8;a:3:{i:0;s:7:"p_close";i:1;a:0:{}i:2;i:207;}i:9;a:3:{i:0;s:6:"p_open";i:1;a:0:{}i:2;i:207;}i:10;a:3:{i:0;s:5:"cdata";i:1;a:1:{i:0;s:15:"Relator: Felipe";}i:2;i:209;}i:11;a:3:{i:0;s:7:"p_close";i:1;a:0:{}i:2;i:224;}i:12;a:3:{i:0;s:6:"p_open";i:1;a:0:{}i:2;i:224;}i:13;a:3:{i:0;s:11:"strong_open";i:1;a:0:{}i:2;i:226;}i:14;a:3:{i:0;s:5:"cdata";i:1;a:1:{i:0;s:23:"== Objetivos ROBOPET ==";}i:2;i:228;}i:15;a:3:{i:0;s:12:"strong_close";i:1;a:0:{}i:2;i:251;}i:16;a:3:{i:0;s:7:"p_close";i:1;a:0:{}i:2;i:253;}i:17;a:3:{i:0;s:6:"p_open";i:1;a:0:{}i:2;i:253;}i:18;a:3:{i:0;s:5:"cdata";i:1;a:1:{i:0;s:24:"1) Objetivos Mecânica:
";}i:2;i:255;}i:19;a:3:{i:0;s:7:"p_close";i:1;a:0:{}i:2;i:279;}i:20;a:3:{i:0;s:10:"quote_open";i:1;a:0:{}i:2;i:279;}i:21;a:3:{i:0;s:5:"cdata";i:1;a:1:{i:0;s:72:" Todas as metas estipuladas foram alcançadas e até a proxima reunião:";}i:2;i:281;}i:22;a:3:{i:0;s:11:"quote_close";i:1;a:0:{}i:2;i:353;}i:23;a:3:{i:0;s:10:"listu_open";i:1;a:0:{}i:2;i:354;}i:24;a:3:{i:0;s:13:"listitem_open";i:1;a:1:{i:0;i:1;}i:2;i:354;}i:25;a:3:{i:0;s:16:"listcontent_open";i:1;a:0:{}i:2;i:354;}i:26;a:3:{i:0;s:5:"cdata";i:1;a:1:{i:0;s:31:" Finalizar os antigo chassi no ";}i:2;i:358;}i:27;a:3:{i:0;s:12:"internallink";i:1;a:2:{i:0;s:21:"/trac/wiki/SolidWorks";i:1;s:11:"SolidWorks?";}i:2;i:389;}i:28;a:3:{i:0;s:5:"cdata";i:1;a:1:{i:0;s:1:";";}i:2;i:426;}i:29;a:3:{i:0;s:17:"listcontent_close";i:1;a:0:{}i:2;i:427;}i:30;a:3:{i:0;s:14:"listitem_close";i:1;a:0:{}i:2;i:427;}i:31;a:3:{i:0;s:13:"listitem_open";i:1;a:1:{i:0;i:1;}i:2;i:427;}i:32;a:3:{i:0;s:16:"listcontent_open";i:1;a:0:{}i:2;i:427;}i:33;a:3:{i:0;s:5:"cdata";i:1;a:1:{i:0;s:42:" Iniciar o desenvolvimento do novo chassi;";}i:2;i:431;}i:34;a:3:{i:0;s:17:"listcontent_close";i:1;a:0:{}i:2;i:473;}i:35;a:3:{i:0;s:14:"listitem_close";i:1;a:0:{}i:2;i:473;}i:36;a:3:{i:0;s:13:"listitem_open";i:1;a:1:{i:0;i:1;}i:2;i:473;}i:37;a:3:{i:0;s:16:"listcontent_open";i:1;a:0:{}i:2;i:473;}i:38;a:3:{i:0;s:5:"cdata";i:1;a:1:{i:0;s:59:" Analizar o melhor desempenho do robo (com 3 ou 4 motores).";}i:2;i:477;}i:39;a:3:{i:0;s:17:"listcontent_close";i:1;a:0:{}i:2;i:536;}i:40;a:3:{i:0;s:14:"listitem_close";i:1;a:0:{}i:2;i:536;}i:41;a:3:{i:0;s:11:"listu_close";i:1;a:0:{}i:2;i:536;}i:42;a:3:{i:0;s:6:"p_open";i:1;a:0:{}i:2;i:536;}i:43;a:3:{i:0;s:5:"cdata";i:1;a:1:{i:0;s:27:"
2) Objetivos Eletrônica:
";}i:2;i:537;}i:44;a:3:{i:0;s:7:"p_close";i:1;a:0:{}i:2;i:564;}i:45;a:3:{i:0;s:10:"quote_open";i:1;a:0:{}i:2;i:564;}i:46;a:3:{i:0;s:5:"cdata";i:1;a:1:{i:0;s:72:" Todas as metas estipuladas foram alcançadas e até a proxima reunião:";}i:2;i:566;}i:47;a:3:{i:0;s:11:"quote_close";i:1;a:0:{}i:2;i:638;}i:48;a:3:{i:0;s:10:"listu_open";i:1;a:0:{}i:2;i:639;}i:49;a:3:{i:0;s:13:"listitem_open";i:1;a:1:{i:0;i:1;}i:2;i:639;}i:50;a:3:{i:0;s:16:"listcontent_open";i:1;a:0:{}i:2;i:639;}i:51;a:3:{i:0;s:5:"cdata";i:1;a:1:{i:0;s:33:" Finalizar e testar a nova placa.";}i:2;i:643;}i:52;a:3:{i:0;s:17:"listcontent_close";i:1;a:0:{}i:2;i:676;}i:53;a:3:{i:0;s:14:"listitem_close";i:1;a:0:{}i:2;i:676;}i:54;a:3:{i:0;s:11:"listu_close";i:1;a:0:{}i:2;i:676;}i:55;a:3:{i:0;s:6:"p_open";i:1;a:0:{}i:2;i:676;}i:56;a:3:{i:0;s:5:"cdata";i:1;a:1:{i:0;s:22:"
3) Objetivos Rádio:
";}i:2;i:677;}i:57;a:3:{i:0;s:7:"p_close";i:1;a:0:{}i:2;i:699;}i:58;a:3:{i:0;s:10:"listu_open";i:1;a:0:{}i:2;i:699;}i:59;a:3:{i:0;s:13:"listitem_open";i:1;a:1:{i:0;i:1;}i:2;i:699;}i:60;a:3:{i:0;s:16:"listcontent_open";i:1;a:0:{}i:2;i:699;}i:61;a:3:{i:0;s:5:"cdata";i:1;a:1:{i:0;s:42:" Não fez nada de novo durante os 15 dias;";}i:2;i:703;}i:62;a:3:{i:0;s:17:"listcontent_close";i:1;a:0:{}i:2;i:745;}i:63;a:3:{i:0;s:14:"listitem_close";i:1;a:0:{}i:2;i:745;}i:64;a:3:{i:0;s:13:"listitem_open";i:1;a:1:{i:0;i:1;}i:2;i:745;}i:65;a:3:{i:0;s:16:"listcontent_open";i:1;a:0:{}i:2;i:745;}i:66;a:3:{i:0;s:5:"cdata";i:1;a:1:{i:0;s:23:" Irá testar com o PIC.";}i:2;i:749;}i:67;a:3:{i:0;s:17:"listcontent_close";i:1;a:0:{}i:2;i:772;}i:68;a:3:{i:0;s:14:"listitem_close";i:1;a:0:{}i:2;i:772;}i:69;a:3:{i:0;s:11:"listu_close";i:1;a:0:{}i:2;i:772;}i:70;a:3:{i:0;s:6:"p_open";i:1;a:0:{}i:2;i:772;}i:71;a:3:{i:0;s:5:"cdata";i:1;a:1:{i:0;s:18:"
4) Objetivos IA:
";}i:2;i:773;}i:72;a:3:{i:0;s:7:"p_close";i:1;a:0:{}i:2;i:791;}i:73;a:3:{i:0;s:10:"quote_open";i:1;a:0:{}i:2;i:791;}i:74;a:3:{i:0;s:5:"cdata";i:1;a:1:{i:0;s:72:" Todas as metas estipuladas foram alcançadas e até a proxima reunião:";}i:2;i:793;}i:75;a:3:{i:0;s:11:"quote_close";i:1;a:0:{}i:2;i:865;}i:76;a:3:{i:0;s:10:"listu_open";i:1;a:0:{}i:2;i:866;}i:77;a:3:{i:0;s:13:"listitem_open";i:1;a:1:{i:0;i:1;}i:2;i:866;}i:78;a:3:{i:0;s:16:"listcontent_open";i:1;a:0:{}i:2;i:866;}i:79;a:3:{i:0;s:5:"cdata";i:1;a:1:{i:0;s:97:" Marcou reunião para terça-feira depois do almoço para estipular novas metas e dividir tarefas";}i:2;i:870;}i:80;a:3:{i:0;s:17:"listcontent_close";i:1;a:0:{}i:2;i:967;}i:81;a:3:{i:0;s:14:"listitem_close";i:1;a:0:{}i:2;i:967;}i:82;a:3:{i:0;s:11:"listu_close";i:1;a:0:{}i:2;i:967;}i:83;a:3:{i:0;s:6:"p_open";i:1;a:0:{}i:2;i:967;}i:84;a:3:{i:0;s:5:"cdata";i:1;a:1:{i:0;s:22:"
5) Objetivos Visão:
";}i:2;i:968;}i:85;a:3:{i:0;s:7:"p_close";i:1;a:0:{}i:2;i:990;}i:86;a:3:{i:0;s:10:"quote_open";i:1;a:0:{}i:2;i:990;}i:87;a:3:{i:0;s:5:"cdata";i:1;a:1:{i:0;s:115:" Todas as metas estipuladas foram alcançadas, consegue agora trabalhar com duas cameras e até a proxima reunião:";}i:2;i:992;}i:88;a:3:{i:0;s:11:"quote_close";i:1;a:0:{}i:2;i:1107;}i:89;a:3:{i:0;s:10:"listu_open";i:1;a:0:{}i:2;i:1108;}i:90;a:3:{i:0;s:13:"listitem_open";i:1;a:1:{i:0;i:1;}i:2;i:1108;}i:91;a:3:{i:0;s:16:"listcontent_open";i:1;a:0:{}i:2;i:1108;}i:92;a:3:{i:0;s:5:"cdata";i:1;a:1:{i:0;s:50:" Irá realizar otimizações e fazer novos testes.";}i:2;i:1112;}i:93;a:3:{i:0;s:17:"listcontent_close";i:1;a:0:{}i:2;i:1162;}i:94;a:3:{i:0;s:14:"listitem_close";i:1;a:0:{}i:2;i:1162;}i:95;a:3:{i:0;s:11:"listu_close";i:1;a:0:{}i:2;i:1162;}i:96;a:3:{i:0;s:6:"p_open";i:1;a:0:{}i:2;i:1162;}i:97;a:3:{i:0;s:5:"cdata";i:1;a:1:{i:0;s:15:"
6) Simulador:
";}i:2;i:1163;}i:98;a:3:{i:0;s:7:"p_close";i:1;a:0:{}i:2;i:1178;}i:99;a:3:{i:0;s:10:"quote_open";i:1;a:0:{}i:2;i:1178;}i:100;a:3:{i:0;s:5:"cdata";i:1;a:1:{i:0;s:56:" Tem como meta fazer funcionar a comunicação com a IA.";}i:2;i:1180;}i:101;a:3:{i:0;s:11:"quote_close";i:1;a:0:{}i:2;i:1236;}i:102;a:3:{i:0;s:13:"section_close";i:1;a:0:{}i:2;i:1237;}i:103;a:3:{i:0;s:12:"document_end";i:1;a:0:{}i:2;i:1237;}}