a:116:{i:0;a:3:{i:0;s:14:"document_start";i:1;a:0:{}i:2;i:0;}i:1;a:3:{i:0;s:6:"p_open";i:1;a:0:{}i:2;i:0;}i:2;a:3:{i:0;s:7:"p_close";i:1;a:0:{}i:2;i:1;}i:3;a:3:{i:0;s:12:"section_edit";i:1;a:4:{i:0;i:-1;i:1;i:0;i:2;i:1;i:3;s:0:"";}i:2;i:1;}i:4;a:3:{i:0;s:6:"header";i:1;a:3:{i:0;s:29:"Ata da Reunião de 08/03/2006";i:1;i:1;i:2;i:1;}i:2;i:1;}i:5;a:3:{i:0;s:12:"section_open";i:1;a:1:{i:0;i:1;}i:2;i:1;}i:6;a:3:{i:0;s:6:"p_open";i:1;a:0:{}i:2;i:44;}i:7;a:3:{i:0;s:5:"cdata";i:1;a:1:{i:0;s:73:"
Presentes: Felipe, Thiago, Marcos, Vicente, Estevão, Nondillo e Fabiano";}i:2;i:45;}i:8;a:3:{i:0;s:7:"p_close";i:1;a:0:{}i:2;i:118;}i:9;a:3:{i:0;s:6:"p_open";i:1;a:0:{}i:2;i:118;}i:10;a:3:{i:0;s:5:"cdata";i:1;a:1:{i:0;s:28:"Ausentes: Dante(Justificado)";}i:2;i:120;}i:11;a:3:{i:0;s:7:"p_close";i:1;a:0:{}i:2;i:148;}i:12;a:3:{i:0;s:6:"p_open";i:1;a:0:{}i:2;i:148;}i:13;a:3:{i:0;s:5:"cdata";i:1;a:1:{i:0;s:16:"Relator: Vicente";}i:2;i:150;}i:14;a:3:{i:0;s:7:"p_close";i:1;a:0:{}i:2;i:166;}i:15;a:3:{i:0;s:6:"p_open";i:1;a:0:{}i:2;i:166;}i:16;a:3:{i:0;s:5:"cdata";i:1;a:1:{i:0;s:109:"Ps: Esta é a minha primeira Ata, qualquer erro que houver ou assunto que estiver faltando, é só me avisar.";}i:2;i:168;}i:17;a:3:{i:0;s:7:"p_close";i:1;a:0:{}i:2;i:277;}i:18;a:3:{i:0;s:13:"section_close";i:1;a:0:{}i:2;i:279;}i:19;a:3:{i:0;s:12:"section_edit";i:1;a:4:{i:0;i:1;i:1;i:278;i:2;i:1;i:3;s:29:"Ata da Reunião de 08/03/2006";}i:2;i:279;}i:20;a:3:{i:0;s:6:"header";i:1;a:3:{i:0;s:14:"Novo PC do Pet";i:1;i:2;i:2;i:279;}i:2;i:279;}i:21;a:3:{i:0;s:12:"section_open";i:1;a:1:{i:0;i:2;}i:2;i:279;}i:22;a:3:{i:0;s:6:"p_open";i:1;a:0:{}i:2;i:305;}i:23;a:3:{i:0;s:5:"cdata";i:1;a:1:{i:0;s:197:"
Fabiano enviou e-mail para o Luís Otávio. Este, na segunda-feira, encaminhou a compra e na quinta-feira o almoxarifado irá catalogá-lo. Ver se o Dante enviou o e-mail para fazer a nota fiscal.";}i:2;i:306;}i:24;a:3:{i:0;s:7:"p_close";i:1;a:0:{}i:2;i:503;}i:25;a:3:{i:0;s:13:"section_close";i:1;a:0:{}i:2;i:505;}i:26;a:3:{i:0;s:12:"section_edit";i:1;a:4:{i:0;i:279;i:1;i:504;i:2;i:2;i:3;s:14:"Novo PC do Pet";}i:2;i:505;}i:27;a:3:{i:0;s:6:"header";i:1;a:3:{i:0;s:23:"Seleção dos Bolsistas";i:1;i:2;i:2;i:505;}i:2;i:505;}i:28;a:3:{i:0;s:12:"section_open";i:1;a:1:{i:0;i:2;}i:2;i:505;}i:29;a:3:{i:0;s:6:"p_open";i:1;a:0:{}i:2;i:540;}i:30;a:3:{i:0;s:5:"cdata";i:1;a:1:{i:0;s:307:"
Marcos, Thiago, Estevão e Felipe imprimiram 10 anúncios e distribuíram ao redor do campus. Ainda foi enviado anúncios por e-mail, pelo orkut e também será avisado nas salas de aulas das turmas do segundo, terceiro e quarto semestre. Seria importante contratar bolsistas da ECP e de programadores web.";}i:2;i:541;}i:31;a:3:{i:0;s:7:"p_close";i:1;a:0:{}i:2;i:848;}i:32;a:3:{i:0;s:13:"section_close";i:1;a:0:{}i:2;i:850;}i:33;a:3:{i:0;s:12:"section_edit";i:1;a:4:{i:0;i:505;i:1;i:849;i:2;i:2;i:3;s:23:"Seleção dos Bolsistas";}i:2;i:850;}i:34;a:3:{i:0;s:6:"header";i:1;a:3:{i:0;s:24:"Justificativa do Vicente";i:1;i:2;i:2;i:850;}i:2;i:850;}i:35;a:3:{i:0;s:12:"section_open";i:1;a:1:{i:0;i:2;}i:2;i:850;}i:36;a:3:{i:0;s:6:"p_open";i:1;a:0:{}i:2;i:886;}i:37;a:3:{i:0;s:5:"cdata";i:1;a:1:{i:0;s:148:"
Defido à chegada de sua mãe de viagem, ele teve que ficar em casa para ajudar a organizar a casa. O grupo verificará se foi justificado ou não.";}i:2;i:887;}i:38;a:3:{i:0;s:7:"p_close";i:1;a:0:{}i:2;i:1035;}i:39;a:3:{i:0;s:13:"section_close";i:1;a:0:{}i:2;i:1037;}i:40;a:3:{i:0;s:12:"section_edit";i:1;a:4:{i:0;i:850;i:1;i:1036;i:2;i:2;i:3;s:24:"Justificativa do Vicente";}i:2;i:1037;}i:41;a:3:{i:0;s:6:"header";i:1;a:3:{i:0;s:20:"Relatórios Semanais";i:1;i:2;i:2;i:1037;}i:2;i:1037;}i:42;a:3:{i:0;s:12:"section_open";i:1;a:1:{i:0;i:2;}i:2;i:1037;}i:43;a:3:{i:0;s:6:"p_open";i:1;a:0:{}i:2;i:1069;}i:44;a:3:{i:0;s:5:"cdata";i:1;a:1:{i:0;s:217:"
Foi lembrado que deve ser feito o relatório semanal, do contrário será registrado no histórico. Ficou sugerido que fosse colocado ao lado das atividades desenvolvidas o total de tempo trabalhado em tal atividade.";}i:2;i:1070;}i:45;a:3:{i:0;s:7:"p_close";i:1;a:0:{}i:2;i:1287;}i:46;a:3:{i:0;s:13:"section_close";i:1;a:0:{}i:2;i:1289;}i:47;a:3:{i:0;s:12:"section_edit";i:1;a:4:{i:0;i:1037;i:1;i:1288;i:2;i:2;i:3;s:20:"Relatórios Semanais";}i:2;i:1289;}i:48;a:3:{i:0;s:6:"header";i:1;a:3:{i:0;s:26:"Responsável pelo hardware";i:1;i:2;i:2;i:1289;}i:2;i:1289;}i:49;a:3:{i:0;s:12:"section_open";i:1;a:1:{i:0;i:2;}i:2;i:1289;}i:50;a:3:{i:0;s:6:"p_open";i:1;a:0:{}i:2;i:1327;}i:51;a:3:{i:0;s:5:"cdata";i:1;a:1:{i:0;s:29:"
Estevão ficou responsável.";}i:2;i:1328;}i:52;a:3:{i:0;s:7:"p_close";i:1;a:0:{}i:2;i:1357;}i:53;a:3:{i:0;s:13:"section_close";i:1;a:0:{}i:2;i:1359;}i:54;a:3:{i:0;s:12:"section_edit";i:1;a:4:{i:0;i:1289;i:1;i:1358;i:2;i:2;i:3;s:26:"Responsável pelo hardware";}i:2;i:1359;}i:55;a:3:{i:0;s:6:"header";i:1;a:3:{i:0;s:8:"Portaria";i:1;i:2;i:2;i:1359;}i:2;i:1359;}i:56;a:3:{i:0;s:12:"section_open";i:1;a:1:{i:0;i:2;}i:2;i:1359;}i:57;a:3:{i:0;s:6:"p_open";i:1;a:0:{}i:2;i:1379;}i:58;a:3:{i:0;s:5:"cdata";i:1;a:1:{i:0;s:288:"
Foi debatido um item que diz respeito à pesquisas. Nondillo avisou que seria interessante alguns petianos desenvolverem pesquisas de seus interesses. Foi sugerido também buscar auxílio dos professores em caso de dificuldade. Aqueles que se interessarem devem apresentá-la em outubro.";}i:2;i:1380;}i:59;a:3:{i:0;s:7:"p_close";i:1;a:0:{}i:2;i:1668;}i:60;a:3:{i:0;s:13:"section_close";i:1;a:0:{}i:2;i:1670;}i:61;a:3:{i:0;s:12:"section_edit";i:1;a:4:{i:0;i:1359;i:1;i:1669;i:2;i:2;i:3;s:8:"Portaria";}i:2;i:1670;}i:62;a:3:{i:0;s:6:"header";i:1;a:3:{i:0;s:22:"Ex-Petiano de Maringá";i:1;i:2;i:2;i:1670;}i:2;i:1670;}i:63;a:3:{i:0;s:12:"section_open";i:1;a:1:{i:0;i:2;}i:2;i:1670;}i:64;a:3:{i:0;s:6:"p_open";i:1;a:0:{}i:2;i:1704;}i:65;a:3:{i:0;s:5:"cdata";i:1;a:1:{i:0;s:147:"
Um ex-petiano da computação está na UFRGS fazendo mestrado. Fabiano conversou com ele a respeito de ofertas de bolsas e incentivo à pesquisas.";}i:2;i:1705;}i:66;a:3:{i:0;s:7:"p_close";i:1;a:0:{}i:2;i:1852;}i:67;a:3:{i:0;s:13:"section_close";i:1;a:0:{}i:2;i:1854;}i:68;a:3:{i:0;s:12:"section_edit";i:1;a:4:{i:0;i:1670;i:1;i:1853;i:2;i:2;i:3;s:22:"Ex-Petiano de Maringá";}i:2;i:1854;}i:69;a:3:{i:0;s:6:"header";i:1;a:3:{i:0;s:5:"Linux";i:1;i:2;i:2;i:1854;}i:2;i:1854;}i:70;a:3:{i:0;s:12:"section_open";i:1;a:1:{i:0;i:2;}i:2;i:1854;}i:71;a:3:{i:0;s:6:"p_open";i:1;a:0:{}i:2;i:1871;}i:72;a:3:{i:0;s:5:"cdata";i:1;a:1:{i:0;s:105:"
Thiago sugeriu que os petianos migrassem para o Linux. Foi discutido os pós e os contras dessa opção.";}i:2;i:1872;}i:73;a:3:{i:0;s:7:"p_close";i:1;a:0:{}i:2;i:1977;}i:74;a:3:{i:0;s:13:"section_close";i:1;a:0:{}i:2;i:1979;}i:75;a:3:{i:0;s:12:"section_edit";i:1;a:4:{i:0;i:1854;i:1;i:1978;i:2;i:2;i:3;s:5:"Linux";}i:2;i:1979;}i:76;a:3:{i:0;s:6:"header";i:1;a:3:{i:0;s:18:"Planejamento Anual";i:1;i:2;i:2;i:1979;}i:2;i:1979;}i:77;a:3:{i:0;s:12:"section_open";i:1;a:1:{i:0;i:2;}i:2;i:1979;}i:78;a:3:{i:0;s:10:"listu_open";i:1;a:0:{}i:2;i:2010;}i:79;a:3:{i:0;s:13:"listitem_open";i:1;a:1:{i:0;i:1;}i:2;i:2010;}i:80;a:3:{i:0;s:16:"listcontent_open";i:1;a:0:{}i:2;i:2010;}i:81;a:3:{i:0;s:5:"cdata";i:1;a:1:{i:0;s:18:" Dar andamento no ";}i:2;i:2014;}i:82;a:3:{i:0;s:12:"internallink";i:1;a:2:{i:0;s:18:"/trac/wiki/RoboPet";i:1;s:8:"RoboPet?";}i:2;i:2032;}i:83;a:3:{i:0;s:17:"listcontent_close";i:1;a:0:{}i:2;i:2063;}i:84;a:3:{i:0;s:14:"listitem_close";i:1;a:0:{}i:2;i:2063;}i:85;a:3:{i:0;s:13:"listitem_open";i:1;a:1:{i:0;i:1;}i:2;i:2063;}i:86;a:3:{i:0;s:16:"listcontent_open";i:1;a:0:{}i:2;i:2063;}i:87;a:3:{i:0;s:5:"cdata";i:1;a:1:{i:0;s:32:" Sugeriu-se ministrar cursos de ";}i:2;i:2067;}i:88;a:3:{i:0;s:7:"acronym";i:1;a:1:{i:0;s:4:"HTML";}i:2;i:2099;}i:89;a:3:{i:0;s:5:"cdata";i:1;a:1:{i:0;s:3:" e ";}i:2;i:2103;}i:90;a:3:{i:0;s:7:"acronym";i:1;a:1:{i:0;s:3:"PHP";}i:2;i:2106;}i:91;a:3:{i:0;s:17:"listcontent_close";i:1;a:0:{}i:2;i:2109;}i:92;a:3:{i:0;s:14:"listitem_close";i:1;a:0:{}i:2;i:2109;}i:93;a:3:{i:0;s:13:"listitem_open";i:1;a:1:{i:0;i:1;}i:2;i:2109;}i:94;a:3:{i:0;s:16:"listcontent_open";i:1;a:0:{}i:2;i:2109;}i:95;a:3:{i:0;s:5:"cdata";i:1;a:1:{i:0;s:33:" Apresentar o Museu na Globaltech";}i:2;i:2113;}i:96;a:3:{i:0;s:17:"listcontent_close";i:1;a:0:{}i:2;i:2146;}i:97;a:3:{i:0;s:14:"listitem_close";i:1;a:0:{}i:2;i:2146;}i:98;a:3:{i:0;s:11:"listu_close";i:1;a:0:{}i:2;i:2146;}i:99;a:3:{i:0;s:13:"section_close";i:1;a:0:{}i:2;i:2148;}i:100;a:3:{i:0;s:12:"section_edit";i:1;a:4:{i:0;i:1979;i:1;i:2147;i:2;i:2;i:3;s:18:"Planejamento Anual";}i:2;i:2148;}i:101;a:3:{i:0;s:6:"header";i:1;a:3:{i:0;s:23:"Planejamento Trimestral";i:1;i:2;i:2;i:2148;}i:2;i:2148;}i:102;a:3:{i:0;s:12:"section_open";i:1;a:1:{i:0;i:2;}i:2;i:2148;}i:103;a:3:{i:0;s:6:"p_open";i:1;a:0:{}i:2;i:2183;}i:104;a:3:{i:0;s:5:"cdata";i:1;a:1:{i:0;s:64:"
Entregar (no trac) até terça-feira a noite da semana que vem.";}i:2;i:2184;}i:105;a:3:{i:0;s:7:"p_close";i:1;a:0:{}i:2;i:2248;}i:106;a:3:{i:0;s:13:"section_close";i:1;a:0:{}i:2;i:2250;}i:107;a:3:{i:0;s:12:"section_edit";i:1;a:4:{i:0;i:2148;i:1;i:2249;i:2;i:2;i:3;s:23:"Planejamento Trimestral";}i:2;i:2250;}i:108;a:3:{i:0;s:6:"header";i:1;a:3:{i:0;s:61:"[[/trac/wiki/SulPet|SulPet?]] e [[/trac/wiki/EnaPet|EnaPet?]]";i:1;i:2;i:2;i:2250;}i:2;i:2250;}i:109;a:3:{i:0;s:12:"section_open";i:1;a:1:{i:0;i:2;}i:2;i:2250;}i:110;a:3:{i:0;s:6:"p_open";i:1;a:0:{}i:2;i:2323;}i:111;a:3:{i:0;s:5:"cdata";i:1;a:1:{i:0;s:197:"
Há pouco interesse por parte dos Pets da UFRGS. Ver como os petianos estão se organizando para ir. Ver um ônibus. Seria interessante se 7 petianos do Pet-Computação comparecessem aos eventos.";}i:2;i:2324;}i:112;a:3:{i:0;s:7:"p_close";i:1;a:0:{}i:2;i:2521;}i:113;a:3:{i:0;s:13:"section_close";i:1;a:0:{}i:2;i:2522;}i:114;a:3:{i:0;s:12:"section_edit";i:1;a:4:{i:0;i:2250;i:1;i:0;i:2;i:2;i:3;s:61:"[[/trac/wiki/SulPet|SulPet?]] e [[/trac/wiki/EnaPet|EnaPet?]]";}i:2;i:2522;}i:115;a:3:{i:0;s:12:"document_end";i:1;a:0:{}i:2;i:2522;}}