a:222:{i:0;a:3:{i:0;s:14:"document_start";i:1;a:0:{}i:2;i:0;}i:1;a:3:{i:0;s:6:"p_open";i:1;a:0:{}i:2;i:0;}i:2;a:3:{i:0;s:7:"p_close";i:1;a:0:{}i:2;i:1;}i:3;a:3:{i:0;s:12:"section_edit";i:1;a:4:{i:0;i:-1;i:1;i:0;i:2;i:1;i:3;s:0:"";}i:2;i:1;}i:4;a:3:{i:0;s:6:"header";i:1;a:3:{i:0;s:23:"Ata Reunião 29/03/2005";i:1;i:1;i:2;i:1;}i:2;i:1;}i:5;a:3:{i:0;s:12:"section_open";i:1;a:1:{i:0;i:1;}i:2;i:1;}i:6;a:3:{i:0;s:6:"p_open";i:1;a:0:{}i:2;i:38;}i:7;a:3:{i:0;s:5:"cdata";i:1;a:1:{i:0;s:1:"
";}i:2;i:39;}i:8;a:3:{i:0;s:11:"strong_open";i:1;a:0:{}i:2;i:40;}i:9;a:3:{i:0;s:5:"cdata";i:1;a:1:{i:0;s:10:"Presentes:";}i:2;i:42;}i:10;a:3:{i:0;s:12:"strong_close";i:1;a:0:{}i:2;i:52;}i:11;a:3:{i:0;s:5:"cdata";i:1;a:1:{i:0;s:73:" Dante, Wagner, Nondillo, Diego, Paulo, Lilian, Robert, Irigon e Gustavo.";}i:2;i:54;}i:12;a:3:{i:0;s:7:"p_close";i:1;a:0:{}i:2;i:127;}i:13;a:3:{i:0;s:6:"p_open";i:1;a:0:{}i:2;i:127;}i:14;a:3:{i:0;s:11:"strong_open";i:1;a:0:{}i:2;i:129;}i:15;a:3:{i:0;s:5:"cdata";i:1;a:1:{i:0;s:7:"Relator";}i:2;i:131;}i:16;a:3:{i:0;s:12:"strong_close";i:1;a:0:{}i:2;i:138;}i:17;a:3:{i:0;s:5:"cdata";i:1;a:1:{i:0;s:9:" - Robert";}i:2;i:140;}i:18;a:3:{i:0;s:7:"p_close";i:1;a:0:{}i:2;i:149;}i:19;a:3:{i:0;s:6:"p_open";i:1;a:0:{}i:2;i:149;}i:20;a:3:{i:0;s:5:"cdata";i:1;a:1:{i:0;s:3:"1. ";}i:2;i:151;}i:21;a:3:{i:0;s:11:"strong_open";i:1;a:0:{}i:2;i:154;}i:22;a:3:{i:0;s:5:"cdata";i:1;a:1:{i:0;s:9:"Seleção";}i:2;i:156;}i:23;a:3:{i:0;s:12:"strong_close";i:1;a:0:{}i:2;i:165;}i:24;a:3:{i:0;s:5:"cdata";i:1;a:1:{i:0;s:1:"
";}i:2;i:167;}i:25;a:3:{i:0;s:7:"p_close";i:1;a:0:{}i:2;i:168;}i:26;a:3:{i:0;s:10:"listu_open";i:1;a:0:{}i:2;i:168;}i:27;a:3:{i:0;s:13:"listitem_open";i:1;a:1:{i:0;i:1;}i:2;i:168;}i:28;a:3:{i:0;s:16:"listcontent_open";i:1;a:0:{}i:2;i:168;}i:29;a:3:{i:0;s:5:"cdata";i:1;a:1:{i:0;s:153:" DINÂMICA NA PSICO: Jana ficou de dar a resposta (sobre a possibilidade da dinâmica) amanhã (30/03/05). Se não for possível, não teremos dinâmica.";}i:2;i:172;}i:30;a:3:{i:0;s:17:"listcontent_close";i:1;a:0:{}i:2;i:325;}i:31;a:3:{i:0;s:14:"listitem_close";i:1;a:0:{}i:2;i:325;}i:32;a:3:{i:0;s:13:"listitem_open";i:1;a:1:{i:0;i:1;}i:2;i:325;}i:33;a:3:{i:0;s:16:"listcontent_open";i:1;a:0:{}i:2;i:325;}i:34;a:3:{i:0;s:5:"cdata";i:1;a:1:{i:0;s:121:" ENTREVISTA: a princípio fica marcada para o dia 8 de março às 16h. Diego fica responsável por avisar Johann e Weber.";}i:2;i:329;}i:35;a:3:{i:0;s:17:"listcontent_close";i:1;a:0:{}i:2;i:450;}i:36;a:3:{i:0;s:14:"listitem_close";i:1;a:0:{}i:2;i:450;}i:37;a:3:{i:0;s:11:"listu_close";i:1;a:0:{}i:2;i:450;}i:38;a:3:{i:0;s:6:"p_open";i:1;a:0:{}i:2;i:450;}i:39;a:3:{i:0;s:5:"cdata";i:1;a:1:{i:0;s:4:"
2. ";}i:2;i:451;}i:40;a:3:{i:0;s:11:"strong_open";i:1;a:0:{}i:2;i:455;}i:41;a:3:{i:0;s:5:"cdata";i:1;a:1:{i:0;s:23:"Planejamento trimestral";}i:2;i:457;}i:42;a:3:{i:0;s:12:"strong_close";i:1;a:0:{}i:2;i:480;}i:43;a:3:{i:0;s:5:"cdata";i:1;a:1:{i:0;s:1:"
";}i:2;i:482;}i:44;a:3:{i:0;s:7:"p_close";i:1;a:0:{}i:2;i:483;}i:45;a:3:{i:0;s:10:"listu_open";i:1;a:0:{}i:2;i:483;}i:46;a:3:{i:0;s:13:"listitem_open";i:1;a:1:{i:0;i:1;}i:2;i:483;}i:47;a:3:{i:0;s:16:"listcontent_open";i:1;a:0:{}i:2;i:483;}i:48;a:3:{i:0;s:5:"cdata";i:1;a:1:{i:0;s:90:" Para a próxima reunião, todos devem entregar o planejamento (no trac) para discutirmos.";}i:2;i:487;}i:49;a:3:{i:0;s:17:"listcontent_close";i:1;a:0:{}i:2;i:577;}i:50;a:3:{i:0;s:14:"listitem_close";i:1;a:0:{}i:2;i:577;}i:51;a:3:{i:0;s:11:"listu_close";i:1;a:0:{}i:2;i:577;}i:52;a:3:{i:0;s:6:"p_open";i:1;a:0:{}i:2;i:577;}i:53;a:3:{i:0;s:5:"cdata";i:1;a:1:{i:0;s:4:"
3. ";}i:2;i:578;}i:54;a:3:{i:0;s:11:"strong_open";i:1;a:0:{}i:2;i:582;}i:55;a:3:{i:0;s:5:"cdata";i:1;a:1:{i:0;s:22:"Jornada Portas Abertas";}i:2;i:584;}i:56;a:3:{i:0;s:12:"strong_close";i:1;a:0:{}i:2;i:606;}i:57;a:3:{i:0;s:5:"cdata";i:1;a:1:{i:0;s:1:"
";}i:2;i:608;}i:58;a:3:{i:0;s:7:"p_close";i:1;a:0:{}i:2;i:609;}i:59;a:3:{i:0;s:10:"listu_open";i:1;a:0:{}i:2;i:609;}i:60;a:3:{i:0;s:13:"listitem_open";i:1;a:1:{i:0;i:1;}i:2;i:609;}i:61;a:3:{i:0;s:16:"listcontent_open";i:1;a:0:{}i:2;i:609;}i:62;a:3:{i:0;s:5:"cdata";i:1;a:1:{i:0;s:146:" Dante sugere a participação do grupo nas atividades (principalmente aqueles que estão com dificuldades no planejamento). Uma idéia seria uma ";}i:2;i:613;}i:63;a:3:{i:0;s:13:"emphasis_open";i:1;a:0:{}i:2;i:759;}i:64;a:3:{i:0;s:5:"cdata";i:1;a:1:{i:0;s:9:"banquinha";}i:2;i:761;}i:65;a:3:{i:0;s:14:"emphasis_close";i:1;a:0:{}i:2;i:770;}i:66;a:3:{i:0;s:5:"cdata";i:1;a:1:{i:0;s:67:" para esclarecer dúvidas sobre os cursos de Ciência e Engenharia.";}i:2;i:772;}i:67;a:3:{i:0;s:17:"listcontent_close";i:1;a:0:{}i:2;i:839;}i:68;a:3:{i:0;s:14:"listitem_close";i:1;a:0:{}i:2;i:839;}i:69;a:3:{i:0;s:13:"listitem_open";i:1;a:1:{i:0;i:1;}i:2;i:839;}i:70;a:3:{i:0;s:16:"listcontent_open";i:1;a:0:{}i:2;i:839;}i:71;a:3:{i:0;s:5:"cdata";i:1;a:1:{i:0;s:50:" Comissão responsável: Paulo, Nondillo e Irigon.";}i:2;i:843;}i:72;a:3:{i:0;s:17:"listcontent_close";i:1;a:0:{}i:2;i:893;}i:73;a:3:{i:0;s:14:"listitem_close";i:1;a:0:{}i:2;i:893;}i:74;a:3:{i:0;s:13:"listitem_open";i:1;a:1:{i:0;i:1;}i:2;i:893;}i:75;a:3:{i:0;s:16:"listcontent_open";i:1;a:0:{}i:2;i:893;}i:76;a:3:{i:0;s:5:"cdata";i:1;a:1:{i:0;s:122:" Apresentações: Robótica Inteligente, provável Futebol de Robôs, Software de Alto Rendimento, Interfaces Perceptivas.";}i:2;i:897;}i:77;a:3:{i:0;s:17:"listcontent_close";i:1;a:0:{}i:2;i:1019;}i:78;a:3:{i:0;s:14:"listitem_close";i:1;a:0:{}i:2;i:1019;}i:79;a:3:{i:0;s:11:"listu_close";i:1;a:0:{}i:2;i:1019;}i:80;a:3:{i:0;s:6:"p_open";i:1;a:0:{}i:2;i:1019;}i:81;a:3:{i:0;s:5:"cdata";i:1;a:1:{i:0;s:4:"
4. ";}i:2;i:1020;}i:82;a:3:{i:0;s:11:"strong_open";i:1;a:0:{}i:2;i:1024;}i:83;a:3:{i:0;s:5:"cdata";i:1;a:1:{i:0;s:20:"Horário da reunião";}i:2;i:1026;}i:84;a:3:{i:0;s:12:"strong_close";i:1;a:0:{}i:2;i:1046;}i:85;a:3:{i:0;s:5:"cdata";i:1;a:1:{i:0;s:1:"
";}i:2;i:1048;}i:86;a:3:{i:0;s:7:"p_close";i:1;a:0:{}i:2;i:1049;}i:87;a:3:{i:0;s:10:"listu_open";i:1;a:0:{}i:2;i:1049;}i:88;a:3:{i:0;s:13:"listitem_open";i:1;a:1:{i:0;i:1;}i:2;i:1049;}i:89;a:3:{i:0;s:16:"listcontent_open";i:1;a:0:{}i:2;i:1049;}i:90;a:3:{i:0;s:5:"cdata";i:1;a:1:{i:0;s:50:" Próxima reunião: 5 (terça) de abril às 17:30.";}i:2;i:1053;}i:91;a:3:{i:0;s:17:"listcontent_close";i:1;a:0:{}i:2;i:1103;}i:92;a:3:{i:0;s:14:"listitem_close";i:1;a:0:{}i:2;i:1103;}i:93;a:3:{i:0;s:11:"listu_close";i:1;a:0:{}i:2;i:1103;}i:94;a:3:{i:0;s:6:"p_open";i:1;a:0:{}i:2;i:1103;}i:95;a:3:{i:0;s:5:"cdata";i:1;a:1:{i:0;s:4:"
5. ";}i:2;i:1104;}i:96;a:3:{i:0;s:11:"strong_open";i:1;a:0:{}i:2;i:1108;}i:97;a:3:{i:0;s:5:"cdata";i:1;a:1:{i:0;s:5:"Janta";}i:2;i:1110;}i:98;a:3:{i:0;s:12:"strong_close";i:1;a:0:{}i:2;i:1115;}i:99;a:3:{i:0;s:5:"cdata";i:1;a:1:{i:0;s:1:"
";}i:2;i:1117;}i:100;a:3:{i:0;s:7:"p_close";i:1;a:0:{}i:2;i:1118;}i:101;a:3:{i:0;s:10:"listu_open";i:1;a:0:{}i:2;i:1118;}i:102;a:3:{i:0;s:13:"listitem_open";i:1;a:1:{i:0;i:1;}i:2;i:1118;}i:103;a:3:{i:0;s:16:"listcontent_open";i:1;a:0:{}i:2;i:1118;}i:104;a:3:{i:0;s:5:"cdata";i:1;a:1:{i:0;s:44:" Conversar com a Lilian sobre uma possível ";}i:2;i:1122;}i:105;a:3:{i:0;s:13:"emphasis_open";i:1;a:0:{}i:2;i:1166;}i:106;a:3:{i:0;s:5:"cdata";i:1;a:1:{i:0;s:8:"pizzaria";}i:2;i:1168;}i:107;a:3:{i:0;s:14:"emphasis_close";i:1;a:0:{}i:2;i:1176;}i:108;a:3:{i:0;s:5:"cdata";i:1;a:1:{i:0;s:18:" após a reunião.";}i:2;i:1178;}i:109;a:3:{i:0;s:17:"listcontent_close";i:1;a:0:{}i:2;i:1196;}i:110;a:3:{i:0;s:14:"listitem_close";i:1;a:0:{}i:2;i:1196;}i:111;a:3:{i:0;s:11:"listu_close";i:1;a:0:{}i:2;i:1196;}i:112;a:3:{i:0;s:6:"p_open";i:1;a:0:{}i:2;i:1196;}i:113;a:3:{i:0;s:5:"cdata";i:1;a:1:{i:0;s:4:"
6. ";}i:2;i:1197;}i:114;a:3:{i:0;s:11:"strong_open";i:1;a:0:{}i:2;i:1201;}i:115;a:3:{i:0;s:5:"cdata";i:1;a:1:{i:0;s:21:"Controle de horários";}i:2;i:1203;}i:116;a:3:{i:0;s:12:"strong_close";i:1;a:0:{}i:2;i:1224;}i:117;a:3:{i:0;s:5:"cdata";i:1;a:1:{i:0;s:1:"
";}i:2;i:1226;}i:118;a:3:{i:0;s:7:"p_close";i:1;a:0:{}i:2;i:1227;}i:119;a:3:{i:0;s:10:"listu_open";i:1;a:0:{}i:2;i:1227;}i:120;a:3:{i:0;s:13:"listitem_open";i:1;a:1:{i:0;i:1;}i:2;i:1227;}i:121;a:3:{i:0;s:16:"listcontent_open";i:1;a:0:{}i:2;i:1227;}i:122;a:3:{i:0;s:5:"cdata";i:1;a:1:{i:0;s:72:" Sempre que alguém esquecer de deslogar, avisar imediatamente ao Paulo.";}i:2;i:1231;}i:123;a:3:{i:0;s:17:"listcontent_close";i:1;a:0:{}i:2;i:1303;}i:124;a:3:{i:0;s:14:"listitem_close";i:1;a:0:{}i:2;i:1303;}i:125;a:3:{i:0;s:11:"listu_close";i:1;a:0:{}i:2;i:1303;}i:126;a:3:{i:0;s:6:"p_open";i:1;a:0:{}i:2;i:1303;}i:127;a:3:{i:0;s:5:"cdata";i:1;a:1:{i:0;s:4:"
7. ";}i:2;i:1304;}i:128;a:3:{i:0;s:11:"strong_open";i:1;a:0:{}i:2;i:1308;}i:129;a:3:{i:0;s:5:"cdata";i:1;a:1:{i:0;s:18:"Relatório semanal";}i:2;i:1310;}i:130;a:3:{i:0;s:12:"strong_close";i:1;a:0:{}i:2;i:1328;}i:131;a:3:{i:0;s:5:"cdata";i:1;a:1:{i:0;s:1:"
";}i:2;i:1330;}i:132;a:3:{i:0;s:7:"p_close";i:1;a:0:{}i:2;i:1331;}i:133;a:3:{i:0;s:10:"listu_open";i:1;a:0:{}i:2;i:1331;}i:134;a:3:{i:0;s:13:"listitem_open";i:1;a:1:{i:0;i:1;}i:2;i:1331;}i:135;a:3:{i:0;s:16:"listcontent_open";i:1;a:0:{}i:2;i:1331;}i:136;a:3:{i:0;s:5:"cdata";i:1;a:1:{i:0;s:57:" Todos devem utilizar/fazer o relatório semanal do trac.";}i:2;i:1335;}i:137;a:3:{i:0;s:17:"listcontent_close";i:1;a:0:{}i:2;i:1392;}i:138;a:3:{i:0;s:14:"listitem_close";i:1;a:0:{}i:2;i:1392;}i:139;a:3:{i:0;s:11:"listu_close";i:1;a:0:{}i:2;i:1392;}i:140;a:3:{i:0;s:6:"p_open";i:1;a:0:{}i:2;i:1392;}i:141;a:3:{i:0;s:5:"cdata";i:1;a:1:{i:0;s:4:"
8. ";}i:2;i:1393;}i:142;a:3:{i:0;s:11:"strong_open";i:1;a:0:{}i:2;i:1397;}i:143;a:3:{i:0;s:5:"cdata";i:1;a:1:{i:0;s:35:"Discussão para a próxima reunião";}i:2;i:1399;}i:144;a:3:{i:0;s:12:"strong_close";i:1;a:0:{}i:2;i:1434;}i:145;a:3:{i:0;s:5:"cdata";i:1;a:1:{i:0;s:1:"
";}i:2;i:1436;}i:146;a:3:{i:0;s:7:"p_close";i:1;a:0:{}i:2;i:1437;}i:147;a:3:{i:0;s:10:"listu_open";i:1;a:0:{}i:2;i:1437;}i:148;a:3:{i:0;s:13:"listitem_open";i:1;a:1:{i:0;i:1;}i:2;i:1437;}i:149;a:3:{i:0;s:16:"listcontent_open";i:1;a:0:{}i:2;i:1437;}i:150;a:3:{i:0;s:5:"cdata";i:1;a:1:{i:0;s:125:" A falta de ideologia dos partidos políticos (atitudes inconsistentes com as ideologias). Exemplo: apoio do Lula ao Rigotto.";}i:2;i:1441;}i:151;a:3:{i:0;s:17:"listcontent_close";i:1;a:0:{}i:2;i:1566;}i:152;a:3:{i:0;s:14:"listitem_close";i:1;a:0:{}i:2;i:1566;}i:153;a:3:{i:0;s:11:"listu_close";i:1;a:0:{}i:2;i:1566;}i:154;a:3:{i:0;s:6:"p_open";i:1;a:0:{}i:2;i:1566;}i:155;a:3:{i:0;s:5:"cdata";i:1;a:1:{i:0;s:4:"
9. ";}i:2;i:1567;}i:156;a:3:{i:0;s:11:"strong_open";i:1;a:0:{}i:2;i:1571;}i:157;a:3:{i:0;s:5:"cdata";i:1;a:1:{i:0;s:13:"Questionário";}i:2;i:1573;}i:158;a:3:{i:0;s:12:"strong_close";i:1;a:0:{}i:2;i:1586;}i:159;a:3:{i:0;s:5:"cdata";i:1;a:1:{i:0;s:1:"
";}i:2;i:1588;}i:160;a:3:{i:0;s:7:"p_close";i:1;a:0:{}i:2;i:1589;}i:161;a:3:{i:0;s:10:"listu_open";i:1;a:0:{}i:2;i:1589;}i:162;a:3:{i:0;s:13:"listitem_open";i:1;a:1:{i:0;i:1;}i:2;i:1589;}i:163;a:3:{i:0;s:16:"listcontent_open";i:1;a:0:{}i:2;i:1589;}i:164;a:3:{i:0;s:5:"cdata";i:1;a:1:{i:0;s:76:" Coletar os dados dos questionários que estão no Dacomp (Robert ou João).";}i:2;i:1593;}i:165;a:3:{i:0;s:17:"listcontent_close";i:1;a:0:{}i:2;i:1669;}i:166;a:3:{i:0;s:14:"listitem_close";i:1;a:0:{}i:2;i:1669;}i:167;a:3:{i:0;s:11:"listu_close";i:1;a:0:{}i:2;i:1669;}i:168;a:3:{i:0;s:6:"p_open";i:1;a:0:{}i:2;i:1669;}i:169;a:3:{i:0;s:5:"cdata";i:1;a:1:{i:0;s:5:"
10. ";}i:2;i:1670;}i:170;a:3:{i:0;s:11:"strong_open";i:1;a:0:{}i:2;i:1675;}i:171;a:3:{i:0;s:5:"cdata";i:1;a:1:{i:0;s:9:"Camisetas";}i:2;i:1677;}i:172;a:3:{i:0;s:12:"strong_close";i:1;a:0:{}i:2;i:1686;}i:173;a:3:{i:0;s:5:"cdata";i:1;a:1:{i:0;s:1:"
";}i:2;i:1688;}i:174;a:3:{i:0;s:7:"p_close";i:1;a:0:{}i:2;i:1689;}i:175;a:3:{i:0;s:10:"listu_open";i:1;a:0:{}i:2;i:1689;}i:176;a:3:{i:0;s:13:"listitem_open";i:1;a:1:{i:0;i:1;}i:2;i:1689;}i:177;a:3:{i:0;s:16:"listcontent_open";i:1;a:0:{}i:2;i:1689;}i:178;a:3:{i:0;s:5:"cdata";i:1;a:1:{i:0;s:21:" Acelerar o processo.";}i:2;i:1693;}i:179;a:3:{i:0;s:17:"listcontent_close";i:1;a:0:{}i:2;i:1714;}i:180;a:3:{i:0;s:14:"listitem_close";i:1;a:0:{}i:2;i:1714;}i:181;a:3:{i:0;s:11:"listu_close";i:1;a:0:{}i:2;i:1714;}i:182;a:3:{i:0;s:6:"p_open";i:1;a:0:{}i:2;i:1714;}i:183;a:3:{i:0;s:5:"cdata";i:1;a:1:{i:0;s:5:"
11. ";}i:2;i:1715;}i:184;a:3:{i:0;s:11:"strong_open";i:1;a:0:{}i:2;i:1720;}i:185;a:3:{i:0;s:5:"cdata";i:1;a:1:{i:0;s:6:"SulPET";}i:2;i:1722;}i:186;a:3:{i:0;s:12:"strong_close";i:1;a:0:{}i:2;i:1728;}i:187;a:3:{i:0;s:5:"cdata";i:1;a:1:{i:0;s:1:"
";}i:2;i:1730;}i:188;a:3:{i:0;s:7:"p_close";i:1;a:0:{}i:2;i:1731;}i:189;a:3:{i:0;s:10:"listu_open";i:1;a:0:{}i:2;i:1731;}i:190;a:3:{i:0;s:13:"listitem_open";i:1;a:1:{i:0;i:1;}i:2;i:1731;}i:191;a:3:{i:0;s:16:"listcontent_open";i:1;a:0:{}i:2;i:1731;}i:192;a:3:{i:0;s:5:"cdata";i:1;a:1:{i:0;s:116:" Wagner fica encarregado de procurar os tópicos de assuntos do SulPET para trazer à tona nas discussões do grupo.";}i:2;i:1735;}i:193;a:3:{i:0;s:17:"listcontent_close";i:1;a:0:{}i:2;i:1851;}i:194;a:3:{i:0;s:14:"listitem_close";i:1;a:0:{}i:2;i:1851;}i:195;a:3:{i:0;s:13:"listitem_open";i:1;a:1:{i:0;i:1;}i:2;i:1851;}i:196;a:3:{i:0;s:16:"listcontent_open";i:1;a:0:{}i:2;i:1851;}i:197;a:3:{i:0;s:5:"cdata";i:1;a:1:{i:0;s:81:" A temática do SulPET fica para debate na reunião seguinte a do dia 5 de abril.";}i:2;i:1855;}i:198;a:3:{i:0;s:17:"listcontent_close";i:1;a:0:{}i:2;i:1936;}i:199;a:3:{i:0;s:14:"listitem_close";i:1;a:0:{}i:2;i:1936;}i:200;a:3:{i:0;s:11:"listu_close";i:1;a:0:{}i:2;i:1936;}i:201;a:3:{i:0;s:6:"p_open";i:1;a:0:{}i:2;i:1936;}i:202;a:3:{i:0;s:5:"cdata";i:1;a:1:{i:0;s:5:"
12. ";}i:2;i:1937;}i:203;a:3:{i:0;s:11:"strong_open";i:1;a:0:{}i:2;i:1942;}i:204;a:3:{i:0;s:5:"cdata";i:1;a:1:{i:0;s:21:"Tarefas burocráticas";}i:2;i:1944;}i:205;a:3:{i:0;s:12:"strong_close";i:1;a:0:{}i:2;i:1965;}i:206;a:3:{i:0;s:5:"cdata";i:1;a:1:{i:0;s:1:"
";}i:2;i:1967;}i:207;a:3:{i:0;s:7:"p_close";i:1;a:0:{}i:2;i:1968;}i:208;a:3:{i:0;s:10:"listu_open";i:1;a:0:{}i:2;i:1968;}i:209;a:3:{i:0;s:13:"listitem_open";i:1;a:1:{i:0;i:1;}i:2;i:1968;}i:210;a:3:{i:0;s:16:"listcontent_open";i:1;a:0:{}i:2;i:1968;}i:211;a:3:{i:0;s:5:"cdata";i:1;a:1:{i:0;s:64:" Dante repassará ofícios para Robert, Gustavo e Rubim fazerem.";}i:2;i:1972;}i:212;a:3:{i:0;s:17:"listcontent_close";i:1;a:0:{}i:2;i:2036;}i:213;a:3:{i:0;s:14:"listitem_close";i:1;a:0:{}i:2;i:2036;}i:214;a:3:{i:0;s:13:"listitem_open";i:1;a:1:{i:0;i:1;}i:2;i:2036;}i:215;a:3:{i:0;s:16:"listcontent_open";i:1;a:0:{}i:2;i:2036;}i:216;a:3:{i:0;s:5:"cdata";i:1;a:1:{i:0;s:48:" Robert terminará a classificação de imagens.";}i:2;i:2040;}i:217;a:3:{i:0;s:17:"listcontent_close";i:1;a:0:{}i:2;i:2088;}i:218;a:3:{i:0;s:14:"listitem_close";i:1;a:0:{}i:2;i:2088;}i:219;a:3:{i:0;s:11:"listu_close";i:1;a:0:{}i:2;i:2088;}i:220;a:3:{i:0;s:13:"section_close";i:1;a:0:{}i:2;i:2089;}i:221;a:3:{i:0;s:12:"document_end";i:1;a:0:{}i:2;i:2089;}}