a:42:{i:0;a:3:{i:0;s:14:"document_start";i:1;a:0:{}i:2;i:0;}i:1;a:3:{i:0;s:6:"p_open";i:1;a:0:{}i:2;i:0;}i:2;a:3:{i:0;s:5:"cdata";i:1;a:1:{i:0;s:25:"Ata da reunião de 22/01
";}i:2;i:1;}i:3;a:3:{i:0;s:7:"p_close";i:1;a:0:{}i:2;i:26;}i:4;a:3:{i:0;s:10:"listu_open";i:1;a:0:{}i:2;i:26;}i:5;a:3:{i:0;s:13:"listitem_open";i:1;a:1:{i:0;i:1;}i:2;i:26;}i:6;a:3:{i:0;s:16:"listcontent_open";i:1;a:0:{}i:2;i:26;}i:7;a:3:{i:0;s:5:"cdata";i:1;a:1:{i:0;s:57:" Presentes: Fábio, Lucas Fialho, Leonardo, Bruno Guedes,";}i:2;i:30;}i:8;a:3:{i:0;s:17:"listcontent_close";i:1;a:0:{}i:2;i:87;}i:9;a:3:{i:0;s:14:"listitem_close";i:1;a:0:{}i:2;i:87;}i:10;a:3:{i:0;s:13:"listitem_open";i:1;a:1:{i:0;i:1;}i:2;i:87;}i:11;a:3:{i:0;s:16:"listcontent_open";i:1;a:0:{}i:2;i:87;}i:12;a:3:{i:0;s:5:"cdata";i:1;a:1:{i:0;s:121:" Ausentes: Bruno A., Matheus, Matheus Proença, Kauê, Tyron, Antônio, Portal, Bruno Jurkovski, Cassiana, Dante, Marcos.";}i:2;i:91;}i:13;a:3:{i:0;s:17:"listcontent_close";i:1;a:0:{}i:2;i:212;}i:14;a:3:{i:0;s:14:"listitem_close";i:1;a:0:{}i:2;i:212;}i:15;a:3:{i:0;s:13:"listitem_open";i:1;a:1:{i:0;i:1;}i:2;i:212;}i:16;a:3:{i:0;s:16:"listcontent_open";i:1;a:0:{}i:2;i:212;}i:17;a:3:{i:0;s:5:"cdata";i:1;a:1:{i:0;s:18:" Relator: Leonardo";}i:2;i:216;}i:18;a:3:{i:0;s:17:"listcontent_close";i:1;a:0:{}i:2;i:234;}i:19;a:3:{i:0;s:14:"listitem_close";i:1;a:0:{}i:2;i:234;}i:20;a:3:{i:0;s:11:"listu_close";i:1;a:0:{}i:2;i:234;}i:21;a:3:{i:0;s:6:"p_open";i:1;a:0:{}i:2;i:234;}i:22;a:3:{i:0;s:5:"cdata";i:1;a:1:{i:0;s:42:"
1) Assinatura do Dante para TRI (Fialho)
";}i:2;i:235;}i:23;a:3:{i:0;s:7:"p_close";i:1;a:0:{}i:2;i:277;}i:24;a:3:{i:0;s:10:"listu_open";i:1;a:0:{}i:2;i:277;}i:25;a:3:{i:0;s:13:"listitem_open";i:1;a:1:{i:0;i:1;}i:2;i:277;}i:26;a:3:{i:0;s:16:"listcontent_open";i:1;a:0:{}i:2;i:277;}i:27;a:3:{i:0;s:5:"cdata";i:1;a:1:{i:0;s:68:" Dante leu o documento e concordou em assinar logo após a reunião;";}i:2;i:281;}i:28;a:3:{i:0;s:17:"listcontent_close";i:1;a:0:{}i:2;i:349;}i:29;a:3:{i:0;s:14:"listitem_close";i:1;a:0:{}i:2;i:349;}i:30;a:3:{i:0;s:11:"listu_close";i:1;a:0:{}i:2;i:349;}i:31;a:3:{i:0;s:6:"p_open";i:1;a:0:{}i:2;i:349;}i:32;a:3:{i:0;s:5:"cdata";i:1;a:1:{i:0;s:38:"
2) Horas Proenca e Felipe (Leonardo)
";}i:2;i:350;}i:33;a:3:{i:0;s:7:"p_close";i:1;a:0:{}i:2;i:388;}i:34;a:3:{i:0;s:10:"listu_open";i:1;a:0:{}i:2;i:388;}i:35;a:3:{i:0;s:13:"listitem_open";i:1;a:1:{i:0;i:1;}i:2;i:388;}i:36;a:3:{i:0;s:16:"listcontent_open";i:1;a:0:{}i:2;i:388;}i:37;a:3:{i:0;s:5:"cdata";i:1;a:1:{i:0;s:138:" O grupo se pergunta como os petianos Proença e Felipe conseguiram fazer horas nesta semana. O ponto será discutido na reunião que vem.";}i:2;i:392;}i:38;a:3:{i:0;s:17:"listcontent_close";i:1;a:0:{}i:2;i:530;}i:39;a:3:{i:0;s:14:"listitem_close";i:1;a:0:{}i:2;i:530;}i:40;a:3:{i:0;s:11:"listu_close";i:1;a:0:{}i:2;i:530;}i:41;a:3:{i:0;s:12:"document_end";i:1;a:0:{}i:2;i:530;}}