a:258:{i:0;a:3:{i:0;s:14:"document_start";i:1;a:0:{}i:2;i:0;}i:1;a:3:{i:0;s:6:"p_open";i:1;a:0:{}i:2;i:0;}i:2;a:3:{i:0;s:7:"p_close";i:1;a:0:{}i:2;i:1;}i:3;a:3:{i:0;s:12:"section_edit";i:1;a:4:{i:0;i:-1;i:1;i:0;i:2;i:1;i:3;s:0:"";}i:2;i:1;}i:4;a:3:{i:0;s:6:"header";i:1;a:3:{i:0;s:29:"Ata da reunião de 26/09/2006";i:1;i:1;i:2;i:1;}i:2;i:1;}i:5;a:3:{i:0;s:12:"section_open";i:1;a:1:{i:0;i:1;}i:2;i:1;}i:6;a:3:{i:0;s:6:"p_open";i:1;a:0:{}i:2;i:44;}i:7;a:3:{i:0;s:5:"cdata";i:1;a:1:{i:0;s:1:"
";}i:2;i:45;}i:8;a:3:{i:0;s:11:"strong_open";i:1;a:0:{}i:2;i:46;}i:9;a:3:{i:0;s:5:"cdata";i:1;a:1:{i:0;s:11:"Presentes: ";}i:2;i:48;}i:10;a:3:{i:0;s:12:"strong_close";i:1;a:0:{}i:2;i:59;}i:11;a:3:{i:0;s:5:"cdata";i:1;a:1:{i:0;s:106:"Fabiano, Dante, Ricardo, Marcelo, Lucas M, Lucas C., Gabriela, Marcos, Pablo, Alexandre, Estevão, Thiago.";}i:2;i:61;}i:12;a:3:{i:0;s:7:"p_close";i:1;a:0:{}i:2;i:167;}i:13;a:3:{i:0;s:6:"p_open";i:1;a:0:{}i:2;i:167;}i:14;a:3:{i:0;s:11:"strong_open";i:1;a:0:{}i:2;i:169;}i:15;a:3:{i:0;s:5:"cdata";i:1;a:1:{i:0;s:23:"Ausência Justificada: ";}i:2;i:171;}i:16;a:3:{i:0;s:12:"strong_close";i:1;a:0:{}i:2;i:194;}i:17;a:3:{i:0;s:5:"cdata";i:1;a:1:{i:0;s:19:"Felipe (Curso de C)";}i:2;i:196;}i:18;a:3:{i:0;s:7:"p_close";i:1;a:0:{}i:2;i:215;}i:19;a:3:{i:0;s:6:"p_open";i:1;a:0:{}i:2;i:215;}i:20;a:3:{i:0;s:11:"strong_open";i:1;a:0:{}i:2;i:217;}i:21;a:3:{i:0;s:5:"cdata";i:1;a:1:{i:0;s:9:"Relator: ";}i:2;i:219;}i:22;a:3:{i:0;s:12:"strong_close";i:1;a:0:{}i:2;i:228;}i:23;a:3:{i:0;s:5:"cdata";i:1;a:1:{i:0;s:8:"Fabiano.";}i:2;i:230;}i:24;a:3:{i:0;s:7:"p_close";i:1;a:0:{}i:2;i:238;}i:25;a:3:{i:0;s:13:"section_close";i:1;a:0:{}i:2;i:240;}i:26;a:3:{i:0;s:12:"section_edit";i:1;a:4:{i:0;i:1;i:1;i:239;i:2;i:1;i:3;s:29:"Ata da reunião de 26/09/2006";}i:2;i:240;}i:27;a:3:{i:0;s:6:"header";i:1;a:3:{i:0;s:53:"1) Comissão de Organização do Aniversário do PET:";i:1;i:3;i:2;i:240;}i:2;i:240;}i:28;a:3:{i:0;s:12:"section_open";i:1;a:1:{i:0;i:3;}i:2;i:240;}i:29;a:3:{i:0;s:6:"p_open";i:1;a:0:{}i:2;i:303;}i:30;a:3:{i:0;s:5:"cdata";i:1;a:1:{i:0;s:62:"
Marcos entrara em contato com alguns professores e egressos.
";}i:2;i:304;}i:31;a:3:{i:0;s:7:"p_close";i:1;a:0:{}i:2;i:366;}i:32;a:3:{i:0;s:10:"listu_open";i:1;a:0:{}i:2;i:366;}i:33;a:3:{i:0;s:13:"listitem_open";i:1;a:1:{i:0;i:1;}i:2;i:366;}i:34;a:3:{i:0;s:16:"listcontent_open";i:1;a:0:{}i:2;i:366;}i:35;a:3:{i:0;s:5:"cdata";i:1;a:1:{i:0;s:47:" Discussão sobre possibilidades de atividades:";}i:2;i:370;}i:36;a:3:{i:0;s:17:"listcontent_close";i:1;a:0:{}i:2;i:417;}i:37;a:3:{i:0;s:10:"listu_open";i:1;a:0:{}i:2;i:417;}i:38;a:3:{i:0;s:13:"listitem_open";i:1;a:1:{i:0;i:2;}i:2;i:417;}i:39;a:3:{i:0;s:16:"listcontent_open";i:1;a:0:{}i:2;i:417;}i:40;a:3:{i:0;s:5:"cdata";i:1;a:1:{i:0;s:51:" Mostra de posters do Salao de Iniciação (Marcos)";}i:2;i:423;}i:41;a:3:{i:0;s:17:"listcontent_close";i:1;a:0:{}i:2;i:474;}i:42;a:3:{i:0;s:14:"listitem_close";i:1;a:0:{}i:2;i:474;}i:43;a:3:{i:0;s:13:"listitem_open";i:1;a:1:{i:0;i:2;}i:2;i:474;}i:44;a:3:{i:0;s:16:"listcontent_open";i:1;a:0:{}i:2;i:474;}i:45;a:3:{i:0;s:5:"cdata";i:1;a:1:{i:0;s:46:" Mostra de Softwares , com premiação (Dante)";}i:2;i:480;}i:46;a:3:{i:0;s:17:"listcontent_close";i:1;a:0:{}i:2;i:526;}i:47;a:3:{i:0;s:14:"listitem_close";i:1;a:0:{}i:2;i:526;}i:48;a:3:{i:0;s:13:"listitem_open";i:1;a:1:{i:0;i:2;}i:2;i:526;}i:49;a:3:{i:0;s:16:"listcontent_open";i:1;a:0:{}i:2;i:526;}i:50;a:3:{i:0;s:5:"cdata";i:1;a:1:{i:0;s:67:" Apresentação dos trabalhos dos grupos de pesquisa do II (Marcos)";}i:2;i:532;}i:51;a:3:{i:0;s:17:"listcontent_close";i:1;a:0:{}i:2;i:599;}i:52;a:3:{i:0;s:14:"listitem_close";i:1;a:0:{}i:2;i:599;}i:53;a:3:{i:0;s:13:"listitem_open";i:1;a:1:{i:0;i:2;}i:2;i:599;}i:54;a:3:{i:0;s:16:"listcontent_open";i:1;a:0:{}i:2;i:599;}i:55;a:3:{i:0;s:5:"cdata";i:1;a:1:{i:0;s:28:" Amostra do Museu. (Marcelo)";}i:2;i:605;}i:56;a:3:{i:0;s:17:"listcontent_close";i:1;a:0:{}i:2;i:633;}i:57;a:3:{i:0;s:14:"listitem_close";i:1;a:0:{}i:2;i:633;}i:58;a:3:{i:0;s:11:"listu_close";i:1;a:0:{}i:2;i:633;}i:59;a:3:{i:0;s:14:"listitem_close";i:1;a:0:{}i:2;i:633;}i:60;a:3:{i:0;s:13:"listitem_open";i:1;a:1:{i:0;i:1;}i:2;i:633;}i:61;a:3:{i:0;s:16:"listcontent_open";i:1;a:0:{}i:2;i:633;}i:62;a:3:{i:0;s:5:"cdata";i:1;a:1:{i:0;s:11:" Comissão:";}i:2;i:637;}i:63;a:3:{i:0;s:17:"listcontent_close";i:1;a:0:{}i:2;i:648;}i:64;a:3:{i:0;s:10:"listu_open";i:1;a:0:{}i:2;i:648;}i:65;a:3:{i:0;s:13:"listitem_open";i:1;a:1:{i:0;i:2;}i:2;i:648;}i:66;a:3:{i:0;s:16:"listcontent_open";i:1;a:0:{}i:2;i:648;}i:67;a:3:{i:0;s:5:"cdata";i:1;a:1:{i:0;s:92:" Na próxima reunião será escolhido outros dois integrantes da comissão, além do Marcos.";}i:2;i:654;}i:68;a:3:{i:0;s:17:"listcontent_close";i:1;a:0:{}i:2;i:746;}i:69;a:3:{i:0;s:14:"listitem_close";i:1;a:0:{}i:2;i:746;}i:70;a:3:{i:0;s:11:"listu_close";i:1;a:0:{}i:2;i:746;}i:71;a:3:{i:0;s:14:"listitem_close";i:1;a:0:{}i:2;i:746;}i:72;a:3:{i:0;s:11:"listu_close";i:1;a:0:{}i:2;i:746;}i:73;a:3:{i:0;s:13:"section_close";i:1;a:0:{}i:2;i:748;}i:74;a:3:{i:0;s:12:"section_edit";i:1;a:4:{i:0;i:240;i:1;i:747;i:2;i:3;i:3;s:53:"1) Comissão de Organização do Aniversário do PET:";}i:2;i:748;}i:75;a:3:{i:0;s:6:"header";i:1;a:3:{i:0;s:61:"2) Data da seleção dos novos bolsistas do PET computação:";i:1;i:3;i:2;i:748;}i:2;i:748;}i:76;a:3:{i:0;s:12:"section_open";i:1;a:1:{i:0;i:3;}i:2;i:748;}i:77;a:3:{i:0;s:6:"p_open";i:1;a:0:{}i:2;i:819;}i:78;a:3:{i:0;s:5:"cdata";i:1;a:1:{i:0;s:1:"
";}i:2;i:820;}i:79;a:3:{i:0;s:11:"strong_open";i:1;a:0:{}i:2;i:821;}i:80;a:3:{i:0;s:5:"cdata";i:1;a:1:{i:0;s:28:" 2.1) Apresentação do PET ";}i:2;i:823;}i:81;a:3:{i:0;s:12:"strong_close";i:1;a:0:{}i:2;i:851;}i:82;a:3:{i:0;s:5:"cdata";i:1;a:1:{i:0;s:46:" aos candidatos dia 29 de Setembro às 15:30h;";}i:2;i:853;}i:83;a:3:{i:0;s:7:"p_close";i:1;a:0:{}i:2;i:899;}i:84;a:3:{i:0;s:6:"p_open";i:1;a:0:{}i:2;i:899;}i:85;a:3:{i:0;s:11:"strong_open";i:1;a:0:{}i:2;i:901;}i:86;a:3:{i:0;s:5:"cdata";i:1;a:1:{i:0;s:16:" 2.2) Seleção:";}i:2;i:903;}i:87;a:3:{i:0;s:12:"strong_close";i:1;a:0:{}i:2;i:919;}i:88;a:3:{i:0;s:5:"cdata";i:1;a:1:{i:0;s:34:" Será no dia 13 ou 20 de outubro;";}i:2;i:921;}i:89;a:3:{i:0;s:7:"p_close";i:1;a:0:{}i:2;i:955;}i:90;a:3:{i:0;s:13:"section_close";i:1;a:0:{}i:2;i:957;}i:91;a:3:{i:0;s:12:"section_edit";i:1;a:4:{i:0;i:748;i:1;i:956;i:2;i:3;i:3;s:61:"2) Data da seleção dos novos bolsistas do PET computação:";}i:2;i:957;}i:92;a:3:{i:0;s:6:"header";i:1;a:3:{i:0;s:27:"3) Relatório de Extensão:";i:1;i:3;i:2;i:957;}i:2;i:957;}i:93;a:3:{i:0;s:12:"section_open";i:1;a:1:{i:0;i:3;}i:2;i:957;}i:94;a:3:{i:0;s:6:"p_open";i:1;a:0:{}i:2;i:994;}i:95;a:3:{i:0;s:5:"cdata";i:1;a:1:{i:0;s:28:"
Os relatórios do curso de ";}i:2;i:995;}i:96;a:3:{i:0;s:7:"acronym";i:1;a:1:{i:0;s:4:"HTML";}i:2;i:1023;}i:97;a:3:{i:0;s:5:"cdata";i:1;a:1:{i:0;s:31:" e do Roboedu foram aprovados.
";}i:2;i:1027;}i:98;a:3:{i:0;s:7:"p_close";i:1;a:0:{}i:2;i:1058;}i:99;a:3:{i:0;s:10:"listu_open";i:1;a:0:{}i:2;i:1058;}i:100;a:3:{i:0;s:13:"listitem_open";i:1;a:1:{i:0;i:1;}i:2;i:1058;}i:101;a:3:{i:0;s:16:"listcontent_open";i:1;a:0:{}i:2;i:1058;}i:102;a:3:{i:0;s:5:"cdata";i:1;a:1:{i:0;s:33:" Pablo dará continuação ao de ";}i:2;i:1062;}i:103;a:3:{i:0;s:7:"acronym";i:1;a:1:{i:0;s:4:"HTML";}i:2;i:1095;}i:104;a:3:{i:0;s:5:"cdata";i:1;a:1:{i:0;s:15:" imediatamente;";}i:2;i:1099;}i:105;a:3:{i:0;s:17:"listcontent_close";i:1;a:0:{}i:2;i:1114;}i:106;a:3:{i:0;s:14:"listitem_close";i:1;a:0:{}i:2;i:1114;}i:107;a:3:{i:0;s:13:"listitem_open";i:1;a:1:{i:0;i:1;}i:2;i:1114;}i:108;a:3:{i:0;s:16:"listcontent_open";i:1;a:0:{}i:2;i:1114;}i:109;a:3:{i:0;s:5:"cdata";i:1;a:1:{i:0;s:56:" Gabriela aguardará o início das atividades no Tubino;";}i:2;i:1118;}i:110;a:3:{i:0;s:17:"listcontent_close";i:1;a:0:{}i:2;i:1174;}i:111;a:3:{i:0;s:14:"listitem_close";i:1;a:0:{}i:2;i:1174;}i:112;a:3:{i:0;s:11:"listu_close";i:1;a:0:{}i:2;i:1174;}i:113;a:3:{i:0;s:13:"section_close";i:1;a:0:{}i:2;i:1176;}i:114;a:3:{i:0;s:12:"section_edit";i:1;a:4:{i:0;i:957;i:1;i:1175;i:2;i:3;i:3;s:27:"3) Relatório de Extensão:";}i:2;i:1176;}i:115;a:3:{i:0;s:6:"header";i:1;a:3:{i:0;s:28:"4) ROBOEDU: Artigo rejeitado";i:1;i:3;i:2;i:1176;}i:2;i:1176;}i:116;a:3:{i:0;s:12:"section_open";i:1;a:1:{i:0;i:3;}i:2;i:1176;}i:117;a:3:{i:0;s:6:"p_open";i:1;a:0:{}i:2;i:1214;}i:118;a:3:{i:0;s:5:"cdata";i:1;a:1:{i:0;s:149:"
Foram expostos e discutidos os comentários dos avaliadores. Concordamos com os mesmos, aprimoraremos o artigo e tentaremos enviá-lo a outro local;";}i:2;i:1215;}i:119;a:3:{i:0;s:7:"p_close";i:1;a:0:{}i:2;i:1364;}i:120;a:3:{i:0;s:13:"section_close";i:1;a:0:{}i:2;i:1366;}i:121;a:3:{i:0;s:12:"section_edit";i:1;a:4:{i:0;i:1176;i:1;i:1365;i:2;i:3;i:3;s:28:"4) ROBOEDU: Artigo rejeitado";}i:2;i:1366;}i:122;a:3:{i:0;s:6:"header";i:1;a:3:{i:0;s:33:"5) Cooperação com a Austrália:";i:1;i:3;i:2;i:1366;}i:2;i:1366;}i:123;a:3:{i:0;s:12:"section_open";i:1;a:1:{i:0;i:3;}i:2;i:1366;}i:124;a:3:{i:0;s:10:"listu_open";i:1;a:0:{}i:2;i:1410;}i:125;a:3:{i:0;s:13:"listitem_open";i:1;a:1:{i:0;i:1;}i:2;i:1410;}i:126;a:3:{i:0;s:16:"listcontent_open";i:1;a:0:{}i:2;i:1410;}i:127;a:3:{i:0;s:5:"cdata";i:1;a:1:{i:0;s:91:" Marcos está trabalhando e rascunhará um documento do convênio com as seguintes idéias.";}i:2;i:1414;}i:128;a:3:{i:0;s:17:"listcontent_close";i:1;a:0:{}i:2;i:1505;}i:129;a:3:{i:0;s:10:"listu_open";i:1;a:0:{}i:2;i:1505;}i:130;a:3:{i:0;s:13:"listitem_open";i:1;a:1:{i:0;i:2;}i:2;i:1505;}i:131;a:3:{i:0;s:16:"listcontent_open";i:1;a:0:{}i:2;i:1505;}i:132;a:3:{i:0;s:5:"cdata";i:1;a:1:{i:0;s:89:" Intercâmbio de 8 alunos por um ano e 2 professores por um mês para cada instituição;";}i:2;i:1511;}i:133;a:3:{i:0;s:17:"listcontent_close";i:1;a:0:{}i:2;i:1600;}i:134;a:3:{i:0;s:14:"listitem_close";i:1;a:0:{}i:2;i:1600;}i:135;a:3:{i:0;s:13:"listitem_open";i:1;a:1:{i:0;i:2;}i:2;i:1600;}i:136;a:3:{i:0;s:16:"listcontent_open";i:1;a:0:{}i:2;i:1600;}i:137;a:3:{i:0;s:5:"cdata";i:1;a:1:{i:0;s:47:" Cada país paga passagem para seus estudantes;";}i:2;i:1606;}i:138;a:3:{i:0;s:17:"listcontent_close";i:1;a:0:{}i:2;i:1653;}i:139;a:3:{i:0;s:14:"listitem_close";i:1;a:0:{}i:2;i:1653;}i:140;a:3:{i:0;s:13:"listitem_open";i:1;a:1:{i:0;i:2;}i:2;i:1653;}i:141;a:3:{i:0;s:16:"listcontent_open";i:1;a:0:{}i:2;i:1653;}i:142;a:3:{i:0;s:5:"cdata";i:1;a:1:{i:0;s:134:" Cada país paga bolsa para os estudantes visitantes (Brasil pagaria o valor referente a uma bolsa de doutorado para os Australianos);";}i:2;i:1659;}i:143;a:3:{i:0;s:17:"listcontent_close";i:1;a:0:{}i:2;i:1793;}i:144;a:3:{i:0;s:14:"listitem_close";i:1;a:0:{}i:2;i:1793;}i:145;a:3:{i:0;s:13:"listitem_open";i:1;a:1:{i:0;i:2;}i:2;i:1793;}i:146;a:3:{i:0;s:16:"listcontent_open";i:1;a:0:{}i:2;i:1793;}i:147;a:3:{i:0;s:5:"cdata";i:1;a:1:{i:0;s:71:" Brasil pode oferecer bolsa de Língua Portuguesa para os Australianos;";}i:2;i:1799;}i:148;a:3:{i:0;s:17:"listcontent_close";i:1;a:0:{}i:2;i:1870;}i:149;a:3:{i:0;s:14:"listitem_close";i:1;a:0:{}i:2;i:1870;}i:150;a:3:{i:0;s:11:"listu_close";i:1;a:0:{}i:2;i:1870;}i:151;a:3:{i:0;s:14:"listitem_close";i:1;a:0:{}i:2;i:1870;}i:152;a:3:{i:0;s:11:"listu_close";i:1;a:0:{}i:2;i:1870;}i:153;a:3:{i:0;s:13:"section_close";i:1;a:0:{}i:2;i:1872;}i:154;a:3:{i:0;s:12:"section_edit";i:1;a:4:{i:0;i:1366;i:1;i:1871;i:2;i:3;i:3;s:33:"5) Cooperação com a Austrália:";}i:2;i:1872;}i:155;a:3:{i:0;s:6:"header";i:1;a:3:{i:0;s:31:"6) Cooperação com a Alemanha:";i:1;i:3;i:2;i:1872;}i:2;i:1872;}i:156;a:3:{i:0;s:12:"section_open";i:1;a:1:{i:0;i:3;}i:2;i:1872;}i:157;a:3:{i:0;s:10:"listu_open";i:1;a:0:{}i:2;i:1914;}i:158;a:3:{i:0;s:13:"listitem_open";i:1;a:1:{i:0;i:1;}i:2;i:1914;}i:159;a:3:{i:0;s:16:"listcontent_open";i:1;a:0:{}i:2;i:1914;}i:160;a:3:{i:0;s:5:"cdata";i:1;a:1:{i:0;s:134:" Thiago fará uma modificação de uma apresentação (que foi usada na visita do Dante à Austrália) e enviará por mail até sexta.";}i:2;i:1918;}i:161;a:3:{i:0;s:17:"listcontent_close";i:1;a:0:{}i:2;i:2052;}i:162;a:3:{i:0;s:14:"listitem_close";i:1;a:0:{}i:2;i:2052;}i:163;a:3:{i:0;s:11:"listu_close";i:1;a:0:{}i:2;i:2052;}i:164;a:3:{i:0;s:13:"section_close";i:1;a:0:{}i:2;i:2054;}i:165;a:3:{i:0;s:12:"section_edit";i:1;a:4:{i:0;i:1872;i:1;i:2053;i:2;i:3;i:3;s:31:"6) Cooperação com a Alemanha:";}i:2;i:2054;}i:166;a:3:{i:0;s:6:"header";i:1;a:3:{i:0;s:41:"7) Missão Ribeirão Preto e São Carlos:";i:1;i:3;i:2;i:2054;}i:2;i:2054;}i:167;a:3:{i:0;s:12:"section_open";i:1;a:1:{i:0;i:3;}i:2;i:2054;}i:168;a:3:{i:0;s:13:"section_close";i:1;a:0:{}i:2;i:2107;}i:169;a:3:{i:0;s:6:"header";i:1;a:3:{i:0;s:24:"7.1) Comentários Gerais";i:1;i:4;i:2;i:2107;}i:2;i:2107;}i:170;a:3:{i:0;s:12:"section_open";i:1;a:1:{i:0;i:4;}i:2;i:2107;}i:171;a:3:{i:0;s:10:"listu_open";i:1;a:0:{}i:2;i:2140;}i:172;a:3:{i:0;s:13:"listitem_open";i:1;a:1:{i:0;i:1;}i:2;i:2140;}i:173;a:3:{i:0;s:16:"listcontent_open";i:1;a:0:{}i:2;i:2140;}i:174;a:3:{i:0;s:5:"cdata";i:1;a:1:{i:0;s:129:" Thiago e Fabiano fizeram comentários sobre a feira do livro de Ribeirão Preto e sobre as reuniões com o Simoes e com o Motta.";}i:2;i:2144;}i:175;a:3:{i:0;s:17:"listcontent_close";i:1;a:0:{}i:2;i:2273;}i:176;a:3:{i:0;s:14:"listitem_close";i:1;a:0:{}i:2;i:2273;}i:177;a:3:{i:0;s:11:"listu_close";i:1;a:0:{}i:2;i:2273;}i:178;a:3:{i:0;s:13:"section_close";i:1;a:0:{}i:2;i:2275;}i:179;a:3:{i:0;s:6:"header";i:1;a:3:{i:0;s:20:"7.2) Horas Pendentes";i:1;i:4;i:2;i:2275;}i:2;i:2275;}i:180;a:3:{i:0;s:12:"section_open";i:1;a:1:{i:0;i:4;}i:2;i:2275;}i:181;a:3:{i:0;s:10:"listu_open";i:1;a:0:{}i:2;i:2304;}i:182;a:3:{i:0;s:13:"listitem_open";i:1;a:1:{i:0;i:1;}i:2;i:2304;}i:183;a:3:{i:0;s:16:"listcontent_open";i:1;a:0:{}i:2;i:2304;}i:184;a:3:{i:0;s:5:"cdata";i:1;a:1:{i:0;s:72:" Serão aprovadas 12 horas pendentes para os bolsistas Thiago e Fabiano;";}i:2;i:2308;}i:185;a:3:{i:0;s:17:"listcontent_close";i:1;a:0:{}i:2;i:2380;}i:186;a:3:{i:0;s:14:"listitem_close";i:1;a:0:{}i:2;i:2380;}i:187;a:3:{i:0;s:11:"listu_close";i:1;a:0:{}i:2;i:2380;}i:188;a:3:{i:0;s:13:"section_close";i:1;a:0:{}i:2;i:2382;}i:189;a:3:{i:0;s:12:"section_edit";i:1;a:4:{i:0;i:2054;i:1;i:2381;i:2;i:3;i:3;s:41:"7) Missão Ribeirão Preto e São Carlos:";}i:2;i:2382;}i:190;a:3:{i:0;s:6:"header";i:1;a:3:{i:0;s:54:"8) Apresentação das avaliações do tutor e do grupo";i:1;i:3;i:2;i:2382;}i:2;i:2382;}i:191;a:3:{i:0;s:12:"section_open";i:1;a:1:{i:0;i:3;}i:2;i:2382;}i:192;a:3:{i:0;s:10:"listu_open";i:1;a:0:{}i:2;i:2447;}i:193;a:3:{i:0;s:13:"listitem_open";i:1;a:1:{i:0;i:1;}i:2;i:2447;}i:194;a:3:{i:0;s:16:"listcontent_open";i:1;a:0:{}i:2;i:2447;}i:195;a:3:{i:0;s:5:"cdata";i:1;a:1:{i:0;s:112:" Será marcado uma data, a ser definida, para apresentarmos as avaliações tutor pelo grupo e grupo pelo tutor;";}i:2;i:2451;}i:196;a:3:{i:0;s:17:"listcontent_close";i:1;a:0:{}i:2;i:2563;}i:197;a:3:{i:0;s:14:"listitem_close";i:1;a:0:{}i:2;i:2563;}i:198;a:3:{i:0;s:11:"listu_close";i:1;a:0:{}i:2;i:2563;}i:199;a:3:{i:0;s:13:"section_close";i:1;a:0:{}i:2;i:2565;}i:200;a:3:{i:0;s:12:"section_edit";i:1;a:4:{i:0;i:2382;i:1;i:2564;i:2;i:3;i:3;s:54:"8) Apresentação das avaliações do tutor e do grupo";}i:2;i:2565;}i:201;a:3:{i:0;s:6:"header";i:1;a:3:{i:0;s:22:"9) Salão de Extensão";i:1;i:3;i:2;i:2565;}i:2;i:2565;}i:202;a:3:{i:0;s:12:"section_open";i:1;a:1:{i:0;i:3;}i:2;i:2565;}i:203;a:3:{i:0;s:10:"listu_open";i:1;a:0:{}i:2;i:2598;}i:204;a:3:{i:0;s:13:"listitem_open";i:1;a:1:{i:0;i:1;}i:2;i:2598;}i:205;a:3:{i:0;s:16:"listcontent_open";i:1;a:0:{}i:2;i:2598;}i:206;a:3:{i:0;s:5:"cdata";i:1;a:1:{i:0;s:56:" Quarta às 11:30 apresentação do pôster pelo Felipe;";}i:2;i:2602;}i:207;a:3:{i:0;s:17:"listcontent_close";i:1;a:0:{}i:2;i:2658;}i:208;a:3:{i:0;s:14:"listitem_close";i:1;a:0:{}i:2;i:2658;}i:209;a:3:{i:0;s:13:"listitem_open";i:1;a:1:{i:0;i:1;}i:2;i:2658;}i:210;a:3:{i:0;s:16:"listcontent_open";i:1;a:0:{}i:2;i:2658;}i:211;a:3:{i:0;s:5:"cdata";i:1;a:1:{i:0;s:63:" Quarta às 13:30 Apresentação oral com a presença do Dante;";}i:2;i:2662;}i:212;a:3:{i:0;s:17:"listcontent_close";i:1;a:0:{}i:2;i:2725;}i:213;a:3:{i:0;s:14:"listitem_close";i:1;a:0:{}i:2;i:2725;}i:214;a:3:{i:0;s:13:"listitem_open";i:1;a:1:{i:0;i:1;}i:2;i:2725;}i:215;a:3:{i:0;s:16:"listcontent_open";i:1;a:0:{}i:2;i:2725;}i:216;a:3:{i:0;s:5:"cdata";i:1;a:1:{i:0;s:37:" Quinta das 14h às 17h minicurso de ";}i:2;i:2729;}i:217;a:3:{i:0;s:7:"acronym";i:1;a:1:{i:0;s:4:"HTML";}i:2;i:2766;}i:218;a:3:{i:0;s:5:"cdata";i:1;a:1:{i:0;s:93:" ministrado pelo Pablo. Sugere-se que mais alguns petianos se façam presentes para auxiliar.";}i:2;i:2770;}i:219;a:3:{i:0;s:17:"listcontent_close";i:1;a:0:{}i:2;i:2863;}i:220;a:3:{i:0;s:14:"listitem_close";i:1;a:0:{}i:2;i:2863;}i:221;a:3:{i:0;s:11:"listu_close";i:1;a:0:{}i:2;i:2863;}i:222;a:3:{i:0;s:13:"section_close";i:1;a:0:{}i:2;i:2865;}i:223;a:3:{i:0;s:12:"section_edit";i:1;a:4:{i:0;i:2565;i:1;i:2864;i:2;i:3;i:3;s:22:"9) Salão de Extensão";}i:2;i:2865;}i:224;a:3:{i:0;s:6:"header";i:1;a:3:{i:0;s:18:"10) Peça Teatral:";i:1;i:3;i:2;i:2865;}i:2;i:2865;}i:225;a:3:{i:0;s:12:"section_open";i:1;a:1:{i:0;i:3;}i:2;i:2865;}i:226;a:3:{i:0;s:10:"listu_open";i:1;a:0:{}i:2;i:2894;}i:227;a:3:{i:0;s:13:"listitem_open";i:1;a:1:{i:0;i:1;}i:2;i:2894;}i:228;a:3:{i:0;s:16:"listcontent_open";i:1;a:0:{}i:2;i:2894;}i:229;a:3:{i:0;s:5:"cdata";i:1;a:1:{i:0;s:112:" Dante nos informou que haverá a peça Tangos e Tragédias gratuíta para alunos no Salão de atos da Reitoria;";}i:2;i:2898;}i:230;a:3:{i:0;s:17:"listcontent_close";i:1;a:0:{}i:2;i:3010;}i:231;a:3:{i:0;s:14:"listitem_close";i:1;a:0:{}i:2;i:3010;}i:232;a:3:{i:0;s:11:"listu_close";i:1;a:0:{}i:2;i:3010;}i:233;a:3:{i:0;s:13:"section_close";i:1;a:0:{}i:2;i:3012;}i:234;a:3:{i:0;s:12:"section_edit";i:1;a:4:{i:0;i:2865;i:1;i:3011;i:2;i:3;i:3;s:18:"10) Peça Teatral:";}i:2;i:3012;}i:235;a:3:{i:0;s:6:"header";i:1;a:3:{i:0;s:20:"11) Reunião ROBOEDU";i:1;i:3;i:2;i:3012;}i:2;i:3012;}i:236;a:3:{i:0;s:12:"section_open";i:1;a:1:{i:0;i:3;}i:2;i:3012;}i:237;a:3:{i:0;s:10:"listu_open";i:1;a:0:{}i:2;i:3043;}i:238;a:3:{i:0;s:13:"listitem_open";i:1;a:1:{i:0;i:1;}i:2;i:3043;}i:239;a:3:{i:0;s:16:"listcontent_open";i:1;a:0:{}i:2;i:3043;}i:240;a:3:{i:0;s:5:"cdata";i:1;a:1:{i:0;s:64:" Confirmada a reunião do roboedu para quinta dia 28/09 às 18h.";}i:2;i:3047;}i:241;a:3:{i:0;s:17:"listcontent_close";i:1;a:0:{}i:2;i:3111;}i:242;a:3:{i:0;s:14:"listitem_close";i:1;a:0:{}i:2;i:3111;}i:243;a:3:{i:0;s:11:"listu_close";i:1;a:0:{}i:2;i:3111;}i:244;a:3:{i:0;s:13:"section_close";i:1;a:0:{}i:2;i:3113;}i:245;a:3:{i:0;s:12:"section_edit";i:1;a:4:{i:0;i:3012;i:1;i:3112;i:2;i:3;i:3;s:20:"11) Reunião ROBOEDU";}i:2;i:3113;}i:246;a:3:{i:0;s:6:"header";i:1;a:3:{i:0;s:25:"12) Discissão Política:";i:1;i:3;i:2;i:3113;}i:2;i:3113;}i:247;a:3:{i:0;s:12:"section_open";i:1;a:1:{i:0;i:3;}i:2;i:3113;}i:248;a:3:{i:0;s:10:"listu_open";i:1;a:0:{}i:2;i:3149;}i:249;a:3:{i:0;s:13:"listitem_open";i:1;a:1:{i:0;i:1;}i:2;i:3149;}i:250;a:3:{i:0;s:16:"listcontent_open";i:1;a:0:{}i:2;i:3149;}i:251;a:3:{i:0;s:5:"cdata";i:1;a:1:{i:0;s:99:" O grupo discutiu por aproximadamente 1h vários pontos de vista sobre os mais diversos candidatos.";}i:2;i:3153;}i:252;a:3:{i:0;s:17:"listcontent_close";i:1;a:0:{}i:2;i:3252;}i:253;a:3:{i:0;s:14:"listitem_close";i:1;a:0:{}i:2;i:3252;}i:254;a:3:{i:0;s:11:"listu_close";i:1;a:0:{}i:2;i:3252;}i:255;a:3:{i:0;s:13:"section_close";i:1;a:0:{}i:2;i:3253;}i:256;a:3:{i:0;s:12:"section_edit";i:1;a:4:{i:0;i:3113;i:1;i:0;i:2;i:3;i:3;s:25:"12) Discissão Política:";}i:2;i:3253;}i:257;a:3:{i:0;s:12:"document_end";i:1;a:0:{}i:2;i:3253;}}