a:189:{i:0;a:3:{i:0;s:14:"document_start";i:1;a:0:{}i:2;i:0;}i:1;a:3:{i:0;s:6:"p_open";i:1;a:0:{}i:2;i:0;}i:2;a:3:{i:0;s:11:"strong_open";i:1;a:0:{}i:2;i:1;}i:3;a:3:{i:0;s:5:"cdata";i:1;a:1:{i:0;s:5:"Data:";}i:2;i:3;}i:4;a:3:{i:0;s:12:"strong_close";i:1;a:0:{}i:2;i:8;}i:5;a:3:{i:0;s:5:"cdata";i:1;a:1:{i:0;s:10:" 18/03/05 ";}i:2;i:10;}i:6;a:3:{i:0;s:11:"strong_open";i:1;a:0:{}i:2;i:20;}i:7;a:3:{i:0;s:5:"cdata";i:1;a:1:{i:0;s:8:"Relator:";}i:2;i:22;}i:8;a:3:{i:0;s:12:"strong_close";i:1;a:0:{}i:2;i:30;}i:9;a:3:{i:0;s:5:"cdata";i:1;a:1:{i:0;s:21:" Diego Midon Pereira ";}i:2;i:32;}i:10;a:3:{i:0;s:11:"strong_open";i:1;a:0:{}i:2;i:53;}i:11;a:3:{i:0;s:5:"cdata";i:1;a:1:{i:0;s:10:"Presentes:";}i:2;i:55;}i:12;a:3:{i:0;s:12:"strong_close";i:1;a:0:{}i:2;i:65;}i:13;a:3:{i:0;s:5:"cdata";i:1;a:1:{i:0;s:89:" Dante, Diego, Wagner, Nondillo, Vinícius, João, Robert, Lilian, Gustavo, Paulo, Irigon";}i:2;i:67;}i:14;a:3:{i:0;s:7:"p_close";i:1;a:0:{}i:2;i:156;}i:15;a:3:{i:0;s:6:"p_open";i:1;a:0:{}i:2;i:156;}i:16;a:3:{i:0;s:5:"cdata";i:1;a:1:{i:0;s:2:"1.";}i:2;i:158;}i:17;a:3:{i:0;s:11:"strong_open";i:1;a:0:{}i:2;i:160;}i:18;a:3:{i:0;s:5:"cdata";i:1;a:1:{i:0;s:20:"Eleição do Líder:";}i:2;i:162;}i:19;a:3:{i:0;s:12:"strong_close";i:1;a:0:{}i:2;i:182;}i:20;a:3:{i:0;s:5:"cdata";i:1;a:1:{i:0;s:1:"
";}i:2;i:184;}i:21;a:3:{i:0;s:7:"p_close";i:1;a:0:{}i:2;i:185;}i:22;a:3:{i:0;s:10:"listu_open";i:1;a:0:{}i:2;i:185;}i:23;a:3:{i:0;s:13:"listitem_open";i:1;a:1:{i:0;i:1;}i:2;i:185;}i:24;a:3:{i:0;s:16:"listcontent_open";i:1;a:0:{}i:2;i:185;}i:25;a:3:{i:0;s:5:"cdata";i:1;a:1:{i:0;s:187:" Paulo Schreiner foi eleito o novo líder do PET Computação, com mandato até o ínicio do segundo semestre letivo, com 08 votos, contra 02 votos para o candidato Robert e 01 voto nulo.";}i:2;i:189;}i:26;a:3:{i:0;s:17:"listcontent_close";i:1;a:0:{}i:2;i:376;}i:27;a:3:{i:0;s:14:"listitem_close";i:1;a:0:{}i:2;i:376;}i:28;a:3:{i:0;s:11:"listu_close";i:1;a:0:{}i:2;i:376;}i:29;a:3:{i:0;s:6:"p_open";i:1;a:0:{}i:2;i:376;}i:30;a:3:{i:0;s:5:"cdata";i:1;a:1:{i:0;s:3:"
2.";}i:2;i:377;}i:31;a:3:{i:0;s:11:"strong_open";i:1;a:0:{}i:2;i:380;}i:32;a:3:{i:0;s:5:"cdata";i:1;a:1:{i:0;s:23:"Horário das Reuniões:";}i:2;i:382;}i:33;a:3:{i:0;s:12:"strong_close";i:1;a:0:{}i:2;i:405;}i:34;a:3:{i:0;s:5:"cdata";i:1;a:1:{i:0;s:1:"
";}i:2;i:407;}i:35;a:3:{i:0;s:7:"p_close";i:1;a:0:{}i:2;i:408;}i:36;a:3:{i:0;s:10:"listu_open";i:1;a:0:{}i:2;i:408;}i:37;a:3:{i:0;s:13:"listitem_open";i:1;a:1:{i:0;i:1;}i:2;i:408;}i:38;a:3:{i:0;s:16:"listcontent_open";i:1;a:0:{}i:2;i:408;}i:39;a:3:{i:0;s:5:"cdata";i:1;a:1:{i:0;s:96:" A próxima reunião do grupo será realizada terça-feira, dia 29 de março de 2005, às 17:30.";}i:2;i:412;}i:40;a:3:{i:0;s:17:"listcontent_close";i:1;a:0:{}i:2;i:508;}i:41;a:3:{i:0;s:14:"listitem_close";i:1;a:0:{}i:2;i:508;}i:42;a:3:{i:0;s:13:"listitem_open";i:1;a:1:{i:0;i:1;}i:2;i:508;}i:43;a:3:{i:0;s:16:"listcontent_open";i:1;a:0:{}i:2;i:508;}i:44;a:3:{i:0;s:5:"cdata";i:1;a:1:{i:0;s:75:" O horário das reuniões para o próximo semestre ainda não foi definido.";}i:2;i:512;}i:45;a:3:{i:0;s:17:"listcontent_close";i:1;a:0:{}i:2;i:587;}i:46;a:3:{i:0;s:14:"listitem_close";i:1;a:0:{}i:2;i:587;}i:47;a:3:{i:0;s:11:"listu_close";i:1;a:0:{}i:2;i:587;}i:48;a:3:{i:0;s:6:"p_open";i:1;a:0:{}i:2;i:587;}i:49;a:3:{i:0;s:5:"cdata";i:1;a:1:{i:0;s:3:"
3.";}i:2;i:588;}i:50;a:3:{i:0;s:11:"strong_open";i:1;a:0:{}i:2;i:591;}i:51;a:3:{i:0;s:5:"cdata";i:1;a:1:{i:0;s:61:"Planejamento trimestral de atividades (abril/05 à junho/05):";}i:2;i:593;}i:52;a:3:{i:0;s:12:"strong_close";i:1;a:0:{}i:2;i:654;}i:53;a:3:{i:0;s:5:"cdata";i:1;a:1:{i:0;s:1:"
";}i:2;i:656;}i:54;a:3:{i:0;s:7:"p_close";i:1;a:0:{}i:2;i:657;}i:55;a:3:{i:0;s:10:"listu_open";i:1;a:0:{}i:2;i:657;}i:56;a:3:{i:0;s:13:"listitem_open";i:1;a:1:{i:0;i:1;}i:2;i:657;}i:57;a:3:{i:0;s:16:"listcontent_open";i:1;a:0:{}i:2;i:657;}i:58;a:3:{i:0;s:5:"cdata";i:1;a:1:{i:0;s:126:" Ficou estabelicido o prazo máximo de uma semana para que todos os petianos disponibilizassem seus planejamentos trimestrais.";}i:2;i:661;}i:59;a:3:{i:0;s:17:"listcontent_close";i:1;a:0:{}i:2;i:787;}i:60;a:3:{i:0;s:14:"listitem_close";i:1;a:0:{}i:2;i:787;}i:61;a:3:{i:0;s:11:"listu_close";i:1;a:0:{}i:2;i:787;}i:62;a:3:{i:0;s:6:"p_open";i:1;a:0:{}i:2;i:787;}i:63;a:3:{i:0;s:5:"cdata";i:1;a:1:{i:0;s:3:"
4.";}i:2;i:788;}i:64;a:3:{i:0;s:11:"strong_open";i:1;a:0:{}i:2;i:791;}i:65;a:3:{i:0;s:5:"cdata";i:1;a:1:{i:0;s:10:"Seleção:";}i:2;i:793;}i:66;a:3:{i:0;s:12:"strong_close";i:1;a:0:{}i:2;i:803;}i:67;a:3:{i:0;s:5:"cdata";i:1;a:1:{i:0;s:1:"
";}i:2;i:805;}i:68;a:3:{i:0;s:7:"p_close";i:1;a:0:{}i:2;i:806;}i:69;a:3:{i:0;s:10:"listu_open";i:1;a:0:{}i:2;i:806;}i:70;a:3:{i:0;s:13:"listitem_open";i:1;a:1:{i:0;i:1;}i:2;i:806;}i:71;a:3:{i:0;s:16:"listcontent_open";i:1;a:0:{}i:2;i:806;}i:72;a:3:{i:0;s:5:"cdata";i:1;a:1:{i:0;s:296:" Ficou confirmado o calendário das atividades da seleção - a palestra será realizada dia 01/04, o prazo final para inscrições é 04/04, a dinâmica de grupo será realizada dia 06/04, e a entrevista seŕa feita dia 08/04. Os 2 novos petianos deverão ingressar na segunda quinzena de abril.";}i:2;i:810;}i:73;a:3:{i:0;s:17:"listcontent_close";i:1;a:0:{}i:2;i:1106;}i:74;a:3:{i:0;s:14:"listitem_close";i:1;a:0:{}i:2;i:1106;}i:75;a:3:{i:0;s:11:"listu_close";i:1;a:0:{}i:2;i:1106;}i:76;a:3:{i:0;s:6:"p_open";i:1;a:0:{}i:2;i:1106;}i:77;a:3:{i:0;s:5:"cdata";i:1;a:1:{i:0;s:3:"
5.";}i:2;i:1107;}i:78;a:3:{i:0;s:11:"strong_open";i:1;a:0:{}i:2;i:1110;}i:79;a:3:{i:0;s:5:"cdata";i:1;a:1:{i:0;s:10:"Churrasco:";}i:2;i:1112;}i:80;a:3:{i:0;s:12:"strong_close";i:1;a:0:{}i:2;i:1122;}i:81;a:3:{i:0;s:5:"cdata";i:1;a:1:{i:0;s:1:"
";}i:2;i:1124;}i:82;a:3:{i:0;s:7:"p_close";i:1;a:0:{}i:2;i:1125;}i:83;a:3:{i:0;s:10:"listu_open";i:1;a:0:{}i:2;i:1125;}i:84;a:3:{i:0;s:13:"listitem_open";i:1;a:1:{i:0;i:1;}i:2;i:1125;}i:85;a:3:{i:0;s:16:"listcontent_open";i:1;a:0:{}i:2;i:1125;}i:86;a:3:{i:0;s:5:"cdata";i:1;a:1:{i:0;s:35:" Comissão do churrasco = Vinícius";}i:2;i:1129;}i:87;a:3:{i:0;s:17:"listcontent_close";i:1;a:0:{}i:2;i:1164;}i:88;a:3:{i:0;s:14:"listitem_close";i:1;a:0:{}i:2;i:1164;}i:89;a:3:{i:0;s:11:"listu_close";i:1;a:0:{}i:2;i:1164;}i:90;a:3:{i:0;s:6:"p_open";i:1;a:0:{}i:2;i:1164;}i:91;a:3:{i:0;s:5:"cdata";i:1;a:1:{i:0;s:3:"
6.";}i:2;i:1165;}i:92;a:3:{i:0;s:11:"strong_open";i:1;a:0:{}i:2;i:1168;}i:93;a:3:{i:0;s:5:"cdata";i:1;a:1:{i:0;s:21:"UFRGS Portas Abertas:";}i:2;i:1170;}i:94;a:3:{i:0;s:12:"strong_close";i:1;a:0:{}i:2;i:1191;}i:95;a:3:{i:0;s:5:"cdata";i:1;a:1:{i:0;s:1:"
";}i:2;i:1193;}i:96;a:3:{i:0;s:7:"p_close";i:1;a:0:{}i:2;i:1194;}i:97;a:3:{i:0;s:10:"listu_open";i:1;a:0:{}i:2;i:1194;}i:98;a:3:{i:0;s:13:"listitem_open";i:1;a:1:{i:0;i:1;}i:2;i:1194;}i:99;a:3:{i:0;s:16:"listcontent_open";i:1;a:0:{}i:2;i:1194;}i:100;a:3:{i:0;s:5:"cdata";i:1;a:1:{i:0;s:59:" Comissão do UFRGS Portas Abertas: Paulo, Irigon e Rafael.";}i:2;i:1198;}i:101;a:3:{i:0;s:17:"listcontent_close";i:1;a:0:{}i:2;i:1257;}i:102;a:3:{i:0;s:14:"listitem_close";i:1;a:0:{}i:2;i:1257;}i:103;a:3:{i:0;s:13:"listitem_open";i:1;a:1:{i:0;i:1;}i:2;i:1257;}i:104;a:3:{i:0;s:16:"listcontent_open";i:1;a:0:{}i:2;i:1257;}i:105;a:3:{i:0;s:5:"cdata";i:1;a:1:{i:0;s:171:" A princípio, serão realizadas palestras com o prof. Johann e o prof. Weber sobre as diferenças entre os cursos de Engenharia da Computação e Ciência da Computação";}i:2;i:1261;}i:106;a:3:{i:0;s:17:"listcontent_close";i:1;a:0:{}i:2;i:1432;}i:107;a:3:{i:0;s:14:"listitem_close";i:1;a:0:{}i:2;i:1432;}i:108;a:3:{i:0;s:13:"listitem_open";i:1;a:1:{i:0;i:1;}i:2;i:1432;}i:109;a:3:{i:0;s:16:"listcontent_open";i:1;a:0:{}i:2;i:1432;}i:110;a:3:{i:0;s:5:"cdata";i:1;a:1:{i:0;s:30:" Além das apresentações de ";}i:2;i:1436;}i:111;a:3:{i:0;s:12:"internallink";i:1;a:2:{i:0;s:18:"/trac/wiki/RoboPet";i:1;s:8:"RoboPet?";}i:2;i:1466;}i:112;a:3:{i:0;s:5:"cdata";i:1;a:1:{i:0;s:51:", serão realizadas apresentações da pesquisa de ";}i:2;i:1497;}i:113;a:3:{i:0;s:12:"internallink";i:1;a:2:{i:0;s:25:"/trac/wiki/ObjectTracking";i:1;s:15:"ObjectTracking?";}i:2;i:1548;}i:114;a:3:{i:0;s:5:"cdata";i:1;a:1:{i:0;s:16:" (Paulo e Diego)";}i:2;i:1593;}i:115;a:3:{i:0;s:17:"listcontent_close";i:1;a:0:{}i:2;i:1609;}i:116;a:3:{i:0;s:14:"listitem_close";i:1;a:0:{}i:2;i:1609;}i:117;a:3:{i:0;s:11:"listu_close";i:1;a:0:{}i:2;i:1609;}i:118;a:3:{i:0;s:6:"p_open";i:1;a:0:{}i:2;i:1609;}i:119;a:3:{i:0;s:5:"cdata";i:1;a:1:{i:0;s:3:"
7.";}i:2;i:1610;}i:120;a:3:{i:0;s:11:"strong_open";i:1;a:0:{}i:2;i:1613;}i:121;a:3:{i:0;s:5:"cdata";i:1;a:1:{i:0;s:15:"Interpet 30/03:";}i:2;i:1615;}i:122;a:3:{i:0;s:12:"strong_close";i:1;a:0:{}i:2;i:1630;}i:123;a:3:{i:0;s:5:"cdata";i:1;a:1:{i:0;s:1:"
";}i:2;i:1632;}i:124;a:3:{i:0;s:7:"p_close";i:1;a:0:{}i:2;i:1633;}i:125;a:3:{i:0;s:10:"listu_open";i:1;a:0:{}i:2;i:1633;}i:126;a:3:{i:0;s:13:"listitem_open";i:1;a:1:{i:0;i:1;}i:2;i:1633;}i:127;a:3:{i:0;s:16:"listcontent_open";i:1;a:0:{}i:2;i:1633;}i:128;a:3:{i:0;s:5:"cdata";i:1;a:1:{i:0;s:26:" Alocados Paulo e Vinicius";}i:2;i:1637;}i:129;a:3:{i:0;s:17:"listcontent_close";i:1;a:0:{}i:2;i:1663;}i:130;a:3:{i:0;s:14:"listitem_close";i:1;a:0:{}i:2;i:1663;}i:131;a:3:{i:0;s:11:"listu_close";i:1;a:0:{}i:2;i:1663;}i:132;a:3:{i:0;s:6:"p_open";i:1;a:0:{}i:2;i:1663;}i:133;a:3:{i:0;s:5:"cdata";i:1;a:1:{i:0;s:3:"
8.";}i:2;i:1664;}i:134;a:3:{i:0;s:11:"strong_open";i:1;a:0:{}i:2;i:1667;}i:135;a:3:{i:0;s:5:"cdata";i:1;a:1:{i:0;s:22:"Sulpet Florianópolis:";}i:2;i:1669;}i:136;a:3:{i:0;s:12:"strong_close";i:1;a:0:{}i:2;i:1691;}i:137;a:3:{i:0;s:5:"cdata";i:1;a:1:{i:0;s:1:"
";}i:2;i:1693;}i:138;a:3:{i:0;s:7:"p_close";i:1;a:0:{}i:2;i:1694;}i:139;a:3:{i:0;s:10:"listu_open";i:1;a:0:{}i:2;i:1694;}i:140;a:3:{i:0;s:13:"listitem_open";i:1;a:1:{i:0;i:1;}i:2;i:1694;}i:141;a:3:{i:0;s:16:"listcontent_open";i:1;a:0:{}i:2;i:1694;}i:142;a:3:{i:0;s:5:"cdata";i:1;a:1:{i:0;s:79:" Confirmaram presença: Vinicius, Lilian, Irigon, Paulo, Diego, Robert e Rafael";}i:2;i:1698;}i:143;a:3:{i:0;s:17:"listcontent_close";i:1;a:0:{}i:2;i:1777;}i:144;a:3:{i:0;s:14:"listitem_close";i:1;a:0:{}i:2;i:1777;}i:145;a:3:{i:0;s:11:"listu_close";i:1;a:0:{}i:2;i:1777;}i:146;a:3:{i:0;s:6:"p_open";i:1;a:0:{}i:2;i:1777;}i:147;a:3:{i:0;s:5:"cdata";i:1;a:1:{i:0;s:3:"
9.";}i:2;i:1778;}i:148;a:3:{i:0;s:11:"strong_open";i:1;a:0:{}i:2;i:1781;}i:149;a:3:{i:0;s:5:"cdata";i:1;a:1:{i:0;s:18:"Inclusão Digital:";}i:2;i:1783;}i:150;a:3:{i:0;s:12:"strong_close";i:1;a:0:{}i:2;i:1801;}i:151;a:3:{i:0;s:5:"cdata";i:1;a:1:{i:0;s:1:"
";}i:2;i:1803;}i:152;a:3:{i:0;s:7:"p_close";i:1;a:0:{}i:2;i:1804;}i:153;a:3:{i:0;s:10:"listu_open";i:1;a:0:{}i:2;i:1804;}i:154;a:3:{i:0;s:13:"listitem_open";i:1;a:1:{i:0;i:1;}i:2;i:1804;}i:155;a:3:{i:0;s:16:"listcontent_open";i:1;a:0:{}i:2;i:1804;}i:156;a:3:{i:0;s:5:"cdata";i:1;a:1:{i:0;s:53:" Reunião dia 21, a tarde. Alocados Lilian e Gustavo.";}i:2;i:1808;}i:157;a:3:{i:0;s:17:"listcontent_close";i:1;a:0:{}i:2;i:1861;}i:158;a:3:{i:0;s:14:"listitem_close";i:1;a:0:{}i:2;i:1861;}i:159;a:3:{i:0;s:11:"listu_close";i:1;a:0:{}i:2;i:1861;}i:160;a:3:{i:0;s:6:"p_open";i:1;a:0:{}i:2;i:1861;}i:161;a:3:{i:0;s:5:"cdata";i:1;a:1:{i:0;s:4:"
10.";}i:2;i:1862;}i:162;a:3:{i:0;s:11:"strong_open";i:1;a:0:{}i:2;i:1866;}i:163;a:3:{i:0;s:5:"cdata";i:1;a:1:{i:0;s:15:"Projeto Irigon:";}i:2;i:1868;}i:164;a:3:{i:0;s:12:"strong_close";i:1;a:0:{}i:2;i:1883;}i:165;a:3:{i:0;s:5:"cdata";i:1;a:1:{i:0;s:1:"
";}i:2;i:1885;}i:166;a:3:{i:0;s:7:"p_close";i:1;a:0:{}i:2;i:1886;}i:167;a:3:{i:0;s:10:"listu_open";i:1;a:0:{}i:2;i:1886;}i:168;a:3:{i:0;s:13:"listitem_open";i:1;a:1:{i:0;i:1;}i:2;i:1886;}i:169;a:3:{i:0;s:16:"listcontent_open";i:1;a:0:{}i:2;i:1886;}i:170;a:3:{i:0;s:5:"cdata";i:1;a:1:{i:0;s:85:" Escola impôs muitas dificuldades, Irigon propôs implantar projeto em outra escola.";}i:2;i:1890;}i:171;a:3:{i:0;s:17:"listcontent_close";i:1;a:0:{}i:2;i:1975;}i:172;a:3:{i:0;s:14:"listitem_close";i:1;a:0:{}i:2;i:1975;}i:173;a:3:{i:0;s:11:"listu_close";i:1;a:0:{}i:2;i:1975;}i:174;a:3:{i:0;s:6:"p_open";i:1;a:0:{}i:2;i:1975;}i:175;a:3:{i:0;s:5:"cdata";i:1;a:1:{i:0;s:4:"
11.";}i:2;i:1976;}i:176;a:3:{i:0;s:11:"strong_open";i:1;a:0:{}i:2;i:1980;}i:177;a:3:{i:0;s:5:"cdata";i:1;a:1:{i:0;s:26:"Palestra Adriano Pascolati";}i:2;i:1982;}i:178;a:3:{i:0;s:12:"strong_close";i:1;a:0:{}i:2;i:2008;}i:179;a:3:{i:0;s:5:"cdata";i:1;a:1:{i:0;s:1:"
";}i:2;i:2010;}i:180;a:3:{i:0;s:7:"p_close";i:1;a:0:{}i:2;i:2011;}i:181;a:3:{i:0;s:10:"listu_open";i:1;a:0:{}i:2;i:2011;}i:182;a:3:{i:0;s:13:"listitem_open";i:1;a:1:{i:0;i:1;}i:2;i:2011;}i:183;a:3:{i:0;s:16:"listcontent_open";i:1;a:0:{}i:2;i:2011;}i:184;a:3:{i:0;s:5:"cdata";i:1;a:1:{i:0;s:29:" Marcada para dia 1o de abril";}i:2;i:2015;}i:185;a:3:{i:0;s:17:"listcontent_close";i:1;a:0:{}i:2;i:2044;}i:186;a:3:{i:0;s:14:"listitem_close";i:1;a:0:{}i:2;i:2044;}i:187;a:3:{i:0;s:11:"listu_close";i:1;a:0:{}i:2;i:2044;}i:188;a:3:{i:0;s:12:"document_end";i:1;a:0:{}i:2;i:2044;}}