a:103:{i:0;a:3:{i:0;s:14:"document_start";i:1;a:0:{}i:2;i:0;}i:1;a:3:{i:0;s:6:"p_open";i:1;a:0:{}i:2;i:0;}i:2;a:3:{i:0;s:7:"p_close";i:1;a:0:{}i:2;i:1;}i:3;a:3:{i:0;s:12:"section_edit";i:1;a:4:{i:0;i:-1;i:1;i:0;i:2;i:1;i:3;s:0:"";}i:2;i:1;}i:4;a:3:{i:0;s:6:"header";i:1;a:3:{i:0;s:29:"Ata da reunião de 03/05/2006";i:1;i:2;i:2;i:1;}i:2;i:1;}i:5;a:3:{i:0;s:12:"section_open";i:1;a:1:{i:0;i:2;}i:2;i:1;}i:6;a:3:{i:0;s:6:"p_open";i:1;a:0:{}i:2;i:42;}i:7;a:3:{i:0;s:5:"cdata";i:1;a:1:{i:0;s:151:"
Presentes: Alexandre, Dante, Eduardo, Estevão, Fabiano, Felipe, Gabriela, Lucas Cavalheiro, Lucas Mizusaki, Marcelo, Marcos, Nondillo, Pablo, Ricardo";}i:2;i:43;}i:8;a:3:{i:0;s:7:"p_close";i:1;a:0:{}i:2;i:194;}i:9;a:3:{i:0;s:6:"p_open";i:1;a:0:{}i:2;i:194;}i:10;a:3:{i:0;s:5:"cdata";i:1;a:1:{i:0;s:16:"Ausentes: Thiago";}i:2;i:196;}i:11;a:3:{i:0;s:7:"p_close";i:1;a:0:{}i:2;i:212;}i:12;a:3:{i:0;s:6:"p_open";i:1;a:0:{}i:2;i:212;}i:13;a:3:{i:0;s:5:"cdata";i:1;a:1:{i:0;s:18:"Relatora: Gabriela";}i:2;i:214;}i:14;a:3:{i:0;s:7:"p_close";i:1;a:0:{}i:2;i:232;}i:15;a:3:{i:0;s:13:"section_close";i:1;a:0:{}i:2;i:234;}i:16;a:3:{i:0;s:12:"section_edit";i:1;a:4:{i:0;i:1;i:1;i:233;i:2;i:2;i:3;s:29:"Ata da reunião de 03/05/2006";}i:2;i:234;}i:17;a:3:{i:0;s:6:"header";i:1;a:3:{i:0;s:23:"1)Devolução de Bolsas";i:1;i:2;i:2;i:234;}i:2;i:234;}i:18;a:3:{i:0;s:12:"section_open";i:1;a:1:{i:0;i:2;}i:2;i:234;}i:19;a:3:{i:0;s:6:"p_open";i:1;a:0:{}i:2;i:269;}i:20;a:3:{i:0;s:5:"cdata";i:1;a:1:{i:0;s:431:"
Todos receberam as bolsas corretamente, exceto o Lucas Cavalheiro que recebeu uma bolsa no valor de R$ 600 (Bolsa q Diego deveria ter recebido). Lucas concorda em devolver R$ 300 para o caixa do PET. Fabiano pergunta se Vicente deve receber valor proporcional às horas trabalhadas, no caso uma semana, ou não deve receber nada. Fica decidido que Vicente deverá devolver 3/4 da sua bolsa para o caixa do PET, no valor de R$ 225.";}i:2;i:270;}i:21;a:3:{i:0;s:7:"p_close";i:1;a:0:{}i:2;i:701;}i:22;a:3:{i:0;s:13:"section_close";i:1;a:0:{}i:2;i:703;}i:23;a:3:{i:0;s:12:"section_edit";i:1;a:4:{i:0;i:234;i:1;i:702;i:2;i:2;i:3;s:23:"1)Devolução de Bolsas";}i:2;i:703;}i:24;a:3:{i:0;s:6:"header";i:1;a:3:{i:0;s:32:"2)Proposta de Programa do ENAPET";i:1;i:2;i:2;i:703;}i:2;i:703;}i:25;a:3:{i:0;s:12:"section_open";i:1;a:1:{i:0;i:2;}i:2;i:703;}i:26;a:3:{i:0;s:6:"p_open";i:1;a:0:{}i:2;i:747;}i:27;a:3:{i:0;s:5:"cdata";i:1;a:1:{i:0;s:697:"
Dante comenta as dificuldades do encontro do ENAPET em Santa Catarina. Há uma grande mal-organização na questão de lugar, alojamento, refeição para os participantes, entre outras coisas. Dante propõe a realização de um plano de atividades para o ENAPET. Isso deve ser discutido nos Interpets. Felipe e Marcos ficam encarregados de fazer isso. Dante comenta que deve-se criar uma união entre os pets da UFRGS, inclusive o pet odontologia. Fica subentendido que, para próxima reunião, deve-se saber como está o andamento do ENAPET, para garantir um programa mínimo. Dante comenta também que pode-se discutir no Interpet alguns nomes para concorrer nas eleições do ENAPET, dizendo: ";}i:2;i:748;}i:28;a:3:{i:0;s:18:"doublequoteopening";i:1;a:0:{}i:2;i:1445;}i:29;a:3:{i:0;s:5:"cdata";i:1;a:1:{i:0;s:45:"devemos defender o trabalho dos PETs na UFRGS";}i:2;i:1446;}i:30;a:3:{i:0;s:18:"doublequoteclosing";i:1;a:0:{}i:2;i:1491;}i:31;a:3:{i:0;s:5:"cdata";i:1;a:1:{i:0;s:70:". Dante dá uma explicação geral de como está o programa do ENAPET.";}i:2;i:1492;}i:32;a:3:{i:0;s:7:"p_close";i:1;a:0:{}i:2;i:1562;}i:33;a:3:{i:0;s:13:"section_close";i:1;a:0:{}i:2;i:1564;}i:34;a:3:{i:0;s:12:"section_edit";i:1;a:4:{i:0;i:703;i:1;i:1563;i:2;i:2;i:3;s:32:"2)Proposta de Programa do ENAPET";}i:2;i:1564;}i:35;a:3:{i:0;s:6:"header";i:1;a:3:{i:0;s:18:"3)Ciclo de Debates";i:1;i:2;i:2;i:1564;}i:2;i:1564;}i:36;a:3:{i:0;s:12:"section_open";i:1;a:1:{i:0;i:2;}i:2;i:1564;}i:37;a:3:{i:0;s:6:"p_open";i:1;a:0:{}i:2;i:1594;}i:38;a:3:{i:0;s:5:"cdata";i:1;a:1:{i:0;s:516:"
Nondillo lembra que Johan não confirmou ainda sua participação no ciclo. Marcelo pergunta se a participação dos petianos no ciclo contará como horas no mês. Fabiano diz que deve-se pedir horas pendentes, as horas q forem gastas no ciclo, e que no fim do mês isso será avaliado. Marcos pergunta se Interpet conta como horas. Fabiano diz que não. Dante demonstra seu desejo que o grupo participe ativamente do ciclo e que ele deve ser bem divulgado. E os participantes do ciclo devem receber um certificado ";}i:2;i:1595;}i:39;a:3:{i:0;s:18:"doublequoteopening";i:1;a:0:{}i:2;i:2111;}i:40;a:3:{i:0;s:5:"cdata";i:1;a:1:{i:0;s:6:"bonito";}i:2;i:2112;}i:41;a:3:{i:0;s:18:"doublequoteclosing";i:1;a:0:{}i:2;i:2118;}i:42;a:3:{i:0;s:5:"cdata";i:1;a:1:{i:0;s:39:" e Pablo fica encarregado dessa tarefa.";}i:2;i:2119;}i:43;a:3:{i:0;s:7:"p_close";i:1;a:0:{}i:2;i:2158;}i:44;a:3:{i:0;s:13:"section_close";i:1;a:0:{}i:2;i:2160;}i:45;a:3:{i:0;s:12:"section_edit";i:1;a:4:{i:0;i:1564;i:1;i:2159;i:2;i:2;i:3;s:18:"3)Ciclo de Debates";}i:2;i:2160;}i:46;a:3:{i:0;s:6:"header";i:1;a:3:{i:0;s:7:"4)Museu";i:1;i:2;i:2;i:2160;}i:2;i:2160;}i:47;a:3:{i:0;s:12:"section_open";i:1;a:1:{i:0;i:2;}i:2;i:2160;}i:48;a:3:{i:0;s:6:"p_open";i:1;a:0:{}i:2;i:2179;}i:49;a:3:{i:0;s:5:"cdata";i:1;a:1:{i:0;s:696:"
Dante comenta que alguém deve fazer um press release sobre o museu, algo que chame a atenção para trazer pessoas. Lucas e Estevão se propõem a fazer isso. Perguntaram ao Dante se terão posters para o Museu. Dante diz para procurarem Jorge para fazer um orçamento. Então, feito o orçamento ele poderia negociar com a Direção. É criada uma comissão responsabilizada pelo folder do museu. Componentes: Alexandre, Ricardo, Lucas M. Estevão e Lucas falaram com a Silvane e ela disse que conseguirá 4 TVs para o Museu. Orçamento feito por Jorge foi de 15 posters, R$ 40 / cada. Com demora de 3 dias úteis para entrega. Até semana terça tem que estar decidida a questão dos posters.";}i:2;i:2180;}i:50;a:3:{i:0;s:7:"p_close";i:1;a:0:{}i:2;i:2876;}i:51;a:3:{i:0;s:13:"section_close";i:1;a:0:{}i:2;i:2878;}i:52;a:3:{i:0;s:12:"section_edit";i:1;a:4:{i:0;i:2160;i:1;i:2877;i:2;i:2;i:3;s:7:"4)Museu";}i:2;i:2878;}i:53;a:3:{i:0;s:6:"header";i:1;a:3:{i:0;s:34:"5)Tarefas do evento Portas Abertas";i:1;i:2;i:2;i:2878;}i:2;i:2878;}i:54;a:3:{i:0;s:12:"section_open";i:1;a:1:{i:0;i:2;}i:2;i:2878;}i:55;a:3:{i:0;s:6:"p_open";i:1;a:0:{}i:2;i:2924;}i:56;a:3:{i:0;s:5:"cdata";i:1;a:1:{i:0;s:213:"
Museu deverá durar dia inteiro, deve-se definir quem ficará nas bancas. Tudo ocorrerá no pŕdio novo do II. A participação de todos os petianos é obrigatória. Deve ser eleito um coordenador das atividades.";}i:2;i:2925;}i:57;a:3:{i:0;s:7:"p_close";i:1;a:0:{}i:2;i:3138;}i:58;a:3:{i:0;s:13:"section_close";i:1;a:0:{}i:2;i:3140;}i:59;a:3:{i:0;s:12:"section_edit";i:1;a:4:{i:0;i:2878;i:1;i:3139;i:2;i:2;i:3;s:34:"5)Tarefas do evento Portas Abertas";}i:2;i:3140;}i:60;a:3:{i:0;s:6:"header";i:1;a:3:{i:0;s:28:"6)Proposta de Página do PET";i:1;i:2;i:2;i:3140;}i:2;i:3140;}i:61;a:3:{i:0;s:12:"section_open";i:1;a:1:{i:0;i:2;}i:2;i:3140;}i:62;a:3:{i:0;s:6:"p_open";i:1;a:0:{}i:2;i:3180;}i:63;a:3:{i:0;s:5:"cdata";i:1;a:1:{i:0;s:332:"
Pablo quer ficar encarregado da criação e manutenção da página do PET. Pablo explica que primeiro será um projeto simples e aos poucos será melhorado. Fabiano comenta que a antiga página teve problemas com servidor e fala para Pablo mandar um e-mail para Paulo e se aprofundar no assunto. Projeto foi bem aceito pelo Grupo.";}i:2;i:3181;}i:64;a:3:{i:0;s:7:"p_close";i:1;a:0:{}i:2;i:3513;}i:65;a:3:{i:0;s:13:"section_close";i:1;a:0:{}i:2;i:3515;}i:66;a:3:{i:0;s:12:"section_edit";i:1;a:4:{i:0;i:3140;i:1;i:3514;i:2;i:2;i:3;s:28:"6)Proposta de Página do PET";}i:2;i:3515;}i:67;a:3:{i:0;s:6:"header";i:1;a:3:{i:0;s:17:"7)Camiseta do PET";i:1;i:2;i:2;i:3515;}i:2;i:3515;}i:68;a:3:{i:0;s:12:"section_open";i:1;a:1:{i:0;i:2;}i:2;i:3515;}i:69;a:3:{i:0;s:6:"p_open";i:1;a:0:{}i:2;i:3544;}i:70;a:3:{i:0;s:5:"cdata";i:1;a:1:{i:0;s:379:"
Estevão foi no lugar onde fazem as camisetas e descobriu que as camisetas com friso só tem da cor amarela/verde e é apertadinha na manga. Sem friso, a camista custa R$ 11 e demora 3 dias úteis a sua confecção. Fica decidido que a camiseta será laranja, sem friso, e com estampa na cor preta. Foi passada uma folha para anotação dos nomes e tamanho da camiseta desejado.";}i:2;i:3545;}i:71;a:3:{i:0;s:7:"p_close";i:1;a:0:{}i:2;i:3924;}i:72;a:3:{i:0;s:13:"section_close";i:1;a:0:{}i:2;i:3926;}i:73;a:3:{i:0;s:12:"section_edit";i:1;a:4:{i:0;i:3515;i:1;i:3925;i:2;i:2;i:3;s:17:"7)Camiseta do PET";}i:2;i:3926;}i:74;a:3:{i:0;s:6:"header";i:1;a:3:{i:0;s:13:"8)Certificado";i:1;i:2;i:2;i:3926;}i:2;i:3926;}i:75;a:3:{i:0;s:12:"section_open";i:1;a:1:{i:0;i:2;}i:2;i:3926;}i:76;a:3:{i:0;s:6:"p_open";i:1;a:0:{}i:2;i:3951;}i:77;a:3:{i:0;s:5:"cdata";i:1;a:1:{i:0;s:153:"
Fabiano comenta que o certificado do SulPET deve ser entregue na prograd. Estevão fica encarregado de entregar o certificado de todos os participantes.";}i:2;i:3952;}i:78;a:3:{i:0;s:7:"p_close";i:1;a:0:{}i:2;i:4105;}i:79;a:3:{i:0;s:13:"section_close";i:1;a:0:{}i:2;i:4107;}i:80;a:3:{i:0;s:12:"section_edit";i:1;a:4:{i:0;i:3926;i:1;i:4106;i:2;i:2;i:3;s:13:"8)Certificado";}i:2;i:4107;}i:81;a:3:{i:0;s:6:"header";i:1;a:3:{i:0;s:15:"9)Novo Bolsista";i:1;i:2;i:2;i:4107;}i:2;i:4107;}i:82;a:3:{i:0;s:12:"section_open";i:1;a:1:{i:0;i:2;}i:2;i:4107;}i:83;a:3:{i:0;s:6:"p_open";i:1;a:0:{}i:2;i:4134;}i:84;a:3:{i:0;s:5:"cdata";i:1;a:1:{i:0;s:330:"
Em vista da saída do Eduardo do Grupo, ficou decidido que os voluntários Gabriela e Lucas Mizusaki dividirão uma bolsa até agosto, quando provavelmente Nondillo se formará e os dois voluntários começariam a ganhar a bolsa integral. Gabriela é efetivada como nova bolsista e se compromete a dividir sua bolsa com Mizusaki.";}i:2;i:4135;}i:85;a:3:{i:0;s:7:"p_close";i:1;a:0:{}i:2;i:4465;}i:86;a:3:{i:0;s:13:"section_close";i:1;a:0:{}i:2;i:4467;}i:87;a:3:{i:0;s:12:"section_edit";i:1;a:4:{i:0;i:4107;i:1;i:4466;i:2;i:2;i:3;s:15:"9)Novo Bolsista";}i:2;i:4467;}i:88;a:3:{i:0;s:6:"header";i:1;a:3:{i:0;s:30:"10)Avaliação dos Relatórios";i:1;i:2;i:2;i:4467;}i:2;i:4467;}i:89;a:3:{i:0;s:12:"section_open";i:1;a:1:{i:0;i:2;}i:2;i:4467;}i:90;a:3:{i:0;s:6:"p_open";i:1;a:0:{}i:2;i:4509;}i:91;a:3:{i:0;s:5:"cdata";i:1;a:1:{i:0;s:348:"
Fabiano comenta que a avaliação feita na quinta foi muito construtiva e que com o tempo ela será melhorada, sendo falado mais sobre o trabalho do integrante do que sobre o relatório em si. A duração da avaliação deve ficar menor e fica claro que essa avaliação será realizada todos os meses e nesse semestre será realizada nas quintas.";}i:2;i:4510;}i:92;a:3:{i:0;s:7:"p_close";i:1;a:0:{}i:2;i:4858;}i:93;a:3:{i:0;s:13:"section_close";i:1;a:0:{}i:2;i:4860;}i:94;a:3:{i:0;s:12:"section_edit";i:1;a:4:{i:0;i:4467;i:1;i:4859;i:2;i:2;i:3;s:30:"10)Avaliação dos Relatórios";}i:2;i:4860;}i:95;a:3:{i:0;s:6:"header";i:1;a:3:{i:0;s:15:"11)Trabalho CPD";i:1;i:2;i:2;i:4860;}i:2;i:4860;}i:96;a:3:{i:0;s:12:"section_open";i:1;a:1:{i:0;i:2;}i:2;i:4860;}i:97;a:3:{i:0;s:6:"p_open";i:1;a:0:{}i:2;i:4887;}i:98;a:3:{i:0;s:5:"cdata";i:1;a:1:{i:0;s:265:"
Marcelo e Marcos comentam que querem integrar seu trabalho final de CPD ao trabalho no PET. Fala-se que todos os projetos realizados aqui no PET devem ser postos na página que será criada por Pablo. E que deve ser criada uma página para o museu da informática.";}i:2;i:4888;}i:99;a:3:{i:0;s:7:"p_close";i:1;a:0:{}i:2;i:5153;}i:100;a:3:{i:0;s:13:"section_close";i:1;a:0:{}i:2;i:5154;}i:101;a:3:{i:0;s:12:"section_edit";i:1;a:4:{i:0;i:4860;i:1;i:0;i:2;i:2;i:3;s:15:"11)Trabalho CPD";}i:2;i:5154;}i:102;a:3:{i:0;s:12:"document_end";i:1;a:0:{}i:2;i:5154;}}