a:182:{i:0;a:3:{i:0;s:14:"document_start";i:1;a:0:{}i:2;i:0;}i:1;a:3:{i:0;s:6:"p_open";i:1;a:0:{}i:2;i:0;}i:2;a:3:{i:0;s:7:"p_close";i:1;a:0:{}i:2;i:1;}i:3;a:3:{i:0;s:12:"section_edit";i:1;a:4:{i:0;i:-1;i:1;i:0;i:2;i:1;i:3;s:0:"";}i:2;i:1;}i:4;a:3:{i:0;s:6:"header";i:1;a:3:{i:0;s:29:"Ata da Reunião de 29/08/2006";i:1;i:1;i:2;i:1;}i:2;i:1;}i:5;a:3:{i:0;s:12:"section_open";i:1;a:1:{i:0;i:1;}i:2;i:1;}i:6;a:3:{i:0;s:6:"p_open";i:1;a:0:{}i:2;i:44;}i:7;a:3:{i:0;s:5:"cdata";i:1;a:1:{i:0;s:140:"
Presentes: Alexandre, Dante, Estevão, Fabiano, Felipe, Gabriela, Lucas Cavalheiro, Lucas Mizusaki, Marcelo, Marcos, Pablo, Ricardo, Thiago";}i:2;i:45;}i:8;a:3:{i:0;s:7:"p_close";i:1;a:0:{}i:2;i:185;}i:9;a:3:{i:0;s:6:"p_open";i:1;a:0:{}i:2;i:185;}i:10;a:3:{i:0;s:5:"cdata";i:1;a:1:{i:0;s:10:"Ausentes: ";}i:2;i:187;}i:11;a:3:{i:0;s:6:"entity";i:1;a:1:{i:0;s:3:"---";}i:2;i:197;}i:12;a:3:{i:0;s:6:"entity";i:1;a:1:{i:0;s:3:"---";}i:2;i:200;}i:13;a:3:{i:0;s:5:"cdata";i:1;a:1:{i:0;s:1:"-";}i:2;i:203;}i:14;a:3:{i:0;s:7:"p_close";i:1;a:0:{}i:2;i:204;}i:15;a:3:{i:0;s:6:"p_open";i:1;a:0:{}i:2;i:204;}i:16;a:3:{i:0;s:5:"cdata";i:1;a:1:{i:0;s:14:"Relator: Pablo";}i:2;i:206;}i:17;a:3:{i:0;s:7:"p_close";i:1;a:0:{}i:2;i:220;}i:18;a:3:{i:0;s:13:"section_close";i:1;a:0:{}i:2;i:222;}i:19;a:3:{i:0;s:12:"section_edit";i:1;a:4:{i:0;i:1;i:1;i:221;i:2;i:1;i:3;s:29:"Ata da Reunião de 29/08/2006";}i:2;i:222;}i:20;a:3:{i:0;s:6:"header";i:1;a:3:{i:0;s:23:"1. Curso C# da Tecnopuc";i:1;i:2;i:2;i:222;}i:2;i:222;}i:21;a:3:{i:0;s:12:"section_open";i:1;a:1:{i:0;i:2;}i:2;i:222;}i:22;a:3:{i:0;s:6:"p_open";i:1;a:0:{}i:2;i:257;}i:23;a:3:{i:0;s:5:"cdata";i:1;a:1:{i:0;s:122:"
Devido aos horários propostos para o curso, serem apenas em horário comercial, ficou proposto um curso para as férias.";}i:2;i:258;}i:24;a:3:{i:0;s:7:"p_close";i:1;a:0:{}i:2;i:380;}i:25;a:3:{i:0;s:13:"section_close";i:1;a:0:{}i:2;i:382;}i:26;a:3:{i:0;s:12:"section_edit";i:1;a:4:{i:0;i:222;i:1;i:381;i:2;i:2;i:3;s:23:"1. Curso C# da Tecnopuc";}i:2;i:382;}i:27;a:3:{i:0;s:6:"header";i:1;a:3:{i:0;s:18:"2. Estágios x PET";i:1;i:2;i:2;i:382;}i:2;i:382;}i:28;a:3:{i:0;s:12:"section_open";i:1;a:1:{i:0;i:2;}i:2;i:382;}i:29;a:3:{i:0;s:6:"p_open";i:1;a:0:{}i:2;i:412;}i:30;a:3:{i:0;s:5:"cdata";i:1;a:1:{i:0;s:67:"
Foi adiado para a próxima reunião, devido a pauta estar extensa.";}i:2;i:413;}i:31;a:3:{i:0;s:7:"p_close";i:1;a:0:{}i:2;i:480;}i:32;a:3:{i:0;s:13:"section_close";i:1;a:0:{}i:2;i:482;}i:33;a:3:{i:0;s:12:"section_edit";i:1;a:4:{i:0;i:382;i:1;i:481;i:2;i:2;i:3;s:18:"2. Estágios x PET";}i:2;i:482;}i:34;a:3:{i:0;s:6:"header";i:1;a:3:{i:0;s:43:"3. Palestra Ações Afirmativas: quem irá?";i:1;i:2;i:2;i:482;}i:2;i:482;}i:35;a:3:{i:0;s:12:"section_open";i:1;a:1:{i:0;i:2;}i:2;i:482;}i:36;a:3:{i:0;s:6:"p_open";i:1;a:0:{}i:2;i:537;}i:37;a:3:{i:0;s:5:"cdata";i:1;a:1:{i:0;s:322:"
A palestra acontecerá dia 14/09, quinta-feira, durante todo dia. Ficou decidido que o pessoal iria pensando sobre a possibilidade de ir e na próxima reunião se manifestar. Dante ressaltou da importância de irmos. Flores comenta que houve manifestações na primeira Palestra a respeito dos cartazes das cotas raciais.";}i:2;i:538;}i:38;a:3:{i:0;s:7:"p_close";i:1;a:0:{}i:2;i:860;}i:39;a:3:{i:0;s:13:"section_close";i:1;a:0:{}i:2;i:862;}i:40;a:3:{i:0;s:12:"section_edit";i:1;a:4:{i:0;i:482;i:1;i:861;i:2;i:2;i:3;s:43:"3. Palestra Ações Afirmativas: quem irá?";}i:2;i:862;}i:41;a:3:{i:0;s:6:"header";i:1;a:3:{i:0;s:39:"4. Língua Estrangeira e estudos no PET";i:1;i:2;i:2;i:862;}i:2;i:862;}i:42;a:3:{i:0;s:12:"section_open";i:1;a:1:{i:0;i:2;}i:2;i:862;}i:43;a:3:{i:0;s:6:"p_open";i:1;a:0:{}i:2;i:913;}i:44;a:3:{i:0;s:5:"cdata";i:1;a:1:{i:0;s:302:"
Thiago leu no relatório individual algo a respeito e pede para Dante comentar. Dante comenta que há 15 anos atrás os PET´s deveriam capacitar seus grupos em língua estrangeira e informática. Com o passar do tempo, foi se extinguindo. No relatório pode constar que temos bibliografia em inglês.";}i:2;i:914;}i:45;a:3:{i:0;s:7:"p_close";i:1;a:0:{}i:2;i:1216;}i:46;a:3:{i:0;s:13:"section_close";i:1;a:0:{}i:2;i:1218;}i:47;a:3:{i:0;s:12:"section_edit";i:1;a:4:{i:0;i:862;i:1;i:1217;i:2;i:2;i:3;s:39:"4. Língua Estrangeira e estudos no PET";}i:2;i:1218;}i:48;a:3:{i:0;s:6:"header";i:1;a:3:{i:0;s:21:"5. Confraternização";i:1;i:2;i:2;i:1218;}i:2;i:1218;}i:49;a:3:{i:0;s:12:"section_open";i:1;a:1:{i:0;i:2;}i:2;i:1218;}i:50;a:3:{i:0;s:6:"p_open";i:1;a:0:{}i:2;i:1251;}i:51;a:3:{i:0;s:5:"cdata";i:1;a:1:{i:0;s:335:"
Cavalheiro marcou para dia 06/07 no Planet Ball, não tinha outros horários e por isso teve que ser esse, que é véspera de feriado. Ainda comentou que é possível desmarcar porém a princípio está confirmado. Estevão falará com os franceses. Ainda comentou-se que Mizusaki verá o preço de uma churrascaria para irmos depois.";}i:2;i:1252;}i:52;a:3:{i:0;s:7:"p_close";i:1;a:0:{}i:2;i:1587;}i:53;a:3:{i:0;s:13:"section_close";i:1;a:0:{}i:2;i:1589;}i:54;a:3:{i:0;s:12:"section_edit";i:1;a:4:{i:0;i:1218;i:1;i:1588;i:2;i:2;i:3;s:21:"5. Confraternização";}i:2;i:1589;}i:55;a:3:{i:0;s:6:"header";i:1;a:3:{i:0;s:33:"6. Entrega das câmeras do André";i:1;i:2;i:2;i:1589;}i:2;i:1589;}i:56;a:3:{i:0;s:12:"section_open";i:1;a:1:{i:0;i:2;}i:2;i:1589;}i:57;a:3:{i:0;s:6:"p_open";i:1;a:0:{}i:2;i:1634;}i:58;a:3:{i:0;s:5:"cdata";i:1;a:1:{i:0;s:86:"
Cavalheiro comenta que já pode-se devolver as câmeras do André, ele as devolverá.";}i:2;i:1635;}i:59;a:3:{i:0;s:7:"p_close";i:1;a:0:{}i:2;i:1721;}i:60;a:3:{i:0;s:13:"section_close";i:1;a:0:{}i:2;i:1723;}i:61;a:3:{i:0;s:12:"section_edit";i:1;a:4:{i:0;i:1589;i:1;i:1722;i:2;i:2;i:3;s:33:"6. Entrega das câmeras do André";}i:2;i:1723;}i:62;a:3:{i:0;s:6:"header";i:1;a:3:{i:0;s:40:"7. Artigo sobre o Museu no salão da PUC";i:1;i:2;i:2;i:1723;}i:2;i:1723;}i:63;a:3:{i:0;s:12:"section_open";i:1;a:1:{i:0;i:2;}i:2;i:1723;}i:64;a:3:{i:0;s:6:"p_open";i:1;a:0:{}i:2;i:1775;}i:65;a:3:{i:0;s:5:"cdata";i:1;a:1:{i:0;s:224:"
O artigo sobre o Museu de Informática foi submetido por Cavalheiro, Flores e Zambiasi. Teve custo de 62,00 reais, comentou-se que o PET pagaria 50% do valor total. Dante, Flores e Cavalheiro pagarão 8 reais para Zambiasi.";}i:2;i:1776;}i:66;a:3:{i:0;s:7:"p_close";i:1;a:0:{}i:2;i:2000;}i:67;a:3:{i:0;s:13:"section_close";i:1;a:0:{}i:2;i:2002;}i:68;a:3:{i:0;s:12:"section_edit";i:1;a:4:{i:0;i:1723;i:1;i:2001;i:2;i:2;i:3;s:40:"7. Artigo sobre o Museu no salão da PUC";}i:2;i:2002;}i:69;a:3:{i:0;s:6:"header";i:1;a:3:{i:0;s:62:"8. Resolução das pendências do caixa PET surgidas no ENAPET";i:1;i:2;i:2;i:2002;}i:2;i:2002;}i:70;a:3:{i:0;s:12:"section_open";i:1;a:1:{i:0;i:2;}i:2;i:2002;}i:71;a:3:{i:0;s:6:"p_open";i:1;a:0:{}i:2;i:2076;}i:72;a:3:{i:0;s:5:"cdata";i:1;a:1:{i:0;s:151:"
Flores não havia depositado, por isso faltava um depósito. Será efetuado e os 20 reais serão em breve repassados por Fabiano aos membros do grupo.";}i:2;i:2077;}i:73;a:3:{i:0;s:7:"p_close";i:1;a:0:{}i:2;i:2228;}i:74;a:3:{i:0;s:13:"section_close";i:1;a:0:{}i:2;i:2230;}i:75;a:3:{i:0;s:12:"section_edit";i:1;a:4:{i:0;i:2002;i:1;i:2229;i:2;i:2;i:3;s:62:"8. Resolução das pendências do caixa PET surgidas no ENAPET";}i:2;i:2230;}i:76;a:3:{i:0;s:6:"header";i:1;a:3:{i:0;s:46:"9. Retirar cartazes de estágios na Austrália";i:1;i:2;i:2;i:2230;}i:2;i:2230;}i:77;a:3:{i:0;s:12:"section_open";i:1;a:1:{i:0;i:2;}i:2;i:2230;}i:78;a:3:{i:0;s:6:"p_open";i:1;a:0:{}i:2;i:2288;}i:79;a:3:{i:0;s:5:"cdata";i:1;a:1:{i:0;s:163:"
Dante fala para retirar os cartazes pois ainda há gente perguntando sobre isso. Ele ainda falou da idéia de criar uma pasta com todos caratazes de divulgação.";}i:2;i:2289;}i:80;a:3:{i:0;s:7:"p_close";i:1;a:0:{}i:2;i:2452;}i:81;a:3:{i:0;s:13:"section_close";i:1;a:0:{}i:2;i:2454;}i:82;a:3:{i:0;s:12:"section_edit";i:1;a:4:{i:0;i:2230;i:1;i:2453;i:2;i:2;i:3;s:46:"9. Retirar cartazes de estágios na Austrália";}i:2;i:2454;}i:83;a:3:{i:0;s:6:"header";i:1;a:3:{i:0;s:40:"10. Configuração das peças do novo PC";i:1;i:2;i:2;i:2454;}i:2;i:2454;}i:84;a:3:{i:0;s:12:"section_open";i:1;a:1:{i:0;i:2;}i:2;i:2454;}i:85;a:3:{i:0;s:6:"p_open";i:1;a:0:{}i:2;i:2506;}i:86;a:3:{i:0;s:5:"cdata";i:1;a:1:{i:0;s:153:"
Foi passado ao Fabiano o endereço de 4 empresas, porém sem site, apenas os telefones. Foi escolhido voluntários para verificar isso, Gabi e Estevão.";}i:2;i:2507;}i:87;a:3:{i:0;s:7:"p_close";i:1;a:0:{}i:2;i:2660;}i:88;a:3:{i:0;s:13:"section_close";i:1;a:0:{}i:2;i:2662;}i:89;a:3:{i:0;s:12:"section_edit";i:1;a:4:{i:0;i:2454;i:1;i:2661;i:2;i:2;i:3;s:40:"10. Configuração das peças do novo PC";}i:2;i:2662;}i:90;a:3:{i:0;s:6:"header";i:1;a:3:{i:0;s:62:"11. Avaliação do tutor pelo grupo (Comissão de Avaliação)";i:1;i:2;i:2;i:2662;}i:2;i:2662;}i:91;a:3:{i:0;s:12:"section_open";i:1;a:1:{i:0;i:2;}i:2;i:2662;}i:92;a:3:{i:0;s:6:"p_open";i:1;a:0:{}i:2;i:2736;}i:93;a:3:{i:0;s:5:"cdata";i:1;a:1:{i:0;s:57:"
Foi decidido adiarmos para o final da próxima reunião.";}i:2;i:2737;}i:94;a:3:{i:0;s:7:"p_close";i:1;a:0:{}i:2;i:2794;}i:95;a:3:{i:0;s:13:"section_close";i:1;a:0:{}i:2;i:2796;}i:96;a:3:{i:0;s:12:"section_edit";i:1;a:4:{i:0;i:2662;i:1;i:2795;i:2;i:2;i:3;s:62:"11. Avaliação do tutor pelo grupo (Comissão de Avaliação)";}i:2;i:2796;}i:97;a:3:{i:0;s:6:"header";i:1;a:3:{i:0;s:46:"12. Folha de Efetividade e Planejamento Mensal";i:1;i:2;i:2;i:2796;}i:2;i:2796;}i:98;a:3:{i:0;s:12:"section_open";i:1;a:1:{i:0;i:2;}i:2;i:2796;}i:99;a:3:{i:0;s:6:"p_open";i:1;a:0:{}i:2;i:2854;}i:100;a:3:{i:0;s:5:"cdata";i:1;a:1:{i:0;s:66:"
Flores passa a tarefa para Pablo, que agora será o responsável.";}i:2;i:2855;}i:101;a:3:{i:0;s:7:"p_close";i:1;a:0:{}i:2;i:2921;}i:102;a:3:{i:0;s:13:"section_close";i:1;a:0:{}i:2;i:2923;}i:103;a:3:{i:0;s:12:"section_edit";i:1;a:4:{i:0;i:2796;i:1;i:2922;i:2;i:2;i:3;s:46:"12. Folha de Efetividade e Planejamento Mensal";}i:2;i:2923;}i:104;a:3:{i:0;s:6:"header";i:1;a:3:{i:0;s:36:"13. Palestra da Kaisen: comentários";i:1;i:2;i:2;i:2923;}i:2;i:2923;}i:105;a:3:{i:0;s:12:"section_open";i:1;a:1:{i:0;i:2;}i:2;i:2923;}i:106;a:3:{i:0;s:6:"p_open";i:1;a:0:{}i:2;i:2971;}i:107;a:3:{i:0;s:5:"cdata";i:1;a:1:{i:0;s:151:"
Marcelo comenta que foi um sucesso, slides e exemplos foram bons. Ponto baixo foi o público, apenas 9 pessoas. Mesmo assim, o trabalho será mantido.";}i:2;i:2972;}i:108;a:3:{i:0;s:7:"p_close";i:1;a:0:{}i:2;i:3123;}i:109;a:3:{i:0;s:13:"section_close";i:1;a:0:{}i:2;i:3125;}i:110;a:3:{i:0;s:12:"section_edit";i:1;a:4:{i:0;i:2923;i:1;i:3124;i:2;i:2;i:3;s:36:"13. Palestra da Kaisen: comentários";}i:2;i:3125;}i:111;a:3:{i:0;s:6:"header";i:1;a:3:{i:0;s:12:"14. FISL 8.0";i:1;i:2;i:2;i:3125;}i:2;i:3125;}i:112;a:3:{i:0;s:12:"section_open";i:1;a:1:{i:0;i:2;}i:2;i:3125;}i:113;a:3:{i:0;s:6:"p_open";i:1;a:0:{}i:2;i:3149;}i:114;a:3:{i:0;s:5:"cdata";i:1;a:1:{i:0;s:165:"
Thiago comenta que os cartazes já estão divulgados, o fim do prazo de inscrição é Novembro. Comenta que é um ótimo lugar para publicação, o índice é 30%.";}i:2;i:3150;}i:115;a:3:{i:0;s:7:"p_close";i:1;a:0:{}i:2;i:3315;}i:116;a:3:{i:0;s:13:"section_close";i:1;a:0:{}i:2;i:3317;}i:117;a:3:{i:0;s:12:"section_edit";i:1;a:4:{i:0;i:3125;i:1;i:3316;i:2;i:2;i:3;s:12:"14. FISL 8.0";}i:2;i:3317;}i:118;a:3:{i:0;s:6:"header";i:1;a:3:{i:0;s:28:"15. Feira de Empreendimentos";i:1;i:2;i:2;i:3317;}i:2;i:3317;}i:119;a:3:{i:0;s:12:"section_open";i:1;a:1:{i:0;i:2;}i:2;i:3317;}i:120;a:3:{i:0;s:6:"p_open";i:1;a:0:{}i:2;i:3357;}i:121;a:3:{i:0;s:5:"cdata";i:1;a:1:{i:0;s:115:"
Thiago comenta que é interessante para o grupo, a visitação é de 31/08 a 03/09 no Centro de Eventos da FIERGS.";}i:2;i:3358;}i:122;a:3:{i:0;s:7:"p_close";i:1;a:0:{}i:2;i:3473;}i:123;a:3:{i:0;s:13:"section_close";i:1;a:0:{}i:2;i:3475;}i:124;a:3:{i:0;s:12:"section_edit";i:1;a:4:{i:0;i:3317;i:1;i:3474;i:2;i:2;i:3;s:28:"15. Feira de Empreendimentos";}i:2;i:3475;}i:125;a:3:{i:0;s:6:"header";i:1;a:3:{i:0;s:19:"16. Certificações";i:1;i:2;i:2;i:3475;}i:2;i:3475;}i:126;a:3:{i:0;s:12:"section_open";i:1;a:1:{i:0;i:2;}i:2;i:3475;}i:127;a:3:{i:0;s:6:"p_open";i:1;a:0:{}i:2;i:3506;}i:128;a:3:{i:0;s:5:"cdata";i:1;a:1:{i:0;s:173:"
Tiago fala que seria importante procurar certificações profissionais. Dante comenta que seria importante ter um banco de dados de ex-petianos sabendo quanto ficou no PET.";}i:2;i:3507;}i:129;a:3:{i:0;s:7:"p_close";i:1;a:0:{}i:2;i:3680;}i:130;a:3:{i:0;s:13:"section_close";i:1;a:0:{}i:2;i:3682;}i:131;a:3:{i:0;s:12:"section_edit";i:1;a:4:{i:0;i:3475;i:1;i:3681;i:2;i:2;i:3;s:19:"16. Certificações";}i:2;i:3682;}i:132;a:3:{i:0;s:6:"header";i:1;a:3:{i:0;s:10:"17. CONINF";i:1;i:2;i:2;i:3682;}i:2;i:3682;}i:133;a:3:{i:0;s:12:"section_open";i:1;a:1:{i:0;i:2;}i:2;i:3682;}i:134;a:3:{i:0;s:6:"p_open";i:1;a:0:{}i:2;i:3704;}i:135;a:3:{i:0;s:5:"cdata";i:1;a:1:{i:0;s:387:"
Dante comenta que participa, o CONINF é aberto e o grupo pode participar. Fabiano foi atrás do Johann, que disse que não tinha nada pronto porém já estava como ponto de pauta. Comentou-se sobre Fabiano ser representante dicente da ECP e ele comentou que tentou falar com Cecília, atual representante, porém não conseguiu pois ela não está comparecendo ao vale com frequência.";}i:2;i:3705;}i:136;a:3:{i:0;s:7:"p_close";i:1;a:0:{}i:2;i:4092;}i:137;a:3:{i:0;s:13:"section_close";i:1;a:0:{}i:2;i:4094;}i:138;a:3:{i:0;s:12:"section_edit";i:1;a:4:{i:0;i:3682;i:1;i:4093;i:2;i:2;i:3;s:10:"17. CONINF";}i:2;i:4094;}i:139;a:3:{i:0;s:6:"header";i:1;a:3:{i:0;s:23:"18. Salão de Extensão";i:1;i:2;i:2;i:4094;}i:2;i:4094;}i:140;a:3:{i:0;s:12:"section_open";i:1;a:1:{i:0;i:2;}i:2;i:4094;}i:141;a:3:{i:0;s:6:"p_open";i:1;a:0:{}i:2;i:4129;}i:142;a:3:{i:0;s:5:"cdata";i:1;a:1:{i:0;s:214:"
Felipe olhou o site, foi aprovado tanto o Ciclo de Debates, a ser apresentado por ele dia 27/09, como o mini-curso de Desenvolvimento Web a ser apresentado por Pablo dia 28/09, ambos terão início as 14:00 horas.";}i:2;i:4130;}i:143;a:3:{i:0;s:7:"p_close";i:1;a:0:{}i:2;i:4344;}i:144;a:3:{i:0;s:13:"section_close";i:1;a:0:{}i:2;i:4346;}i:145;a:3:{i:0;s:12:"section_edit";i:1;a:4:{i:0;i:4094;i:1;i:4345;i:2;i:2;i:3;s:23:"18. Salão de Extensão";}i:2;i:4346;}i:146;a:3:{i:0;s:6:"header";i:1;a:3:{i:0;s:59:"19. Pendências no preenchimento de atividades de extensão";i:1;i:2;i:2;i:4346;}i:2;i:4346;}i:147;a:3:{i:0;s:12:"section_open";i:1;a:1:{i:0;i:2;}i:2;i:4346;}i:148;a:3:{i:0;s:6:"p_open";i:1;a:0:{}i:2;i:4417;}i:149;a:3:{i:0;s:5:"cdata";i:1;a:1:{i:0;s:80:"
Dante comenta que é preciso verificar pendências, fala para Flores verificar.";}i:2;i:4418;}i:150;a:3:{i:0;s:7:"p_close";i:1;a:0:{}i:2;i:4498;}i:151;a:3:{i:0;s:13:"section_close";i:1;a:0:{}i:2;i:4500;}i:152;a:3:{i:0;s:12:"section_edit";i:1;a:4:{i:0;i:4346;i:1;i:4499;i:2;i:2;i:3;s:59:"19. Pendências no preenchimento de atividades de extensão";}i:2;i:4500;}i:153;a:3:{i:0;s:6:"header";i:1;a:3:{i:0;s:30:"20. Visita à Escola - ROBOEDU";i:1;i:2;i:2;i:4500;}i:2;i:4500;}i:154;a:3:{i:0;s:12:"section_open";i:1;a:1:{i:0;i:2;}i:2;i:4500;}i:155;a:3:{i:0;s:6:"p_open";i:1;a:0:{}i:2;i:4542;}i:156;a:3:{i:0;s:5:"cdata";i:1;a:1:{i:0;s:285:"
Estevão falou com Luís Otávio e o projetor dele já está emprestado. O aluguel de um custaria 50 reais. Dante vai mandar um email para Marininha para tentar conseguir um, senão o grupo alugará. Fabiano descreve brevemente como será a visita e pede para alguém levar os robôs.";}i:2;i:4543;}i:157;a:3:{i:0;s:7:"p_close";i:1;a:0:{}i:2;i:4828;}i:158;a:3:{i:0;s:13:"section_close";i:1;a:0:{}i:2;i:4830;}i:159;a:3:{i:0;s:12:"section_edit";i:1;a:4:{i:0;i:4500;i:1;i:4829;i:2;i:2;i:3;s:30:"20. Visita à Escola - ROBOEDU";}i:2;i:4830;}i:160;a:3:{i:0;s:6:"header";i:1;a:3:{i:0;s:74:"21. Encaminhamento de ressarcimento para os PET´s UFRGS - Marinha Floripa";i:1;i:2;i:2;i:4830;}i:2;i:4830;}i:161;a:3:{i:0;s:12:"section_open";i:1;a:1:{i:0;i:2;}i:2;i:4830;}i:162;a:3:{i:0;s:6:"p_open";i:1;a:0:{}i:2;i:4916;}i:163;a:3:{i:0;s:5:"cdata";i:1;a:1:{i:0;s:71:"
Fabiano receberá dinheiro da marinha e repassará sem nenhuma pressa.";}i:2;i:4917;}i:164;a:3:{i:0;s:7:"p_close";i:1;a:0:{}i:2;i:4988;}i:165;a:3:{i:0;s:13:"section_close";i:1;a:0:{}i:2;i:4990;}i:166;a:3:{i:0;s:12:"section_edit";i:1;a:4:{i:0;i:4830;i:1;i:4989;i:2;i:2;i:3;s:74:"21. Encaminhamento de ressarcimento para os PET´s UFRGS - Marinha Floripa";}i:2;i:4990;}i:167;a:3:{i:0;s:6:"header";i:1;a:3:{i:0;s:50:"22. Porto Alegre em Cena - participação do grupo";i:1;i:2;i:2;i:4990;}i:2;i:4990;}i:168;a:3:{i:0;s:12:"section_open";i:1;a:1:{i:0;i:2;}i:2;i:4990;}i:169;a:3:{i:0;s:6:"p_open";i:1;a:0:{}i:2;i:5052;}i:170;a:3:{i:0;s:5:"cdata";i:1;a:1:{i:0;s:141:"
Dante comenta que valeria a pena o grupo participar como atividade cultural e mostra o programa do Evento. Ocorrerá de 05 a 18 de setembro.";}i:2;i:5053;}i:171;a:3:{i:0;s:7:"p_close";i:1;a:0:{}i:2;i:5194;}i:172;a:3:{i:0;s:13:"section_close";i:1;a:0:{}i:2;i:5196;}i:173;a:3:{i:0;s:12:"section_edit";i:1;a:4:{i:0;i:4990;i:1;i:5195;i:2;i:2;i:3;s:50:"22. Porto Alegre em Cena - participação do grupo";}i:2;i:5196;}i:174;a:3:{i:0;s:6:"header";i:1;a:3:{i:0;s:47:"23. Audiência com a Vereadora Manuela D´Avila";i:1;i:2;i:2;i:5196;}i:2;i:5196;}i:175;a:3:{i:0;s:12:"section_open";i:1;a:1:{i:0;i:2;}i:2;i:5196;}i:176;a:3:{i:0;s:6:"p_open";i:1;a:0:{}i:2;i:5255;}i:177;a:3:{i:0;s:5:"cdata";i:1;a:1:{i:0;s:218:"
Dante conseguiu audiência para falar sobre o Museu de Informática e convoca os membros do grupo experts no Museu a participar. Dante sairá as 15:15 horas do II, quarta-feira, dia 06/09, e levará Zambiasi e Flores.";}i:2;i:5256;}i:178;a:3:{i:0;s:7:"p_close";i:1;a:0:{}i:2;i:5474;}i:179;a:3:{i:0;s:13:"section_close";i:1;a:0:{}i:2;i:5475;}i:180;a:3:{i:0;s:12:"section_edit";i:1;a:4:{i:0;i:5196;i:1;i:0;i:2;i:2;i:3;s:47:"23. Audiência com a Vereadora Manuela D´Avila";}i:2;i:5475;}i:181;a:3:{i:0;s:12:"document_end";i:1;a:0:{}i:2;i:5475;}}