a:153:{i:0;a:3:{i:0;s:14:"document_start";i:1;a:0:{}i:2;i:0;}i:1;a:3:{i:0;s:6:"p_open";i:1;a:0:{}i:2;i:0;}i:2;a:3:{i:0;s:7:"p_close";i:1;a:0:{}i:2;i:1;}i:3;a:3:{i:0;s:12:"section_edit";i:1;a:4:{i:0;i:-1;i:1;i:0;i:2;i:1;i:3;s:0:"";}i:2;i:1;}i:4;a:3:{i:0;s:6:"header";i:1;a:3:{i:0;s:29:"Ata da reunião de 03/10/2006";i:1;i:1;i:2;i:1;}i:2;i:1;}i:5;a:3:{i:0;s:12:"section_open";i:1;a:1:{i:0;i:1;}i:2;i:1;}i:6;a:3:{i:0;s:6:"p_open";i:1;a:0:{}i:2;i:44;}i:7;a:3:{i:0;s:5:"cdata";i:1;a:1:{i:0;s:1:"
";}i:2;i:45;}i:8;a:3:{i:0;s:11:"strong_open";i:1;a:0:{}i:2;i:46;}i:9;a:3:{i:0;s:5:"cdata";i:1;a:1:{i:0;s:11:"Presentes: ";}i:2;i:48;}i:10;a:3:{i:0;s:12:"strong_close";i:1;a:0:{}i:2;i:59;}i:11;a:3:{i:0;s:5:"cdata";i:1;a:1:{i:0;s:198:"Alexandre, Fabiano, Felipe, Gabriela, Lucas Cavalheiro, Lucas Mizusaki, Marcelo (sai na metade da reunião sem justificativa válida), Marcos (atraso de 35 min devido ao curso de C), Pablo, Ricardo.";}i:2;i:61;}i:12;a:3:{i:0;s:7:"p_close";i:1;a:0:{}i:2;i:259;}i:13;a:3:{i:0;s:6:"p_open";i:1;a:0:{}i:2;i:259;}i:14;a:3:{i:0;s:11:"strong_open";i:1;a:0:{}i:2;i:261;}i:15;a:3:{i:0;s:5:"cdata";i:1;a:1:{i:0;s:23:"Ausência Justificada: ";}i:2;i:263;}i:16;a:3:{i:0;s:12:"strong_close";i:1;a:0:{}i:2;i:286;}i:17;a:3:{i:0;s:5:"cdata";i:1;a:1:{i:0;s:42:"Dante (em Brasília) e Thiago (Curso de C)";}i:2;i:288;}i:18;a:3:{i:0;s:7:"p_close";i:1;a:0:{}i:2;i:330;}i:19;a:3:{i:0;s:6:"p_open";i:1;a:0:{}i:2;i:330;}i:20;a:3:{i:0;s:11:"strong_open";i:1;a:0:{}i:2;i:332;}i:21;a:3:{i:0;s:5:"cdata";i:1;a:1:{i:0;s:9:"Relator: ";}i:2;i:334;}i:22;a:3:{i:0;s:12:"strong_close";i:1;a:0:{}i:2;i:343;}i:23;a:3:{i:0;s:5:"cdata";i:1;a:1:{i:0;s:7:"Felipe.";}i:2;i:345;}i:24;a:3:{i:0;s:7:"p_close";i:1;a:0:{}i:2;i:352;}i:25;a:3:{i:0;s:13:"section_close";i:1;a:0:{}i:2;i:354;}i:26;a:3:{i:0;s:12:"section_edit";i:1;a:4:{i:0;i:1;i:1;i:353;i:2;i:1;i:3;s:29:"Ata da reunião de 03/10/2006";}i:2;i:354;}i:27;a:3:{i:0;s:6:"header";i:1;a:3:{i:0;s:52:"1) Comissão de Organização do Aniversário do PET";i:1;i:3;i:2;i:354;}i:2;i:354;}i:28;a:3:{i:0;s:12:"section_open";i:1;a:1:{i:0;i:3;}i:2;i:354;}i:29;a:3:{i:0;s:6:"p_open";i:1;a:0:{}i:2;i:416;}i:30;a:3:{i:0;s:5:"cdata";i:1;a:1:{i:0;s:334:"
Ninguém se interessou, a princípio, em se juntar a Marcos na Comissão de Organização do Aniversário do PET. Na próxima semana, com o Dante e Thiago presentes, será tomada a decisão final. Foram discutidas algumas idéias, como trazer uma peça de teatro, um show, ou fazer uma sessão de algum filme (como o “The Wall”).";}i:2;i:417;}i:31;a:3:{i:0;s:7:"p_close";i:1;a:0:{}i:2;i:751;}i:32;a:3:{i:0;s:13:"section_close";i:1;a:0:{}i:2;i:753;}i:33;a:3:{i:0;s:12:"section_edit";i:1;a:4:{i:0;i:354;i:1;i:752;i:2;i:3;i:3;s:52:"1) Comissão de Organização do Aniversário do PET";}i:2;i:753;}i:34;a:3:{i:0;s:6:"header";i:1;a:3:{i:0;s:76:"2) Data de apresentação da avaliação tutor pelo grupo e grupo pelo tutor";i:1;i:3;i:2;i:753;}i:2;i:753;}i:35;a:3:{i:0;s:12:"section_open";i:1;a:1:{i:0;i:3;}i:2;i:753;}i:36;a:3:{i:0;s:6:"p_open";i:1;a:0:{}i:2;i:839;}i:37;a:3:{i:0;s:5:"cdata";i:1;a:1:{i:0;s:118:"
Será feita na reunião do dia 17 de outubro, quando Dante estará presente e não haverá reunião do RoboEDU no dia";}i:2;i:840;}i:38;a:3:{i:0;s:7:"p_close";i:1;a:0:{}i:2;i:958;}i:39;a:3:{i:0;s:13:"section_close";i:1;a:0:{}i:2;i:960;}i:40;a:3:{i:0;s:12:"section_edit";i:1;a:4:{i:0;i:753;i:1;i:959;i:2;i:3;i:3;s:76:"2) Data de apresentação da avaliação tutor pelo grupo e grupo pelo tutor";}i:2;i:960;}i:41;a:3:{i:0;s:6:"header";i:1;a:3:{i:0;s:28:"3) Relato do InterPET Odonto";i:1;i:3;i:2;i:960;}i:2;i:960;}i:42;a:3:{i:0;s:12:"section_open";i:1;a:1:{i:0;i:3;}i:2;i:960;}i:43;a:3:{i:0;s:6:"p_open";i:1;a:0:{}i:2;i:998;}i:44;a:3:{i:0;s:5:"cdata";i:1;a:1:{i:0;s:196:"
Felipe relata como o que foi discutido na reunião do último InterPET, dia 27/09, no qual foi o representante da Computação. Três grupos não estiveram presentes (Sociais, Geografia e Psico).";}i:2;i:999;}i:45;a:3:{i:0;s:7:"p_close";i:1;a:0:{}i:2;i:1195;}i:46;a:3:{i:0;s:13:"section_close";i:1;a:0:{}i:2;i:1197;}i:47;a:3:{i:0;s:6:"header";i:1;a:3:{i:0;s:26:"3.1) Salão de Graduação";i:1;i:4;i:2;i:1197;}i:2;i:1197;}i:48;a:3:{i:0;s:12:"section_open";i:1;a:1:{i:0;i:4;}i:2;i:1197;}i:49;a:3:{i:0;s:10:"quote_open";i:1;a:0:{}i:2;i:1232;}i:50;a:3:{i:0;s:5:"cdata";i:1;a:1:{i:0;s:498:" Todos grupos PET da UFRGS serão obrigados a participar. Pela manhã, haverá uma mesa-redonda com a Profa. Iguatemy. À tarde, terá, primeiramente, uma apresentação de todos grupos PET da UFRGS dos pontos comuns a todos, que, a princípio será apresentada por um cara da geografia. Após, cada grupo terá 15 min para falar de um projeto seu de pesquisa, ensino e extensão. Foi realizado um sorteio e o Pet Computação será o último a se apresentar. Não se sabe ainda se haverá posters.";}i:2;i:1234;}i:51;a:3:{i:0;s:11:"quote_close";i:1;a:0:{}i:2;i:1732;}i:52;a:3:{i:0;s:13:"section_close";i:1;a:0:{}i:2;i:1734;}i:53;a:3:{i:0;s:6:"header";i:1;a:3:{i:0;s:17:"3.2) Planejamento";i:1;i:4;i:2;i:1734;}i:2;i:1734;}i:54;a:3:{i:0;s:12:"section_open";i:1;a:1:{i:0;i:4;}i:2;i:1734;}i:55;a:3:{i:0;s:10:"quote_open";i:1;a:0:{}i:2;i:1760;}i:56;a:3:{i:0;s:5:"cdata";i:1;a:1:{i:0;s:220:" Também foi falado na reunião que os grupos PET deverão fazer excepcionalmente este ano um planejamento relativo ao período de 1° de setembro à 31 de dezembro, no molde antigo. Pablo fica responsável por fazê-lo.";}i:2;i:1762;}i:57;a:3:{i:0;s:11:"quote_close";i:1;a:0:{}i:2;i:1982;}i:58;a:3:{i:0;s:13:"section_close";i:1;a:0:{}i:2;i:1984;}i:59;a:3:{i:0;s:6:"header";i:1;a:3:{i:0;s:27:"3.3) Representante InterPET";i:1;i:4;i:2;i:1984;}i:2;i:1984;}i:60;a:3:{i:0;s:12:"section_open";i:1;a:1:{i:0;i:4;}i:2;i:1984;}i:61;a:3:{i:0;s:10:"quote_open";i:1;a:0:{}i:2;i:2020;}i:62;a:3:{i:0;s:5:"cdata";i:1;a:1:{i:0;s:266:" Devido à saída de Cavalheiro do grupo, um novo petiano deve ser escolhido para ser o representante da computação nos interpets, além de Felipe. O escolhido foi Marcelo. Ambos já irão no próximo interpet, a ser realizado dia 10 de outubro, às 19:30 na ESEF.";}i:2;i:2022;}i:63;a:3:{i:0;s:11:"quote_close";i:1;a:0:{}i:2;i:2288;}i:64;a:3:{i:0;s:13:"section_close";i:1;a:0:{}i:2;i:2290;}i:65;a:3:{i:0;s:12:"section_edit";i:1;a:4:{i:0;i:960;i:1;i:2289;i:2;i:3;i:3;s:28:"3) Relato do InterPET Odonto";}i:2;i:2290;}i:66;a:3:{i:0;s:6:"header";i:1;a:3:{i:0;s:24:"4) Palestra da seleção";i:1;i:3;i:2;i:2290;}i:2;i:2290;}i:67;a:3:{i:0;s:12:"section_open";i:1;a:1:{i:0;i:3;}i:2;i:2290;}i:68;a:3:{i:0;s:6:"p_open";i:1;a:0:{}i:2;i:2324;}i:69;a:3:{i:0;s:5:"cdata";i:1;a:1:{i:0;s:360:"
Alexandre, Felipe e Marcelo comentam como foi a palestra dada para os interessados em ingressar no grupo PET, ocorrida sexta-feira (29/09) para 11 alunos. Eles dizem que acharam muito positiva e que, após a palestra, mostraram a sala do PET, o LRI e o museu. Alexandre e Felipe ficam encarregados de mandar um último e-mail à graduação sobre a seleção.";}i:2;i:2325;}i:70;a:3:{i:0;s:7:"p_close";i:1;a:0:{}i:2;i:2685;}i:71;a:3:{i:0;s:13:"section_close";i:1;a:0:{}i:2;i:2687;}i:72;a:3:{i:0;s:12:"section_edit";i:1;a:4:{i:0;i:2290;i:1;i:2686;i:2;i:3;i:3;s:24:"4) Palestra da seleção";}i:2;i:2687;}i:73;a:3:{i:0;s:6:"header";i:1;a:3:{i:0;s:33:"5) Curso de C – Escola Técnica";i:1;i:3;i:2;i:2687;}i:2;i:2687;}i:74;a:3:{i:0;s:12:"section_open";i:1;a:1:{i:0;i:3;}i:2;i:2687;}i:75;a:3:{i:0;s:6:"p_open";i:1;a:0:{}i:2;i:2730;}i:76;a:3:{i:0;s:5:"cdata";i:1;a:1:{i:0;s:376:"
Felipe comenta que já conversa com a professora da escola técnica indicada por Dante em relação ao curso de C a ser dado na escola técnica. A princípio, seriam 5 encontros em quintas à noite, que daria um total de 8h e 40min, fazendo com que tivesse que ser diminuída a carga horária do curso. Felipe, Marcos, Thiago e Dante falarão entre si par aver mais detalhes.";}i:2;i:2731;}i:77;a:3:{i:0;s:7:"p_close";i:1;a:0:{}i:2;i:3107;}i:78;a:3:{i:0;s:13:"section_close";i:1;a:0:{}i:2;i:3109;}i:79;a:3:{i:0;s:12:"section_edit";i:1;a:4:{i:0;i:2687;i:1;i:3108;i:2;i:3;i:3;s:33:"5) Curso de C – Escola Técnica";}i:2;i:3109;}i:80;a:3:{i:0;s:6:"header";i:1;a:3:{i:0;s:31:"6) Curso de C – Recibo Kátia";i:1;i:3;i:2;i:3109;}i:2;i:3109;}i:81;a:3:{i:0;s:12:"section_open";i:1;a:1:{i:0;i:3;}i:2;i:3109;}i:82;a:3:{i:0;s:6:"p_open";i:1;a:0:{}i:2;i:3150;}i:83;a:3:{i:0;s:5:"cdata";i:1;a:1:{i:0;s:92:"
Fabiano procurará um carimbo do PET para por no recibo. Felipe e Marcos o confeccionarão.";}i:2;i:3151;}i:84;a:3:{i:0;s:7:"p_close";i:1;a:0:{}i:2;i:3243;}i:85;a:3:{i:0;s:13:"section_close";i:1;a:0:{}i:2;i:3245;}i:86;a:3:{i:0;s:12:"section_edit";i:1;a:4:{i:0;i:3109;i:1;i:3244;i:2;i:3;i:3;s:31:"6) Curso de C – Recibo Kátia";}i:2;i:3245;}i:87;a:3:{i:0;s:6:"header";i:1;a:3:{i:0;s:22:"7) Salão de Extensão";i:1;i:3;i:2;i:3245;}i:2;i:3245;}i:88;a:3:{i:0;s:12:"section_open";i:1;a:1:{i:0;i:3;}i:2;i:3245;}i:89;a:3:{i:0;s:6:"p_open";i:1;a:0:{}i:2;i:3277;}i:90;a:3:{i:0;s:5:"cdata";i:1;a:1:{i:0;s:132:"
Felipe e Pablo contam como foram as suas apresentações no Salão de Extensão ocorrido na semana anterior. Pablo deu um curso de ";}i:2;i:3278;}i:91;a:3:{i:0;s:7:"acronym";i:1;a:1:{i:0;s:4:"HTML";}i:2;i:3410;}i:92;a:3:{i:0;s:5:"cdata";i:1;a:1:{i:0;s:531:" e conta que foi bom, mas que havia alguns que não tinham quase familiaridade com computação e, então, o curso teve que ser mais lento do que desejava. Felipe fez um Pôster e apresentou uma Comunicação Oral sobre o Ciclo de Debates – O Ensino de Graduação em Computação. Ele conta que foi muito interesante, a apresentação foi boa, só que o Dante só chegou no final de sua apresentação, devido a um desencontro de horários. Felipe comenta que a experiência de apresentar trabalhos em eventos é muito positiva.";}i:2;i:3414;}i:93;a:3:{i:0;s:7:"p_close";i:1;a:0:{}i:2;i:3945;}i:94;a:3:{i:0;s:13:"section_close";i:1;a:0:{}i:2;i:3947;}i:95;a:3:{i:0;s:12:"section_edit";i:1;a:4:{i:0;i:3245;i:1;i:3946;i:2;i:3;i:3;s:22:"7) Salão de Extensão";}i:2;i:3947;}i:96;a:3:{i:0;s:6:"header";i:1;a:3:{i:0;s:10:"8) RoboEDU";i:1;i:3;i:2;i:3947;}i:2;i:3947;}i:97;a:3:{i:0;s:12:"section_open";i:1;a:1:{i:0;i:3;}i:2;i:3947;}i:98;a:3:{i:0;s:13:"section_close";i:1;a:0:{}i:2;i:3969;}i:99;a:3:{i:0;s:6:"header";i:1;a:3:{i:0;s:65:"8.1) Devolução das câmeras da techrobot e busca de outro robô";i:1;i:4;i:2;i:3969;}i:2;i:3969;}i:100;a:3:{i:0;s:12:"section_open";i:1;a:1:{i:0;i:4;}i:2;i:3969;}i:101;a:3:{i:0;s:6:"p_open";i:1;a:0:{}i:2;i:4042;}i:102;a:3:{i:0;s:5:"cdata";i:1;a:1:{i:0;s:154:"
Fabiano comenta que as câmeras serão devolvidas para André da Techrobot. Também diz que Itamir está com um robô, que deverá ser pego por Gabriela.";}i:2;i:4043;}i:103;a:3:{i:0;s:7:"p_close";i:1;a:0:{}i:2;i:4197;}i:104;a:3:{i:0;s:13:"section_close";i:1;a:0:{}i:2;i:4199;}i:105;a:3:{i:0;s:6:"header";i:1;a:3:{i:0;s:46:"8.2) Apresentação no Tubino na sexta passada";i:1;i:4;i:2;i:4199;}i:2;i:4199;}i:106;a:3:{i:0;s:12:"section_open";i:1;a:1:{i:0;i:4;}i:2;i:4199;}i:107;a:3:{i:0;s:6:"p_open";i:1;a:0:{}i:2;i:4253;}i:108;a:3:{i:0;s:5:"cdata";i:1;a:1:{i:0;s:194:"
Alexandre, Fabiano, Lucas Mizusaki, Lucas Cavalheiro e Ricardo comentam como estava a apresentação no Tubino na sexta anterior, que foi boa e teve 10 presentes que fizeram bastante perguntas.";}i:2;i:4254;}i:109;a:3:{i:0;s:7:"p_close";i:1;a:0:{}i:2;i:4448;}i:110;a:3:{i:0;s:13:"section_close";i:1;a:0:{}i:2;i:4450;}i:111;a:3:{i:0;s:6:"header";i:1;a:3:{i:0;s:20:"8.3) Gravador de PIC";i:1;i:4;i:2;i:4450;}i:2;i:4450;}i:112;a:3:{i:0;s:12:"section_open";i:1;a:1:{i:0;i:4;}i:2;i:4450;}i:113;a:3:{i:0;s:6:"p_open";i:1;a:0:{}i:2;i:4478;}i:114;a:3:{i:0;s:5:"cdata";i:1;a:1:{i:0;s:231:"
Gabriela viu no centro os preços de gravadores, todos muito caros. Fabiano viu alguns bons e baratos no mercado livre. Todos devem ver e votar no que acham melhor. Pablo comprará com sua conta no mercado livre após a votação.";}i:2;i:4479;}i:115;a:3:{i:0;s:7:"p_close";i:1;a:0:{}i:2;i:4710;}i:116;a:3:{i:0;s:13:"section_close";i:1;a:0:{}i:2;i:4712;}i:117;a:3:{i:0;s:6:"header";i:1;a:3:{i:0;s:20:"8.4) Trava Elétrica";i:1;i:4;i:2;i:4712;}i:2;i:4712;}i:118;a:3:{i:0;s:12:"section_open";i:1;a:1:{i:0;i:4;}i:2;i:4712;}i:119;a:3:{i:0;s:6:"p_open";i:1;a:0:{}i:2;i:4740;}i:120;a:3:{i:0;s:5:"cdata";i:1;a:1:{i:0;s:94:"
Alexandre, Gariela, Lucas Mizusaki e Ricardo relatam como foi os testes com a trava elétrica";}i:2;i:4741;}i:121;a:3:{i:0;s:7:"p_close";i:1;a:0:{}i:2;i:4835;}i:122;a:3:{i:0;s:13:"section_close";i:1;a:0:{}i:2;i:4837;}i:123;a:3:{i:0;s:12:"section_edit";i:1;a:4:{i:0;i:3947;i:1;i:4836;i:2;i:3;i:3;s:10:"8) RoboEDU";}i:2;i:4837;}i:124;a:3:{i:0;s:6:"header";i:1;a:3:{i:0;s:23:"9) Pendências de Caixa";i:1;i:3;i:2;i:4837;}i:2;i:4837;}i:125;a:3:{i:0;s:12:"section_open";i:1;a:1:{i:0;i:3;}i:2;i:4837;}i:126;a:3:{i:0;s:6:"p_open";i:1;a:0:{}i:2;i:4870;}i:127;a:3:{i:0;s:5:"cdata";i:1;a:1:{i:0;s:326:"
Fabiano comenta que, quando alguém comprar alguma coisa para o Pet, pode apresentar a nota fiscal a ele (tesoureiro) para o ressarcimento. Felipe comenta sobre quanto da bolsa de Estevão deve ser devolvida. Ele fica encarregado de olhar o logador e ver o quanto ele trabalhou para, na semana seguinte, tomar-se uma decisão";}i:2;i:4871;}i:128;a:3:{i:0;s:7:"p_close";i:1;a:0:{}i:2;i:5197;}i:129;a:3:{i:0;s:13:"section_close";i:1;a:0:{}i:2;i:5199;}i:130;a:3:{i:0;s:12:"section_edit";i:1;a:4:{i:0;i:4837;i:1;i:5198;i:2;i:3;i:3;s:23:"9) Pendências de Caixa";}i:2;i:5199;}i:131;a:3:{i:0;s:6:"header";i:1;a:3:{i:0;s:10:"10) Pet-br";i:1;i:3;i:2;i:5199;}i:2;i:5199;}i:132;a:3:{i:0;s:12:"section_open";i:1;a:1:{i:0;i:3;}i:2;i:5199;}i:133;a:3:{i:0;s:6:"p_open";i:1;a:0:{}i:2;i:5219;}i:134;a:3:{i:0;s:5:"cdata";i:1;a:1:{i:0;s:210:"
Felipe comenta que até agora Estevão não conseguiu cadastrar o e-mail na lista pet-br por diversos motivos. Assim, como ele está saindo, alguém deve ficar responsável por isso. Marcos assume essa tarefa.";}i:2;i:5220;}i:135;a:3:{i:0;s:7:"p_close";i:1;a:0:{}i:2;i:5430;}i:136;a:3:{i:0;s:13:"section_close";i:1;a:0:{}i:2;i:5432;}i:137;a:3:{i:0;s:12:"section_edit";i:1;a:4:{i:0;i:5199;i:1;i:5431;i:2;i:3;i:3;s:10:"10) Pet-br";}i:2;i:5432;}i:138;a:3:{i:0;s:6:"header";i:1;a:3:{i:0;s:35:"11) Histórico de relatores de Atas";i:1;i:3;i:2;i:5432;}i:2;i:5432;}i:139;a:3:{i:0;s:12:"section_open";i:1;a:1:{i:0;i:3;}i:2;i:5432;}i:140;a:3:{i:0;s:6:"p_open";i:1;a:0:{}i:2;i:5477;}i:141;a:3:{i:0;s:5:"cdata";i:1;a:1:{i:0;s:168:"
Felipe lembra que todo petiano que fizer a ata deve colocar isso no link do histórico de relatores de atas no Trac, pois, nas últimas três atas, isso não foi feito";}i:2;i:5478;}i:142;a:3:{i:0;s:7:"p_close";i:1;a:0:{}i:2;i:5646;}i:143;a:3:{i:0;s:13:"section_close";i:1;a:0:{}i:2;i:5648;}i:144;a:3:{i:0;s:12:"section_edit";i:1;a:4:{i:0;i:5432;i:1;i:5647;i:2;i:3;i:3;s:35:"11) Histórico de relatores de Atas";}i:2;i:5648;}i:145;a:3:{i:0;s:6:"header";i:1;a:3:{i:0;s:39:"12) Seminário sobre Fotografia Digital";i:1;i:3;i:2;i:5648;}i:2;i:5648;}i:146;a:3:{i:0;s:12:"section_open";i:1;a:1:{i:0;i:3;}i:2;i:5648;}i:147;a:3:{i:0;s:6:"p_open";i:1;a:0:{}i:2;i:5697;}i:148;a:3:{i:0;s:5:"cdata";i:1;a:1:{i:0;s:149:"
Lucas Cavalheiro apresenta um interessante seminário sobre Fotografia Digital, assistido por todos petianos presentes, que também fazem perguntas.";}i:2;i:5698;}i:149;a:3:{i:0;s:7:"p_close";i:1;a:0:{}i:2;i:5847;}i:150;a:3:{i:0;s:13:"section_close";i:1;a:0:{}i:2;i:5848;}i:151;a:3:{i:0;s:12:"section_edit";i:1;a:4:{i:0;i:5648;i:1;i:0;i:2;i:3;i:3;s:39:"12) Seminário sobre Fotografia Digital";}i:2;i:5848;}i:152;a:3:{i:0;s:12:"document_end";i:1;a:0:{}i:2;i:5848;}}