a:167:{i:0;a:3:{i:0;s:14:"document_start";i:1;a:0:{}i:2;i:0;}i:1;a:3:{i:0;s:6:"p_open";i:1;a:0:{}i:2;i:0;}i:2;a:3:{i:0;s:7:"p_close";i:1;a:0:{}i:2;i:1;}i:3;a:3:{i:0;s:12:"section_edit";i:1;a:4:{i:0;i:-1;i:1;i:0;i:2;i:1;i:3;s:0:"";}i:2;i:1;}i:4;a:3:{i:0;s:6:"header";i:1;a:3:{i:0;s:29:"Ata da Reunião de 02/03/2006";i:1;i:1;i:2;i:1;}i:2;i:1;}i:5;a:3:{i:0;s:12:"section_open";i:1;a:1:{i:0;i:1;}i:2;i:1;}i:6;a:3:{i:0;s:6:"p_open";i:1;a:0:{}i:2;i:44;}i:7;a:3:{i:0;s:5:"cdata";i:1;a:1:{i:0;s:92:"
Presentes: Dante, Diego, Estevão, Fabiano, Felipe, Marcos, Nondillo, Paulo, Robert, Thiago";}i:2;i:45;}i:8;a:3:{i:0;s:7:"p_close";i:1;a:0:{}i:2;i:137;}i:9;a:3:{i:0;s:6:"p_open";i:1;a:0:{}i:2;i:137;}i:10;a:3:{i:0;s:5:"cdata";i:1;a:1:{i:0;s:33:"Ausentes: Gustavo, Paula, Vicente";}i:2;i:139;}i:11;a:3:{i:0;s:7:"p_close";i:1;a:0:{}i:2;i:172;}i:12;a:3:{i:0;s:6:"p_open";i:1;a:0:{}i:2;i:172;}i:13;a:3:{i:0;s:5:"cdata";i:1;a:1:{i:0;s:15:"Relator: Felipe";}i:2;i:174;}i:14;a:3:{i:0;s:7:"p_close";i:1;a:0:{}i:2;i:189;}i:15;a:3:{i:0;s:6:"p_open";i:1;a:0:{}i:2;i:189;}i:16;a:3:{i:0;s:5:"cdata";i:1;a:1:{i:0;s:109:"Ps: Esta é a minha primeira Ata, qualquer erro que houver ou assunto que estiver faltando, é só me avisar.";}i:2;i:191;}i:17;a:3:{i:0;s:7:"p_close";i:1;a:0:{}i:2;i:300;}i:18;a:3:{i:0;s:13:"section_close";i:1;a:0:{}i:2;i:302;}i:19;a:3:{i:0;s:12:"section_edit";i:1;a:4:{i:0;i:1;i:1;i:301;i:2;i:1;i:3;s:29:"Ata da Reunião de 02/03/2006";}i:2;i:302;}i:20;a:3:{i:0;s:6:"header";i:1;a:3:{i:0;s:25:"1. Horário das Reuniões";i:1;i:2;i:2;i:302;}i:2;i:302;}i:21;a:3:{i:0;s:12:"section_open";i:1;a:1:{i:0;i:2;}i:2;i:302;}i:22;a:3:{i:0;s:6:"p_open";i:1;a:0:{}i:2;i:339;}i:23;a:3:{i:0;s:5:"cdata";i:1;a:1:{i:0;s:162:"
Ficou decidido que o horário provisório das reuniões será quarta-feira às 16:00. Quando entrarem os novos petianos, em abril, veremos o horário permanente.";}i:2;i:340;}i:24;a:3:{i:0;s:7:"p_close";i:1;a:0:{}i:2;i:502;}i:25;a:3:{i:0;s:13:"section_close";i:1;a:0:{}i:2;i:504;}i:26;a:3:{i:0;s:12:"section_edit";i:1;a:4:{i:0;i:302;i:1;i:503;i:2;i:2;i:3;s:25:"1. Horário das Reuniões";}i:2;i:504;}i:27;a:3:{i:0;s:6:"header";i:1;a:3:{i:0;s:21:"2. Saída de petianos";i:1;i:2;i:2;i:504;}i:2;i:504;}i:28;a:3:{i:0;s:12:"section_open";i:1;a:1:{i:0;i:2;}i:2;i:504;}i:29;a:3:{i:0;s:6:"p_open";i:1;a:0:{}i:2;i:537;}i:30;a:3:{i:0;s:5:"cdata";i:1;a:1:{i:0;s:359:"
Foi discutido o assunto da saída de vários petianos que estão deixando o grupo recentemente. Foi lembrado que a idéia do PET é que o aluno fique até o fim do curso e que devemos ter esse comprometiemnto. Foi falado também que o mínimo aceitável é que o petiano permaneça 1 ano no grupo. Isso tudo deve ser dito para os novos petianos na seleção.";}i:2;i:538;}i:31;a:3:{i:0;s:7:"p_close";i:1;a:0:{}i:2;i:897;}i:32;a:3:{i:0;s:13:"section_close";i:1;a:0:{}i:2;i:899;}i:33;a:3:{i:0;s:12:"section_edit";i:1;a:4:{i:0;i:504;i:1;i:898;i:2;i:2;i:3;s:21:"2. Saída de petianos";}i:2;i:899;}i:34;a:3:{i:0;s:6:"header";i:1;a:3:{i:0;s:19:"3. Estágio x Bolsa";i:1;i:2;i:2;i:899;}i:2;i:899;}i:35;a:3:{i:0;s:12:"section_open";i:1;a:1:{i:0;i:2;}i:2;i:899;}i:36;a:3:{i:0;s:6:"p_open";i:1;a:0:{}i:2;i:930;}i:37;a:3:{i:0;s:5:"cdata";i:1;a:1:{i:0;s:129:"
Foi falado que é permitido conciliar um estágio com a bolsa do PET, mas que para isso o aluno deve ter grande comprometimento.";}i:2;i:931;}i:38;a:3:{i:0;s:7:"p_close";i:1;a:0:{}i:2;i:1060;}i:39;a:3:{i:0;s:13:"section_close";i:1;a:0:{}i:2;i:1062;}i:40;a:3:{i:0;s:12:"section_edit";i:1;a:4:{i:0;i:899;i:1;i:1061;i:2;i:2;i:3;s:19:"3. Estágio x Bolsa";}i:2;i:1062;}i:41;a:3:{i:0;s:6:"header";i:1;a:3:{i:0;s:26:"4. Manual de Orientações";i:1;i:2;i:2;i:1062;}i:2;i:1062;}i:42;a:3:{i:0;s:12:"section_open";i:1;a:1:{i:0;i:2;}i:2;i:1062;}i:43;a:3:{i:0;s:6:"p_open";i:1;a:0:{}i:2;i:1100;}i:44;a:3:{i:0;s:5:"cdata";i:1;a:1:{i:0;s:99:"
Foi apresentado a todos o manual de orientações básicas do PET, o qual está para ser aprovado.";}i:2;i:1101;}i:45;a:3:{i:0;s:7:"p_close";i:1;a:0:{}i:2;i:1200;}i:46;a:3:{i:0;s:13:"section_close";i:1;a:0:{}i:2;i:1202;}i:47;a:3:{i:0;s:12:"section_edit";i:1;a:4:{i:0;i:1062;i:1;i:1201;i:2;i:2;i:3;s:26:"4. Manual de Orientações";}i:2;i:1202;}i:48;a:3:{i:0;s:6:"header";i:1;a:3:{i:0;s:22:"5. Eleição do líder";i:1;i:2;i:2;i:1202;}i:2;i:1202;}i:49;a:3:{i:0;s:12:"section_open";i:1;a:1:{i:0;i:2;}i:2;i:1202;}i:50;a:3:{i:0;s:6:"p_open";i:1;a:0:{}i:2;i:1236;}i:51;a:3:{i:0;s:5:"cdata";i:1;a:1:{i:0;s:214:"
Primeiramente, foi discutido o papel do líder, com os antigos líderes dando a sua opinião a esse respeito. Após, foi iniciada a votação. Fabiano e Thiago se candidataram. A contagem de votos foi a seguinte:
";}i:2;i:1237;}i:52;a:3:{i:0;s:7:"p_close";i:1;a:0:{}i:2;i:1451;}i:53;a:3:{i:0;s:10:"listu_open";i:1;a:0:{}i:2;i:1451;}i:54;a:3:{i:0;s:13:"listitem_open";i:1;a:1:{i:0;i:1;}i:2;i:1451;}i:55;a:3:{i:0;s:16:"listcontent_open";i:1;a:0:{}i:2;i:1451;}i:56;a:3:{i:0;s:5:"cdata";i:1;a:1:{i:0;s:22:" Fabiano -&gt; 7 votos";}i:2;i:1455;}i:57;a:3:{i:0;s:17:"listcontent_close";i:1;a:0:{}i:2;i:1477;}i:58;a:3:{i:0;s:14:"listitem_close";i:1;a:0:{}i:2;i:1477;}i:59;a:3:{i:0;s:13:"listitem_open";i:1;a:1:{i:0;i:1;}i:2;i:1477;}i:60;a:3:{i:0;s:16:"listcontent_open";i:1;a:0:{}i:2;i:1477;}i:61;a:3:{i:0;s:5:"cdata";i:1;a:1:{i:0;s:21:" Thiago -&gt; 2 votos";}i:2;i:1481;}i:62;a:3:{i:0;s:17:"listcontent_close";i:1;a:0:{}i:2;i:1502;}i:63;a:3:{i:0;s:14:"listitem_close";i:1;a:0:{}i:2;i:1502;}i:64;a:3:{i:0;s:13:"listitem_open";i:1;a:1:{i:0;i:1;}i:2;i:1502;}i:65;a:3:{i:0;s:16:"listcontent_open";i:1;a:0:{}i:2;i:1502;}i:66;a:3:{i:0;s:5:"cdata";i:1;a:1:{i:0;s:19:" Nulos -&gt; 1 voto";}i:2;i:1506;}i:67;a:3:{i:0;s:17:"listcontent_close";i:1;a:0:{}i:2;i:1525;}i:68;a:3:{i:0;s:14:"listitem_close";i:1;a:0:{}i:2;i:1525;}i:69;a:3:{i:0;s:11:"listu_close";i:1;a:0:{}i:2;i:1525;}i:70;a:3:{i:0;s:6:"p_open";i:1;a:0:{}i:2;i:1525;}i:71;a:3:{i:0;s:5:"cdata";i:1;a:1:{i:0;s:44:"
Assim, Fabiano se tornou o próximo líder.";}i:2;i:1526;}i:72;a:3:{i:0;s:7:"p_close";i:1;a:0:{}i:2;i:1570;}i:73;a:3:{i:0;s:13:"section_close";i:1;a:0:{}i:2;i:1572;}i:74;a:3:{i:0;s:12:"section_edit";i:1;a:4:{i:0;i:1202;i:1;i:1571;i:2;i:2;i:3;s:22:"5. Eleição do líder";}i:2;i:1572;}i:75;a:3:{i:0;s:6:"header";i:1;a:3:{i:0;s:97:"6. [[/trac/wiki/Sele%C3%A7%C3%A3o/Comiss%C3%A3o|Seleção/Comissão?]] dos novos Bolsistas do PET";i:1;i:2;i:2;i:1572;}i:2;i:1572;}i:76;a:3:{i:0;s:12:"section_open";i:1;a:1:{i:0;i:2;}i:2;i:1572;}i:77;a:3:{i:0;s:6:"p_open";i:1;a:0:{}i:2;i:1681;}i:78;a:3:{i:0;s:5:"cdata";i:1;a:1:{i:0;s:459:"
Seleção acontecerá nas próximas semanas. O objetivo é que em abril os novos petianos já começem. Comissão será formada por : Thiago (líder), Estevão, Felipe e Marcos. Foi falado que devemos reformular o e-mail a ser enviado à lista, botando um pouco do perfil do petiano e do comprometimento (falado no item 2 desta ata). Também deverá haver propraganda nas salas de aula, para termos vários candidatos, já que serão 5 os bolsistas a entrar.";}i:2;i:1682;}i:79;a:3:{i:0;s:7:"p_close";i:1;a:0:{}i:2;i:2141;}i:80;a:3:{i:0;s:13:"section_close";i:1;a:0:{}i:2;i:2143;}i:81;a:3:{i:0;s:12:"section_edit";i:1;a:4:{i:0;i:1572;i:1;i:2142;i:2;i:2;i:3;s:97:"6. [[/trac/wiki/Sele%C3%A7%C3%A3o/Comiss%C3%A3o|Seleção/Comissão?]] dos novos Bolsistas do PET";}i:2;i:2143;}i:82;a:3:{i:0;s:6:"header";i:1;a:3:{i:0;s:36:"7. Entrega do Boletim de Efetividade";i:1;i:2;i:2;i:2143;}i:2;i:2143;}i:83;a:3:{i:0;s:12:"section_open";i:1;a:1:{i:0;i:2;}i:2;i:2143;}i:84;a:3:{i:0;s:6:"p_open";i:1;a:0:{}i:2;i:2191;}i:85;a:3:{i:0;s:5:"cdata";i:1;a:1:{i:0;s:70:"
Vicente continua responsável pela entrega do boletim de efetividade.";}i:2;i:2192;}i:86;a:3:{i:0;s:7:"p_close";i:1;a:0:{}i:2;i:2262;}i:87;a:3:{i:0;s:13:"section_close";i:1;a:0:{}i:2;i:2264;}i:88;a:3:{i:0;s:12:"section_edit";i:1;a:4:{i:0;i:2143;i:1;i:2263;i:2;i:2;i:3;s:36:"7. Entrega do Boletim de Efetividade";}i:2;i:2264;}i:89;a:3:{i:0;s:6:"header";i:1;a:3:{i:0;s:18:"8. Invasão no PET";i:1;i:2;i:2;i:2264;}i:2;i:2264;}i:90;a:3:{i:0;s:12:"section_open";i:1;a:1:{i:0;i:2;}i:2;i:2264;}i:91;a:3:{i:0;s:6:"p_open";i:1;a:0:{}i:2;i:2294;}i:92;a:3:{i:0;s:5:"cdata";i:1;a:1:{i:0;s:152:"
Thiago relatou que acha que houve uma possível invasão no pet na semana anterior. Vai falar com a segurança para ver o problema e testar o servidor.";}i:2;i:2295;}i:93;a:3:{i:0;s:7:"p_close";i:1;a:0:{}i:2;i:2447;}i:94;a:3:{i:0;s:13:"section_close";i:1;a:0:{}i:2;i:2449;}i:95;a:3:{i:0;s:12:"section_edit";i:1;a:4:{i:0;i:2264;i:1;i:2448;i:2;i:2;i:3;s:18:"8. Invasão no PET";}i:2;i:2449;}i:96;a:3:{i:0;s:6:"header";i:1;a:3:{i:0;s:20:"9. Atraso das bolsas";i:1;i:2;i:2;i:2449;}i:2;i:2449;}i:97;a:3:{i:0;s:12:"section_open";i:1;a:1:{i:0;i:2;}i:2;i:2449;}i:98;a:3:{i:0;s:6:"p_open";i:1;a:0:{}i:2;i:2481;}i:99;a:3:{i:0;s:5:"cdata";i:1;a:1:{i:0;s:270:"
Foi discutido esse assunto e todos disseram que esse fato atrapalha bastante. Os mais antigos comentaram que no início do ano as bolsas sempre atrasam. Dante falou que desta vez, em especial, pode atrasar mais, pois o Orçamento demorou para ser aprovado no Congresso.";}i:2;i:2482;}i:100;a:3:{i:0;s:7:"p_close";i:1;a:0:{}i:2;i:2752;}i:101;a:3:{i:0;s:13:"section_close";i:1;a:0:{}i:2;i:2754;}i:102;a:3:{i:0;s:12:"section_edit";i:1;a:4:{i:0;i:2449;i:1;i:2753;i:2;i:2;i:3;s:20:"9. Atraso das bolsas";}i:2;i:2754;}i:103;a:3:{i:0;s:6:"header";i:1;a:3:{i:0;s:20:"10. PC da Globaltech";i:1;i:2;i:2;i:2754;}i:2;i:2754;}i:104;a:3:{i:0;s:12:"section_open";i:1;a:1:{i:0;i:2;}i:2;i:2754;}i:105;a:3:{i:0;s:6:"p_open";i:1;a:0:{}i:2;i:2786;}i:106;a:3:{i:0;s:5:"cdata";i:1;a:1:{i:0;s:293:"
Foram feitos dois orçamentos, um de um computador de R$ 2400 e o outro era de um pouco mais de R$ 1900. Como o e-mail da inf estava fora do ar, não pudemos ver a configuração detalhada. Como o dinheiro disponível é de R$ 2000, o segundo será comprado. Já vai ser encaminhada a compra.";}i:2;i:2787;}i:107;a:3:{i:0;s:7:"p_close";i:1;a:0:{}i:2;i:3080;}i:108;a:3:{i:0;s:13:"section_close";i:1;a:0:{}i:2;i:3082;}i:109;a:3:{i:0;s:12:"section_edit";i:1;a:4:{i:0;i:2754;i:1;i:3081;i:2;i:2;i:3;s:20:"10. PC da Globaltech";}i:2;i:3082;}i:110;a:3:{i:0;s:6:"header";i:1;a:3:{i:0;s:10:"11. Pilhas";i:1;i:2;i:2;i:3082;}i:2;i:3082;}i:111;a:3:{i:0;s:12:"section_open";i:1;a:1:{i:0;i:2;}i:2;i:3082;}i:112;a:3:{i:0;s:6:"p_open";i:1;a:0:{}i:2;i:3104;}i:113;a:3:{i:0;s:5:"cdata";i:1;a:1:{i:0;s:106:"
Dante disse que nós mesmos devemos fazer o orçamento. Fabiano ficou encarregado de fazer 3 orçamentos.";}i:2;i:3105;}i:114;a:3:{i:0;s:7:"p_close";i:1;a:0:{}i:2;i:3211;}i:115;a:3:{i:0;s:13:"section_close";i:1;a:0:{}i:2;i:3213;}i:116;a:3:{i:0;s:12:"section_edit";i:1;a:4:{i:0;i:3082;i:1;i:3212;i:2;i:2;i:3;s:10:"11. Pilhas";}i:2;i:3213;}i:117;a:3:{i:0;s:6:"header";i:1;a:3:{i:0;s:10:"12. 2º PC";i:1;i:2;i:2;i:3213;}i:2;i:3213;}i:118;a:3:{i:0;s:12:"section_open";i:1;a:1:{i:0;i:2;}i:2;i:3213;}i:119;a:3:{i:0;s:6:"p_open";i:1;a:0:{}i:2;i:3235;}i:120;a:3:{i:0;s:5:"cdata";i:1;a:1:{i:0;s:74:"
Thiago fica responsável por ver os preços do segundo PC a ser comprado.";}i:2;i:3236;}i:121;a:3:{i:0;s:7:"p_close";i:1;a:0:{}i:2;i:3310;}i:122;a:3:{i:0;s:13:"section_close";i:1;a:0:{}i:2;i:3312;}i:123;a:3:{i:0;s:12:"section_edit";i:1;a:4:{i:0;i:3213;i:1;i:3311;i:2;i:2;i:3;s:10:"12. 2º PC";}i:2;i:3312;}i:124;a:3:{i:0;s:6:"header";i:1;a:3:{i:0;s:14:"13. Despedidas";i:1;i:2;i:2;i:3312;}i:2;i:3312;}i:125;a:3:{i:0;s:12:"section_open";i:1;a:1:{i:0;i:2;}i:2;i:3312;}i:126;a:3:{i:0;s:6:"p_open";i:1;a:0:{}i:2;i:3338;}i:127;a:3:{i:0;s:5:"cdata";i:1;a:1:{i:0;s:97:"
Paula se despede por e-mail para Dante. Robert, Paulo e Diego também anunciam seu desligamento.";}i:2;i:3339;}i:128;a:3:{i:0;s:7:"p_close";i:1;a:0:{}i:2;i:3436;}i:129;a:3:{i:0;s:13:"section_close";i:1;a:0:{}i:2;i:3438;}i:130;a:3:{i:0;s:12:"section_edit";i:1;a:4:{i:0;i:3312;i:1;i:3437;i:2;i:2;i:3;s:14:"13. Despedidas";}i:2;i:3438;}i:131;a:3:{i:0;s:6:"header";i:1;a:3:{i:0;s:9:"14. Petbr";i:1;i:2;i:2;i:3438;}i:2;i:3438;}i:132;a:3:{i:0;s:12:"section_open";i:1;a:1:{i:0;i:2;}i:2;i:3438;}i:133;a:3:{i:0;s:6:"p_open";i:1;a:0:{}i:2;i:3459;}i:134;a:3:{i:0;s:5:"cdata";i:1;a:1:{i:0;s:171:"
Dante fala sobre a petbr: como sergiu e seu estado atual. Comenta que está baixando bastante de nível - citando alguns exemplos - e diz que ela não mais reflete o PET.";}i:2;i:3460;}i:135;a:3:{i:0;s:7:"p_close";i:1;a:0:{}i:2;i:3631;}i:136;a:3:{i:0;s:13:"section_close";i:1;a:0:{}i:2;i:3633;}i:137;a:3:{i:0;s:12:"section_edit";i:1;a:4:{i:0;i:3438;i:1;i:3632;i:2;i:2;i:3;s:9:"14. Petbr";}i:2;i:3633;}i:138;a:3:{i:0;s:6:"header";i:1;a:3:{i:0;s:38:"15. Cadastro de Programas de Extensão";i:1;i:2;i:2;i:3633;}i:2;i:3633;}i:139;a:3:{i:0;s:12:"section_open";i:1;a:1:{i:0;i:2;}i:2;i:3633;}i:140;a:3:{i:0;s:6:"p_open";i:1;a:0:{}i:2;i:3683;}i:141;a:3:{i:0;s:5:"cdata";i:1;a:1:{i:0;s:122:"
Deverão ser cadastrados os Programas de Extensão de Robótica Educacional (Thiago) e do Museu de Informática (Marcos).";}i:2;i:3684;}i:142;a:3:{i:0;s:7:"p_close";i:1;a:0:{}i:2;i:3806;}i:143;a:3:{i:0;s:13:"section_close";i:1;a:0:{}i:2;i:3808;}i:144;a:3:{i:0;s:12:"section_edit";i:1;a:4:{i:0;i:3633;i:1;i:3807;i:2;i:2;i:3;s:38:"15. Cadastro de Programas de Extensão";}i:2;i:3808;}i:145;a:3:{i:0;s:6:"header";i:1;a:3:{i:0;s:19:"16. Viagem de Dante";i:1;i:2;i:2;i:3808;}i:2;i:3808;}i:146;a:3:{i:0;s:12:"section_open";i:1;a:1:{i:0;i:2;}i:2;i:3808;}i:147;a:3:{i:0;s:6:"p_open";i:1;a:0:{}i:2;i:3839;}i:148;a:3:{i:0;s:5:"cdata";i:1;a:1:{i:0;s:120:"
Dante estará viajando na semana que vem por motivos profissionais e, portanto, não participará da próxima reunião.";}i:2;i:3840;}i:149;a:3:{i:0;s:7:"p_close";i:1;a:0:{}i:2;i:3960;}i:150;a:3:{i:0;s:13:"section_close";i:1;a:0:{}i:2;i:3962;}i:151;a:3:{i:0;s:12:"section_edit";i:1;a:4:{i:0;i:3808;i:1;i:3961;i:2;i:2;i:3;s:19:"16. Viagem de Dante";}i:2;i:3962;}i:152;a:3:{i:0;s:6:"header";i:1;a:3:{i:0;s:23:"17. Cronograma Nacional";i:1;i:2;i:2;i:3962;}i:2;i:3962;}i:153;a:3:{i:0;s:12:"section_open";i:1;a:1:{i:0;i:2;}i:2;i:3962;}i:154;a:3:{i:0;s:6:"p_open";i:1;a:0:{}i:2;i:3997;}i:155;a:3:{i:0;s:5:"cdata";i:1;a:1:{i:0;s:101:"
Foi dado ao líder Fabiano o Cronograma Nacional do PET. Ele o leu em voz alta a todos os presentes.";}i:2;i:3998;}i:156;a:3:{i:0;s:7:"p_close";i:1;a:0:{}i:2;i:4099;}i:157;a:3:{i:0;s:13:"section_close";i:1;a:0:{}i:2;i:4101;}i:158;a:3:{i:0;s:12:"section_edit";i:1;a:4:{i:0;i:3962;i:1;i:4100;i:2;i:2;i:3;s:23:"17. Cronograma Nacional";}i:2;i:4101;}i:159;a:3:{i:0;s:6:"header";i:1;a:3:{i:0;s:25:"18. Reunião do dia 15/03";i:1;i:2;i:2;i:4101;}i:2;i:4101;}i:160;a:3:{i:0;s:12:"section_open";i:1;a:1:{i:0;i:2;}i:2;i:4101;}i:161;a:3:{i:0;s:6:"p_open";i:1;a:0:{}i:2;i:4138;}i:162;a:3:{i:0;s:5:"cdata";i:1;a:1:{i:0;s:177:"
Na reunião do dia 15/03 (a próxima em que o Dante estará presente), será discutido o planejamento anual e será visto os certificados de extensão de cursos do ano passado.";}i:2;i:4139;}i:163;a:3:{i:0;s:7:"p_close";i:1;a:0:{}i:2;i:4316;}i:164;a:3:{i:0;s:13:"section_close";i:1;a:0:{}i:2;i:4317;}i:165;a:3:{i:0;s:12:"section_edit";i:1;a:4:{i:0;i:4101;i:1;i:0;i:2;i:2;i:3;s:25:"18. Reunião do dia 15/03";}i:2;i:4317;}i:166;a:3:{i:0;s:12:"document_end";i:1;a:0:{}i:2;i:4317;}}