a:315:{i:0;a:3:{i:0;s:14:"document_start";i:1;a:0:{}i:2;i:0;}i:1;a:3:{i:0;s:6:"p_open";i:1;a:0:{}i:2;i:0;}i:2;a:3:{i:0;s:7:"p_close";i:1;a:0:{}i:2;i:1;}i:3;a:3:{i:0;s:12:"section_edit";i:1;a:4:{i:0;i:-1;i:1;i:0;i:2;i:1;i:3;s:0:"";}i:2;i:1;}i:4;a:3:{i:0;s:6:"header";i:1;a:3:{i:0;s:29:"Ata da Reunião de 19/09/2006";i:1;i:1;i:2;i:1;}i:2;i:1;}i:5;a:3:{i:0;s:12:"section_open";i:1;a:1:{i:0;i:1;}i:2;i:1;}i:6;a:3:{i:0;s:6:"p_open";i:1;a:0:{}i:2;i:44;}i:7;a:3:{i:0;s:5:"cdata";i:1;a:1:{i:0;s:70:"
Presentes: Capra, Dante, Fabiano, Felipe, Gabriela, Lucas Cavalheiro,";}i:2;i:45;}i:8;a:3:{i:0;s:7:"p_close";i:1;a:0:{}i:2;i:115;}i:9;a:3:{i:0;s:6:"p_open";i:1;a:0:{}i:2;i:115;}i:10;a:3:{i:0;s:5:"cdata";i:1;a:1:{i:0;s:55:"Lucas Mizusaki, Marcelo, Marcos, Pablo, Ricardo, Thiago";}i:2;i:117;}i:11;a:3:{i:0;s:7:"p_close";i:1;a:0:{}i:2;i:172;}i:12;a:3:{i:0;s:6:"p_open";i:1;a:0:{}i:2;i:172;}i:13;a:3:{i:0;s:5:"cdata";i:1;a:1:{i:0;s:18:"Ausentes: Estevão";}i:2;i:174;}i:14;a:3:{i:0;s:7:"p_close";i:1;a:0:{}i:2;i:192;}i:15;a:3:{i:0;s:6:"p_open";i:1;a:0:{}i:2;i:192;}i:16;a:3:{i:0;s:5:"cdata";i:1;a:1:{i:0;s:14:"Relator: Capra";}i:2;i:194;}i:17;a:3:{i:0;s:7:"p_close";i:1;a:0:{}i:2;i:208;}i:18;a:3:{i:0;s:13:"section_close";i:1;a:0:{}i:2;i:210;}i:19;a:3:{i:0;s:12:"section_edit";i:1;a:4:{i:0;i:1;i:1;i:209;i:2;i:1;i:3;s:29:"Ata da Reunião de 19/09/2006";}i:2;i:210;}i:20;a:3:{i:0;s:6:"header";i:1;a:3:{i:0;s:27:"1. Mudanças Relatório MEC";i:1;i:2;i:2;i:210;}i:2;i:210;}i:21;a:3:{i:0;s:12:"section_open";i:1;a:1:{i:0;i:2;}i:2;i:210;}i:22;a:3:{i:0;s:6:"p_open";i:1;a:0:{}i:2;i:249;}i:23;a:3:{i:0;s:5:"cdata";i:1;a:1:{i:0;s:76:"
Zambiasi fez as modificações no relatório. Trocado para regular o campo ";}i:2;i:250;}i:24;a:3:{i:0;s:18:"doublequoteopening";i:1;a:0:{}i:2;i:326;}i:25;a:3:{i:0;s:5:"cdata";i:1;a:1:{i:0;s:27:"relação da SESU com a IES";}i:2;i:327;}i:26;a:3:{i:0;s:18:"doublequoteclosing";i:1;a:0:{}i:2;i:354;}i:27;a:3:{i:0;s:5:"cdata";i:1;a:1:{i:0;s:1:".";}i:2;i:355;}i:28;a:3:{i:0;s:7:"p_close";i:1;a:0:{}i:2;i:356;}i:29;a:3:{i:0;s:13:"section_close";i:1;a:0:{}i:2;i:358;}i:30;a:3:{i:0;s:12:"section_edit";i:1;a:4:{i:0;i:210;i:1;i:357;i:2;i:2;i:3;s:27:"1. Mudanças Relatório MEC";}i:2;i:358;}i:31;a:3:{i:0;s:6:"header";i:1;a:3:{i:0;s:20:"2. Próximo Interpet";i:1;i:2;i:2;i:358;}i:2;i:358;}i:32;a:3:{i:0;s:12:"section_open";i:1;a:1:{i:0;i:2;}i:2;i:358;}i:33;a:3:{i:0;s:6:"p_open";i:1;a:0:{}i:2;i:390;}i:34;a:3:{i:0;s:5:"cdata";i:1;a:1:{i:0;s:33:"
Será dia 27/09 - 19h na odonto.";}i:2;i:391;}i:35;a:3:{i:0;s:7:"p_close";i:1;a:0:{}i:2;i:424;}i:36;a:3:{i:0;s:13:"section_close";i:1;a:0:{}i:2;i:426;}i:37;a:3:{i:0;s:12:"section_edit";i:1;a:4:{i:0;i:358;i:1;i:425;i:2;i:2;i:3;s:20:"2. Próximo Interpet";}i:2;i:426;}i:38;a:3:{i:0;s:6:"header";i:1;a:3:{i:0;s:23:"3. Reunião com Manuela";i:1;i:2;i:2;i:426;}i:2;i:426;}i:39;a:3:{i:0;s:12:"section_open";i:1;a:1:{i:0;i:2;}i:2;i:426;}i:40;a:3:{i:0;s:6:"p_open";i:1;a:0:{}i:2;i:461;}i:41;a:3:{i:0;s:5:"cdata";i:1;a:1:{i:0;s:111:"
Comentado sobre extensão da Ipiranga. Idéia para Museu ser centro cultural, inclusive com inclusão digital.";}i:2;i:462;}i:42;a:3:{i:0;s:7:"p_close";i:1;a:0:{}i:2;i:573;}i:43;a:3:{i:0;s:13:"section_close";i:1;a:0:{}i:2;i:575;}i:44;a:3:{i:0;s:12:"section_edit";i:1;a:4:{i:0;i:426;i:1;i:574;i:2;i:2;i:3;s:23:"3. Reunião com Manuela";}i:2;i:575;}i:45;a:3:{i:0;s:6:"header";i:1;a:3:{i:0;s:22:"4. Material de Consumo";i:1;i:2;i:2;i:575;}i:2;i:575;}i:46;a:3:{i:0;s:12:"section_open";i:1;a:1:{i:0;i:2;}i:2;i:575;}i:47;a:3:{i:0;s:10:"listu_open";i:1;a:0:{}i:2;i:610;}i:48;a:3:{i:0;s:13:"listitem_open";i:1;a:1:{i:0;i:1;}i:2;i:610;}i:49;a:3:{i:0;s:16:"listcontent_open";i:1;a:0:{}i:2;i:610;}i:50;a:3:{i:0;s:5:"cdata";i:1;a:1:{i:0;s:39:" Novo PC: R$1200 s/ teclado e s/ mouse.";}i:2;i:614;}i:51;a:3:{i:0;s:17:"listcontent_close";i:1;a:0:{}i:2;i:653;}i:52;a:3:{i:0;s:10:"listu_open";i:1;a:0:{}i:2;i:653;}i:53;a:3:{i:0;s:13:"listitem_open";i:1;a:1:{i:0;i:2;}i:2;i:653;}i:54;a:3:{i:0;s:16:"listcontent_open";i:1;a:0:{}i:2;i:653;}i:55;a:3:{i:0;s:5:"cdata";i:1;a:1:{i:0;s:70:" 2 PLACAS MAE Asus A8V - MX (placa video/rede/som Onboard) = R$ 299,00";}i:2;i:659;}i:56;a:3:{i:0;s:17:"listcontent_close";i:1;a:0:{}i:2;i:729;}i:57;a:3:{i:0;s:14:"listitem_close";i:1;a:0:{}i:2;i:729;}i:58;a:3:{i:0;s:11:"listu_close";i:1;a:0:{}i:2;i:729;}i:59;a:3:{i:0;s:14:"listitem_close";i:1;a:0:{}i:2;i:729;}i:60;a:3:{i:0;s:11:"listu_close";i:1;a:0:{}i:2;i:729;}i:61;a:3:{i:0;s:10:"listu_open";i:1;a:0:{}i:2;i:730;}i:62;a:3:{i:0;s:13:"listitem_open";i:1;a:1:{i:0;i:1;}i:2;i:730;}i:63;a:3:{i:0;s:16:"listcontent_open";i:1;a:0:{}i:2;i:730;}i:64;a:3:{i:0;s:5:"cdata";i:1;a:1:{i:0;s:48:" 2 PROCESSADORES ATHLON 64 3200+ BOX = R$ 249,00";}i:2;i:734;}i:65;a:3:{i:0;s:17:"listcontent_close";i:1;a:0:{}i:2;i:782;}i:66;a:3:{i:0;s:14:"listitem_close";i:1;a:0:{}i:2;i:782;}i:67;a:3:{i:0;s:11:"listu_close";i:1;a:0:{}i:2;i:782;}i:68;a:3:{i:0;s:10:"listu_open";i:1;a:0:{}i:2;i:783;}i:69;a:3:{i:0;s:13:"listitem_open";i:1;a:1:{i:0;i:1;}i:2;i:783;}i:70;a:3:{i:0;s:16:"listcontent_open";i:1;a:0:{}i:2;i:783;}i:71;a:3:{i:0;s:5:"cdata";i:1;a:1:{i:0;s:35:" 2 HD-80GB SATA SANSUNG = R$ 179,00";}i:2;i:787;}i:72;a:3:{i:0;s:17:"listcontent_close";i:1;a:0:{}i:2;i:822;}i:73;a:3:{i:0;s:14:"listitem_close";i:1;a:0:{}i:2;i:822;}i:74;a:3:{i:0;s:11:"listu_close";i:1;a:0:{}i:2;i:822;}i:75;a:3:{i:0;s:10:"listu_open";i:1;a:0:{}i:2;i:823;}i:76;a:3:{i:0;s:13:"listitem_open";i:1;a:1:{i:0;i:1;}i:2;i:823;}i:77;a:3:{i:0;s:16:"listcontent_open";i:1;a:0:{}i:2;i:823;}i:78;a:3:{i:0;s:5:"cdata";i:1;a:1:{i:0;s:39:" 2 DRIVE DVD-RW GRAVADOR LG = R$ 130,00";}i:2;i:827;}i:79;a:3:{i:0;s:17:"listcontent_close";i:1;a:0:{}i:2;i:866;}i:80;a:3:{i:0;s:14:"listitem_close";i:1;a:0:{}i:2;i:866;}i:81;a:3:{i:0;s:11:"listu_close";i:1;a:0:{}i:2;i:866;}i:82;a:3:{i:0;s:10:"listu_open";i:1;a:0:{}i:2;i:867;}i:83;a:3:{i:0;s:13:"listitem_open";i:1;a:1:{i:0;i:1;}i:2;i:867;}i:84;a:3:{i:0;s:16:"listcontent_open";i:1;a:0:{}i:2;i:867;}i:85;a:3:{i:0;s:5:"cdata";i:1;a:1:{i:0;s:41:" 2 MEMORIA DDR- 1GB DDR SDRAM = R$ 390,00";}i:2;i:871;}i:86;a:3:{i:0;s:17:"listcontent_close";i:1;a:0:{}i:2;i:912;}i:87;a:3:{i:0;s:14:"listitem_close";i:1;a:0:{}i:2;i:912;}i:88;a:3:{i:0;s:11:"listu_close";i:1;a:0:{}i:2;i:912;}i:89;a:3:{i:0;s:10:"quote_open";i:1;a:0:{}i:2;i:913;}i:90;a:3:{i:0;s:10:"quote_open";i:1;a:0:{}i:2;i:913;}i:91;a:3:{i:0;s:5:"cdata";i:1;a:1:{i:0;s:43:" essas peças foram cotadas na empresa DIT.";}i:2;i:916;}i:92;a:3:{i:0;s:11:"quote_close";i:1;a:0:{}i:2;i:959;}i:93;a:3:{i:0;s:11:"quote_close";i:1;a:0:{}i:2;i:959;}i:94;a:3:{i:0;s:10:"listu_open";i:1;a:0:{}i:2;i:960;}i:95;a:3:{i:0;s:13:"listitem_open";i:1;a:1:{i:0;i:1;}i:2;i:960;}i:96;a:3:{i:0;s:16:"listcontent_open";i:1;a:0:{}i:2;i:960;}i:97;a:3:{i:0;s:5:"cdata";i:1;a:1:{i:0;s:50:" 2 MOUSES ÓPTICOS LOGITECH (VALOR MÁXIMO R$ 100)";}i:2;i:964;}i:98;a:3:{i:0;s:17:"listcontent_close";i:1;a:0:{}i:2;i:1014;}i:99;a:3:{i:0;s:14:"listitem_close";i:1;a:0:{}i:2;i:1014;}i:100;a:3:{i:0;s:13:"listitem_open";i:1;a:1:{i:0;i:1;}i:2;i:1014;}i:101;a:3:{i:0;s:16:"listcontent_open";i:1;a:0:{}i:2;i:1014;}i:102;a:3:{i:0;s:5:"cdata";i:1;a:1:{i:0;s:49:" 2 MOUSES ÓPTICOS MTEK PS2 (VALOR MÁXIMO R$ 50)";}i:2;i:1018;}i:103;a:3:{i:0;s:17:"listcontent_close";i:1;a:0:{}i:2;i:1067;}i:104;a:3:{i:0;s:14:"listitem_close";i:1;a:0:{}i:2;i:1067;}i:105;a:3:{i:0;s:13:"listitem_open";i:1;a:1:{i:0;i:1;}i:2;i:1067;}i:106;a:3:{i:0;s:16:"listcontent_open";i:1;a:0:{}i:2;i:1067;}i:107;a:3:{i:0;s:5:"cdata";i:1;a:1:{i:0;s:41:" 7 TECLADOS LOGITECH (VALOR MÁXIMO R$50)";}i:2;i:1071;}i:108;a:3:{i:0;s:17:"listcontent_close";i:1;a:0:{}i:2;i:1112;}i:109;a:3:{i:0;s:14:"listitem_close";i:1;a:0:{}i:2;i:1112;}i:110;a:3:{i:0;s:11:"listu_close";i:1;a:0:{}i:2;i:1112;}i:111;a:3:{i:0;s:10:"listu_open";i:1;a:0:{}i:2;i:1113;}i:112;a:3:{i:0;s:13:"listitem_open";i:1;a:1:{i:0;i:1;}i:2;i:1113;}i:113;a:3:{i:0;s:16:"listcontent_open";i:1;a:0:{}i:2;i:1113;}i:114;a:3:{i:0;s:5:"cdata";i:1;a:1:{i:0;s:32:" PET bancará 2 monitores novos.";}i:2;i:1117;}i:115;a:3:{i:0;s:17:"listcontent_close";i:1;a:0:{}i:2;i:1149;}i:116;a:3:{i:0;s:14:"listitem_close";i:1;a:0:{}i:2;i:1149;}i:117;a:3:{i:0;s:13:"listitem_open";i:1;a:1:{i:0;i:1;}i:2;i:1149;}i:118;a:3:{i:0;s:16:"listcontent_open";i:1;a:0:{}i:2;i:1149;}i:119;a:3:{i:0;s:5:"cdata";i:1;a:1:{i:0;s:77:" Mizu comprará jogos de chaves se não der pra botar no material de consumo.";}i:2;i:1153;}i:120;a:3:{i:0;s:17:"listcontent_close";i:1;a:0:{}i:2;i:1230;}i:121;a:3:{i:0;s:14:"listitem_close";i:1;a:0:{}i:2;i:1230;}i:122;a:3:{i:0;s:13:"listitem_open";i:1;a:1:{i:0;i:1;}i:2;i:1230;}i:123;a:3:{i:0;s:16:"listcontent_open";i:1;a:0:{}i:2;i:1230;}i:124;a:3:{i:0;s:5:"cdata";i:1;a:1:{i:0;s:75:" Marcadores p/ quadro branco - 3 de cada cor (azul, vermelho, preto, verde)";}i:2;i:1234;}i:125;a:3:{i:0;s:17:"listcontent_close";i:1;a:0:{}i:2;i:1309;}i:126;a:3:{i:0;s:14:"listitem_close";i:1;a:0:{}i:2;i:1309;}i:127;a:3:{i:0;s:13:"listitem_open";i:1;a:1:{i:0;i:1;}i:2;i:1309;}i:128;a:3:{i:0;s:16:"listcontent_open";i:1;a:0:{}i:2;i:1309;}i:129;a:3:{i:0;s:5:"cdata";i:1;a:1:{i:0;s:9:" 20 DVD-R";}i:2;i:1313;}i:130;a:3:{i:0;s:17:"listcontent_close";i:1;a:0:{}i:2;i:1322;}i:131;a:3:{i:0;s:14:"listitem_close";i:1;a:0:{}i:2;i:1322;}i:132;a:3:{i:0;s:13:"listitem_open";i:1;a:1:{i:0;i:1;}i:2;i:1322;}i:133;a:3:{i:0;s:16:"listcontent_open";i:1;a:0:{}i:2;i:1322;}i:134;a:3:{i:0;s:5:"cdata";i:1;a:1:{i:0;s:9:" 20 CD-RW";}i:2;i:1326;}i:135;a:3:{i:0;s:17:"listcontent_close";i:1;a:0:{}i:2;i:1335;}i:136;a:3:{i:0;s:14:"listitem_close";i:1;a:0:{}i:2;i:1335;}i:137;a:3:{i:0;s:13:"listitem_open";i:1;a:1:{i:0;i:1;}i:2;i:1335;}i:138;a:3:{i:0;s:16:"listcontent_open";i:1;a:0:{}i:2;i:1335;}i:139;a:3:{i:0;s:5:"cdata";i:1;a:1:{i:0;s:11:" Protoboard";}i:2;i:1339;}i:140;a:3:{i:0;s:17:"listcontent_close";i:1;a:0:{}i:2;i:1350;}i:141;a:3:{i:0;s:14:"listitem_close";i:1;a:0:{}i:2;i:1350;}i:142;a:3:{i:0;s:13:"listitem_open";i:1;a:1:{i:0;i:1;}i:2;i:1350;}i:143;a:3:{i:0;s:16:"listcontent_open";i:1;a:0:{}i:2;i:1350;}i:144;a:3:{i:0;s:5:"cdata";i:1;a:1:{i:0;s:15:" 50 ou 100 CD-R";}i:2;i:1354;}i:145;a:3:{i:0;s:17:"listcontent_close";i:1;a:0:{}i:2;i:1369;}i:146;a:3:{i:0;s:14:"listitem_close";i:1;a:0:{}i:2;i:1369;}i:147;a:3:{i:0;s:13:"listitem_open";i:1;a:1:{i:0;i:1;}i:2;i:1369;}i:148;a:3:{i:0;s:16:"listcontent_open";i:1;a:0:{}i:2;i:1369;}i:149;a:3:{i:0;s:5:"cdata";i:1;a:1:{i:0;s:9:" 15 Durex";}i:2;i:1373;}i:150;a:3:{i:0;s:17:"listcontent_close";i:1;a:0:{}i:2;i:1382;}i:151;a:3:{i:0;s:14:"listitem_close";i:1;a:0:{}i:2;i:1382;}i:152;a:3:{i:0;s:13:"listitem_open";i:1;a:1:{i:0;i:1;}i:2;i:1382;}i:153;a:3:{i:0;s:16:"listcontent_open";i:1;a:0:{}i:2;i:1382;}i:154;a:3:{i:0;s:5:"cdata";i:1;a:1:{i:0;s:21:" Ponteiras Multimetro";}i:2;i:1386;}i:155;a:3:{i:0;s:17:"listcontent_close";i:1;a:0:{}i:2;i:1407;}i:156;a:3:{i:0;s:14:"listitem_close";i:1;a:0:{}i:2;i:1407;}i:157;a:3:{i:0;s:13:"listitem_open";i:1;a:1:{i:0;i:1;}i:2;i:1407;}i:158;a:3:{i:0;s:16:"listcontent_open";i:1;a:0:{}i:2;i:1407;}i:159;a:3:{i:0;s:5:"cdata";i:1;a:1:{i:0;s:32:" 4 Carregador de pilhas AA Ni-Mh";}i:2;i:1411;}i:160;a:3:{i:0;s:17:"listcontent_close";i:1;a:0:{}i:2;i:1443;}i:161;a:3:{i:0;s:14:"listitem_close";i:1;a:0:{}i:2;i:1443;}i:162;a:3:{i:0;s:13:"listitem_open";i:1;a:1:{i:0;i:1;}i:2;i:1443;}i:163;a:3:{i:0;s:16:"listcontent_open";i:1;a:0:{}i:2;i:1443;}i:164;a:3:{i:0;s:5:"cdata";i:1;a:1:{i:0;s:12:" Memórias ?";}i:2;i:1447;}i:165;a:3:{i:0;s:17:"listcontent_close";i:1;a:0:{}i:2;i:1459;}i:166;a:3:{i:0;s:14:"listitem_close";i:1;a:0:{}i:2;i:1459;}i:167;a:3:{i:0;s:11:"listu_close";i:1;a:0:{}i:2;i:1459;}i:168;a:3:{i:0;s:13:"section_close";i:1;a:0:{}i:2;i:1461;}i:169;a:3:{i:0;s:12:"section_edit";i:1;a:4:{i:0;i:575;i:1;i:1460;i:2;i:2;i:3;s:22:"4. Material de Consumo";}i:2;i:1461;}i:170;a:3:{i:0;s:6:"header";i:1;a:3:{i:0;s:39:"5. Trac [[/trac/wiki/RoboEdu|RoboEdu?]]";i:1;i:2;i:2;i:1461;}i:2;i:1461;}i:171;a:3:{i:0;s:12:"section_open";i:1;a:1:{i:0;i:2;}i:2;i:1461;}i:172;a:3:{i:0;s:6:"p_open";i:1;a:0:{}i:2;i:1512;}i:173;a:3:{i:0;s:5:"cdata";i:1;a:1:{i:0;s:34:"
Mizusaki já monto o Trac para o ";}i:2;i:1513;}i:174;a:3:{i:0;s:12:"internallink";i:1;a:2:{i:0;s:18:"/trac/wiki/RoboEdu";i:1;s:8:"RoboEdu?";}i:2;i:1547;}i:175;a:3:{i:0;s:5:"cdata";i:1;a:1:{i:0;s:42:", próximas reuniões serão marcadas lá.";}i:2;i:1578;}i:176;a:3:{i:0;s:7:"p_close";i:1;a:0:{}i:2;i:1620;}i:177;a:3:{i:0;s:13:"section_close";i:1;a:0:{}i:2;i:1622;}i:178;a:3:{i:0;s:12:"section_edit";i:1;a:4:{i:0;i:1461;i:1;i:1621;i:2;i:2;i:3;s:39:"5. Trac [[/trac/wiki/RoboEdu|RoboEdu?]]";}i:2;i:1622;}i:179;a:3:{i:0;s:6:"header";i:1;a:3:{i:0;s:25:"6. Dinheiro curso de HTML";i:1;i:2;i:2;i:1622;}i:2;i:1622;}i:180;a:3:{i:0;s:12:"section_open";i:1;a:1:{i:0;i:2;}i:2;i:1622;}i:181;a:3:{i:0;s:6:"p_open";i:1;a:0:{}i:2;i:1659;}i:182;a:3:{i:0;s:5:"cdata";i:1;a:1:{i:0;s:46:"
Repassar o dinheiro que pagarem para o Pablo.";}i:2;i:1660;}i:183;a:3:{i:0;s:7:"p_close";i:1;a:0:{}i:2;i:1706;}i:184;a:3:{i:0;s:13:"section_close";i:1;a:0:{}i:2;i:1708;}i:185;a:3:{i:0;s:12:"section_edit";i:1;a:4:{i:0;i:1622;i:1;i:1707;i:2;i:2;i:3;s:25:"6. Dinheiro curso de HTML";}i:2;i:1708;}i:186;a:3:{i:0;s:6:"header";i:1;a:3:{i:0;s:18:"7. Pontos de Pauta";i:1;i:2;i:2;i:1708;}i:2;i:1708;}i:187;a:3:{i:0;s:12:"section_open";i:1;a:1:{i:0;i:2;}i:2;i:1708;}i:188;a:3:{i:0;s:6:"p_open";i:1;a:0:{}i:2;i:1738;}i:189;a:3:{i:0;s:5:"cdata";i:1;a:1:{i:0;s:111:"
A pauta será deixada para o redator da Ata apagar e já colocar os pontos definidos para a próxima reunião.";}i:2;i:1739;}i:190;a:3:{i:0;s:7:"p_close";i:1;a:0:{}i:2;i:1850;}i:191;a:3:{i:0;s:13:"section_close";i:1;a:0:{}i:2;i:1852;}i:192;a:3:{i:0;s:12:"section_edit";i:1;a:4:{i:0;i:1708;i:1;i:1851;i:2;i:2;i:3;s:18:"7. Pontos de Pauta";}i:2;i:1852;}i:193;a:3:{i:0;s:6:"header";i:1;a:3:{i:0;s:32:"8. Extensão PET - Departamentos";i:1;i:2;i:2;i:1852;}i:2;i:1852;}i:194;a:3:{i:0;s:12:"section_open";i:1;a:1:{i:0;i:2;}i:2;i:1852;}i:195;a:3:{i:0;s:6:"p_open";i:1;a:0:{}i:2;i:1896;}i:196;a:3:{i:0;s:5:"cdata";i:1;a:1:{i:0;s:119:"
Fazer comparação de como a Inf. está em termos de extensão comparado com outros departamentos. Responsável: Capra";}i:2;i:1897;}i:197;a:3:{i:0;s:7:"p_close";i:1;a:0:{}i:2;i:2016;}i:198;a:3:{i:0;s:13:"section_close";i:1;a:0:{}i:2;i:2018;}i:199;a:3:{i:0;s:12:"section_edit";i:1;a:4:{i:0;i:1852;i:1;i:2017;i:2;i:2;i:3;s:32:"8. Extensão PET - Departamentos";}i:2;i:2018;}i:200;a:3:{i:0;s:6:"header";i:1;a:3:{i:0;s:31:"9. Palestra Salão de Extensão";i:1;i:2;i:2;i:2018;}i:2;i:2018;}i:201;a:3:{i:0;s:12:"section_open";i:1;a:1:{i:0;i:2;}i:2;i:2018;}i:202;a:3:{i:0;s:6:"p_open";i:1;a:0:{}i:2;i:2061;}i:203;a:3:{i:0;s:5:"cdata";i:1;a:1:{i:0;s:95:"
28/09 - 9h às 11h Fazer adaptações p/ a apresentação. Zambiasi fica hoje mesmo para isso.";}i:2;i:2062;}i:204;a:3:{i:0;s:7:"p_close";i:1;a:0:{}i:2;i:2157;}i:205;a:3:{i:0;s:13:"section_close";i:1;a:0:{}i:2;i:2159;}i:206;a:3:{i:0;s:12:"section_edit";i:1;a:4:{i:0;i:2018;i:1;i:2158;i:2;i:2;i:3;s:31:"9. Palestra Salão de Extensão";}i:2;i:2159;}i:207;a:3:{i:0;s:6:"header";i:1;a:3:{i:0;s:19:"10. Visita ao Museu";i:1;i:2;i:2;i:2159;}i:2;i:2159;}i:208;a:3:{i:0;s:12:"section_open";i:1;a:1:{i:0;i:2;}i:2;i:2159;}i:209;a:3:{i:0;s:10:"listu_open";i:1;a:0:{}i:2;i:2191;}i:210;a:3:{i:0;s:13:"listitem_open";i:1;a:1:{i:0;i:1;}i:2;i:2191;}i:211;a:3:{i:0;s:16:"listcontent_open";i:1;a:0:{}i:2;i:2191;}i:212;a:3:{i:0;s:5:"cdata";i:1;a:1:{i:0;s:90:" II forneceu material para divulgação, aparentemente os alunos acharam bem interessante.";}i:2;i:2195;}i:213;a:3:{i:0;s:17:"listcontent_close";i:1;a:0:{}i:2;i:2285;}i:214;a:3:{i:0;s:14:"listitem_close";i:1;a:0:{}i:2;i:2285;}i:215;a:3:{i:0;s:13:"listitem_open";i:1;a:1:{i:0;i:1;}i:2;i:2285;}i:216;a:3:{i:0;s:16:"listcontent_open";i:1;a:0:{}i:2;i:2285;}i:217;a:3:{i:0;s:5:"cdata";i:1;a:1:{i:0;s:45:" ULBRA TV: canal 48 UHF ou 21 NET 25/09 17:20";}i:2;i:2289;}i:218;a:3:{i:0;s:17:"listcontent_close";i:1;a:0:{}i:2;i:2334;}i:219;a:3:{i:0;s:14:"listitem_close";i:1;a:0:{}i:2;i:2334;}i:220;a:3:{i:0;s:13:"listitem_open";i:1;a:1:{i:0;i:1;}i:2;i:2334;}i:221;a:3:{i:0;s:16:"listcontent_open";i:1;a:0:{}i:2;i:2334;}i:222;a:3:{i:0;s:5:"cdata";i:1;a:1:{i:0;s:63:" Cavalheiro fará press release da visita para próxima quarta.";}i:2;i:2338;}i:223;a:3:{i:0;s:17:"listcontent_close";i:1;a:0:{}i:2;i:2401;}i:224;a:3:{i:0;s:14:"listitem_close";i:1;a:0:{}i:2;i:2401;}i:225;a:3:{i:0;s:11:"listu_close";i:1;a:0:{}i:2;i:2401;}i:226;a:3:{i:0;s:13:"section_close";i:1;a:0:{}i:2;i:2403;}i:227;a:3:{i:0;s:12:"section_edit";i:1;a:4:{i:0;i:2159;i:1;i:2402;i:2;i:2;i:3;s:19:"10. Visita ao Museu";}i:2;i:2403;}i:228;a:3:{i:0;s:6:"header";i:1;a:3:{i:0;s:26:"11. Comissão de Seleção";i:1;i:2;i:2;i:2403;}i:2;i:2403;}i:229;a:3:{i:0;s:12:"section_open";i:1;a:1:{i:0;i:2;}i:2;i:2403;}i:230;a:3:{i:0;s:6:"p_open";i:1;a:0:{}i:2;i:2441;}i:231;a:3:{i:0;s:5:"cdata";i:1;a:1:{i:0;s:53:"
Capra, Gabi, Flores e Zambiasi. Reunião 21/09 15h30";}i:2;i:2442;}i:232;a:3:{i:0;s:7:"p_close";i:1;a:0:{}i:2;i:2495;}i:233;a:3:{i:0;s:13:"section_close";i:1;a:0:{}i:2;i:2497;}i:234;a:3:{i:0;s:12:"section_edit";i:1;a:4:{i:0;i:2403;i:1;i:2496;i:2;i:2;i:3;s:26:"11. Comissão de Seleção";}i:2;i:2497;}i:235;a:3:{i:0;s:6:"header";i:1;a:3:{i:0;s:20:"12. Palestra Palazzo";i:1;i:2;i:2;i:2497;}i:2;i:2497;}i:236;a:3:{i:0;s:12:"section_open";i:1;a:1:{i:0;i:2;}i:2;i:2497;}i:237;a:3:{i:0;s:6:"p_open";i:1;a:0:{}i:2;i:2529;}i:238;a:3:{i:0;s:5:"cdata";i:1;a:1:{i:0;s:94:"
Palazzo falaria sobre a crônica dele; 2 egressos ECP (um carreira acadêmica e um que está ";}i:2;i:2530;}i:239;a:3:{i:0;s:18:"doublequoteopening";i:1;a:0:{}i:2;i:2624;}i:240;a:3:{i:0;s:5:"cdata";i:1;a:1:{i:0;s:10:"no mercado";}i:2;i:2625;}i:241;a:3:{i:0;s:18:"doublequoteclosing";i:1;a:0:{}i:2;i:2635;}i:242;a:3:{i:0;s:5:"cdata";i:1;a:1:{i:0;s:62:"), idem para CIC; mesa redonda, convidar Daltro, um professor ";}i:2;i:2636;}i:243;a:3:{i:0;s:18:"doublequoteopening";i:1;a:0:{}i:2;i:2698;}i:244;a:3:{i:0;s:5:"cdata";i:1;a:1:{i:0;s:6:"apenas";}i:2;i:2699;}i:245;a:3:{i:0;s:18:"doublequoteclosing";i:1;a:0:{}i:2;i:2705;}i:246;a:3:{i:0;s:5:"cdata";i:1;a:1:{i:0;s:74:" professor e um que já fez mais alguma coisa. Para ser feito em Novembro.";}i:2;i:2706;}i:247;a:3:{i:0;s:7:"p_close";i:1;a:0:{}i:2;i:2780;}i:248;a:3:{i:0;s:13:"section_close";i:1;a:0:{}i:2;i:2782;}i:249;a:3:{i:0;s:12:"section_edit";i:1;a:4:{i:0;i:2497;i:1;i:2781;i:2;i:2;i:3;s:20:"12. Palestra Palazzo";}i:2;i:2782;}i:250;a:3:{i:0;s:6:"header";i:1;a:3:{i:0;s:28:"13. PET Computação 18 anos";i:1;i:2;i:2;i:2782;}i:2;i:2782;}i:251;a:3:{i:0;s:12:"section_open";i:1;a:1:{i:0;i:2;}i:2;i:2782;}i:252;a:3:{i:0;s:6:"p_open";i:1;a:0:{}i:2;i:2822;}i:253;a:3:{i:0;s:5:"cdata";i:1;a:1:{i:0;s:191:"
De 6 a 10 de Novembro. Realizar atividades sobre pesquisa, ensino (pode ser aproveitado o ponto acima) e extensão. Próxima reunião : formar Comissão de Organização do Aniversário PET.";}i:2;i:2823;}i:254;a:3:{i:0;s:7:"p_close";i:1;a:0:{}i:2;i:3014;}i:255;a:3:{i:0;s:13:"section_close";i:1;a:0:{}i:2;i:3016;}i:256;a:3:{i:0;s:12:"section_edit";i:1;a:4:{i:0;i:2782;i:1;i:3015;i:2;i:2;i:3;s:28:"13. PET Computação 18 anos";}i:2;i:3016;}i:257;a:3:{i:0;s:6:"header";i:1;a:3:{i:0;s:56:"14. Reunião de Orientações para o Salão de Extensão";i:1;i:2;i:2;i:3016;}i:2;i:3016;}i:258;a:3:{i:0;s:12:"section_open";i:1;a:1:{i:0;i:2;}i:2;i:3016;}i:259;a:3:{i:0;s:6:"p_open";i:1;a:0:{}i:2;i:3084;}i:260;a:3:{i:0;s:5:"cdata";i:1;a:1:{i:0;s:55:"
Normas das apresentações, como prepar os slides, etc";}i:2;i:3085;}i:261;a:3:{i:0;s:6:"entity";i:1;a:1:{i:0;s:3:"...";}i:2;i:3140;}i:262;a:3:{i:0;s:5:"cdata";i:1;a:1:{i:0;s:87:", entregaram os horários: Comunicação Oral - 27/09/06, 13h30, sala 2 Salão de Atos.";}i:2;i:3143;}i:263;a:3:{i:0;s:7:"p_close";i:1;a:0:{}i:2;i:3230;}i:264;a:3:{i:0;s:13:"section_close";i:1;a:0:{}i:2;i:3232;}i:265;a:3:{i:0;s:12:"section_edit";i:1;a:4:{i:0;i:3016;i:1;i:3231;i:2;i:2;i:3;s:56:"14. Reunião de Orientações para o Salão de Extensão";}i:2;i:3232;}i:266;a:3:{i:0;s:6:"header";i:1;a:3:{i:0;s:19:"15. Escola Técnica";i:1;i:2;i:2;i:3232;}i:2;i:3232;}i:267;a:3:{i:0;s:12:"section_open";i:1;a:1:{i:0;i:2;}i:2;i:3232;}i:268;a:3:{i:0;s:6:"p_open";i:1;a:0:{}i:2;i:3263;}i:269;a:3:{i:0;s:5:"cdata";i:1;a:1:{i:0;s:163:"
Mini-Curso de C, alunos gravarem PIC para fazer robô andar, etc. Eu vou ver Colégio Santos Dummond. Mizusaki falará com Tubino para posicionamento deifinitivo.";}i:2;i:3264;}i:270;a:3:{i:0;s:7:"p_close";i:1;a:0:{}i:2;i:3427;}i:271;a:3:{i:0;s:13:"section_close";i:1;a:0:{}i:2;i:3429;}i:272;a:3:{i:0;s:12:"section_edit";i:1;a:4:{i:0;i:3232;i:1;i:3428;i:2;i:2;i:3;s:19:"15. Escola Técnica";}i:2;i:3429;}i:273;a:3:{i:0;s:6:"header";i:1;a:3:{i:0;s:17:"16. Pôster Ciclo";i:1;i:2;i:2;i:3429;}i:2;i:3429;}i:274;a:3:{i:0;s:12:"section_open";i:1;a:1:{i:0;i:2;}i:2;i:3429;}i:275;a:3:{i:0;s:6:"p_open";i:1;a:0:{}i:2;i:3458;}i:276;a:3:{i:0;s:5:"cdata";i:1;a:1:{i:0;s:113:"
Flores vai mandar email para Jorge. Nomes que aparecerão: Zambiasi, Flores Cavalheiro, Fabiano e Marcos. R$ 55.";}i:2;i:3459;}i:277;a:3:{i:0;s:7:"p_close";i:1;a:0:{}i:2;i:3572;}i:278;a:3:{i:0;s:13:"section_close";i:1;a:0:{}i:2;i:3574;}i:279;a:3:{i:0;s:12:"section_edit";i:1;a:4:{i:0;i:3429;i:1;i:3573;i:2;i:2;i:3;s:17:"16. Pôster Ciclo";}i:2;i:3574;}i:280;a:3:{i:0;s:6:"header";i:1;a:3:{i:0;s:17:"17. Comitê Local";i:1;i:2;i:2;i:3574;}i:2;i:3574;}i:281;a:3:{i:0;s:12:"section_open";i:1;a:1:{i:0;i:2;}i:2;i:3574;}i:282;a:3:{i:0;s:10:"listu_open";i:1;a:0:{}i:2;i:3604;}i:283;a:3:{i:0;s:13:"listitem_open";i:1;a:1:{i:0;i:1;}i:2;i:3604;}i:284;a:3:{i:0;s:16:"listcontent_open";i:1;a:0:{}i:2;i:3604;}i:285;a:3:{i:0;s:5:"cdata";i:1;a:1:{i:0;s:107:" Novos formulário da SESU - deixa mais claro características de cada grupo, mas pulicações e Interpets ";}i:2;i:3608;}i:286;a:3:{i:0;s:18:"doublequoteopening";i:1;a:0:{}i:2;i:3715;}i:287;a:3:{i:0;s:5:"cdata";i:1;a:1:{i:0;s:9:"se perdem";}i:2;i:3716;}i:288;a:3:{i:0;s:18:"doublequoteclosing";i:1;a:0:{}i:2;i:3725;}i:289;a:3:{i:0;s:5:"cdata";i:1;a:1:{i:0;s:1:".";}i:2;i:3726;}i:290;a:3:{i:0;s:17:"listcontent_close";i:1;a:0:{}i:2;i:3727;}i:291;a:3:{i:0;s:14:"listitem_close";i:1;a:0:{}i:2;i:3727;}i:292;a:3:{i:0;s:13:"listitem_open";i:1;a:1:{i:0;i:1;}i:2;i:3727;}i:293;a:3:{i:0;s:16:"listcontent_open";i:1;a:0:{}i:2;i:3727;}i:294;a:3:{i:0;s:5:"cdata";i:1;a:1:{i:0;s:140:" Situação do Pablo e Cavalheiro: devem ser desligados e deve-se abrir processo de seleção. Ficarão como bolsistas até fim de Setembro.";}i:2;i:3731;}i:295;a:3:{i:0;s:17:"listcontent_close";i:1;a:0:{}i:2;i:3871;}i:296;a:3:{i:0;s:14:"listitem_close";i:1;a:0:{}i:2;i:3871;}i:297;a:3:{i:0;s:11:"listu_close";i:1;a:0:{}i:2;i:3871;}i:298;a:3:{i:0;s:13:"section_close";i:1;a:0:{}i:2;i:3873;}i:299;a:3:{i:0;s:12:"section_edit";i:1;a:4:{i:0;i:3574;i:1;i:3872;i:2;i:2;i:3;s:17:"17. Comitê Local";}i:2;i:3873;}i:300;a:3:{i:0;s:6:"header";i:1;a:3:{i:0;s:16:"18. Caixa do PET";i:1;i:2;i:2;i:3873;}i:2;i:3873;}i:301;a:3:{i:0;s:12:"section_open";i:1;a:1:{i:0;i:2;}i:2;i:3873;}i:302;a:3:{i:0;s:6:"p_open";i:1;a:0:{}i:2;i:3901;}i:303;a:3:{i:0;s:5:"cdata";i:1;a:1:{i:0;s:118:"
Mizusaki já recebeu o que faltava. Balanço: - final de Agosto: R$ 3030 - final: R$ 3189 Caixa irá para o PET-Docs.";}i:2;i:3902;}i:304;a:3:{i:0;s:7:"p_close";i:1;a:0:{}i:2;i:4020;}i:305;a:3:{i:0;s:13:"section_close";i:1;a:0:{}i:2;i:4022;}i:306;a:3:{i:0;s:12:"section_edit";i:1;a:4:{i:0;i:3873;i:1;i:4021;i:2;i:2;i:3;s:16:"18. Caixa do PET";}i:2;i:4022;}i:307;a:3:{i:0;s:6:"header";i:1;a:3:{i:0;s:21:"19. Inclusão Digital";i:1;i:2;i:2;i:4022;}i:2;i:4022;}i:308;a:3:{i:0;s:12:"section_open";i:1;a:1:{i:0;i:2;}i:2;i:4022;}i:309;a:3:{i:0;s:6:"p_open";i:1;a:0:{}i:2;i:4055;}i:310;a:3:{i:0;s:5:"cdata";i:1;a:1:{i:0;s:90:"
conhecer projeto da Sociologia on C.V., ajudá-los. Thiago e Zambiasi são responsáveis.";}i:2;i:4056;}i:311;a:3:{i:0;s:7:"p_close";i:1;a:0:{}i:2;i:4146;}i:312;a:3:{i:0;s:13:"section_close";i:1;a:0:{}i:2;i:4147;}i:313;a:3:{i:0;s:12:"section_edit";i:1;a:4:{i:0;i:4022;i:1;i:0;i:2;i:2;i:3;s:21:"19. Inclusão Digital";}i:2;i:4147;}i:314;a:3:{i:0;s:12:"document_end";i:1;a:0:{}i:2;i:4147;}}