a:214:{i:0;a:3:{i:0;s:14:"document_start";i:1;a:0:{}i:2;i:0;}i:1;a:3:{i:0;s:6:"p_open";i:1;a:0:{}i:2;i:0;}i:2;a:3:{i:0;s:7:"p_close";i:1;a:0:{}i:2;i:1;}i:3;a:3:{i:0;s:12:"section_edit";i:1;a:4:{i:0;i:-1;i:1;i:0;i:2;i:1;i:3;s:0:"";}i:2;i:1;}i:4;a:3:{i:0;s:6:"header";i:1;a:3:{i:0;s:29:"Ata da Reunião de 15/03/2006";i:1;i:1;i:2;i:1;}i:2;i:1;}i:5;a:3:{i:0;s:12:"section_open";i:1;a:1:{i:0;i:1;}i:2;i:1;}i:6;a:3:{i:0;s:6:"p_open";i:1;a:0:{}i:2;i:44;}i:7;a:3:{i:0;s:5:"cdata";i:1;a:1:{i:0;s:78:"
Presentes: Dante, Estevão, Fabiano, Felipe, Marcos, Nondillo, Thiago,Vicente";}i:2;i:45;}i:8;a:3:{i:0;s:7:"p_close";i:1;a:0:{}i:2;i:123;}i:9;a:3:{i:0;s:6:"p_open";i:1;a:0:{}i:2;i:123;}i:10;a:3:{i:0;s:5:"cdata";i:1;a:1:{i:0;s:15:"Relator: Marcos";}i:2;i:125;}i:11;a:3:{i:0;s:7:"p_close";i:1;a:0:{}i:2;i:140;}i:12;a:3:{i:0;s:6:"p_open";i:1;a:0:{}i:2;i:140;}i:13;a:3:{i:0;s:5:"cdata";i:1;a:1:{i:0;s:109:"Ps: Esta é a minha primeira Ata, qualquer erro que houver ou assunto que estiver faltando, é só me avisar.";}i:2;i:142;}i:14;a:3:{i:0;s:7:"p_close";i:1;a:0:{}i:2;i:251;}i:15;a:3:{i:0;s:13:"section_close";i:1;a:0:{}i:2;i:253;}i:16;a:3:{i:0;s:12:"section_edit";i:1;a:4:{i:0;i:1;i:1;i:252;i:2;i:1;i:3;s:29:"Ata da Reunião de 15/03/2006";}i:2;i:253;}i:17;a:3:{i:0;s:6:"header";i:1;a:3:{i:0;s:19:"1. Estranhos no PET";i:1;i:2;i:2;i:253;}i:2;i:253;}i:18;a:3:{i:0;s:12:"section_open";i:1;a:1:{i:0;i:2;}i:2;i:253;}i:19;a:3:{i:0;s:6:"p_open";i:1;a:0:{}i:2;i:284;}i:20;a:3:{i:0;s:5:"cdata";i:1;a:1:{i:0;s:188:"
Estevão reportou a entrada não autorizada de um segurança na sala do PET. Fabiano ficou encarregado de mandar um email notificando a Silvânia e de falar pessoalmente com o segurança.";}i:2;i:285;}i:21;a:3:{i:0;s:7:"p_close";i:1;a:0:{}i:2;i:473;}i:22;a:3:{i:0;s:13:"section_close";i:1;a:0:{}i:2;i:475;}i:23;a:3:{i:0;s:12:"section_edit";i:1;a:4:{i:0;i:253;i:1;i:474;i:2;i:2;i:3;s:19:"1. Estranhos no PET";}i:2;i:475;}i:24;a:3:{i:0;s:6:"header";i:1;a:3:{i:0;s:43:"2. Proposta de Projeto pelo Professor Weber";i:1;i:2;i:2;i:475;}i:2;i:475;}i:25;a:3:{i:0;s:12:"section_open";i:1;a:1:{i:0;i:2;}i:2;i:475;}i:26;a:3:{i:0;s:6:"p_open";i:1;a:0:{}i:2;i:530;}i:27;a:3:{i:0;s:5:"cdata";i:1;a:1:{i:0;s:296:"
O professor weber deu como proposta de projeto a criação de um simulador para a cadeira de Arquitetura de Computadores 2 para se finalizar em 2007. Thiago pediu para que o sistema fosse criado utilizando o material já criado para o Bolívar. Nondillo salientou a necessidade de portabilidade.";}i:2;i:531;}i:28;a:3:{i:0;s:7:"p_close";i:1;a:0:{}i:2;i:827;}i:29;a:3:{i:0;s:13:"section_close";i:1;a:0:{}i:2;i:829;}i:30;a:3:{i:0;s:12:"section_edit";i:1;a:4:{i:0;i:475;i:1;i:828;i:2;i:2;i:3;s:43:"2. Proposta de Projeto pelo Professor Weber";}i:2;i:829;}i:31;a:3:{i:0;s:6:"header";i:1;a:3:{i:0;s:43:"3. Proposta de Projeto pelo Professor Comba";i:1;i:2;i:2;i:829;}i:2;i:829;}i:32;a:3:{i:0;s:12:"section_open";i:1;a:1:{i:0;i:2;}i:2;i:829;}i:33;a:3:{i:0;s:6:"p_open";i:1;a:0:{}i:2;i:884;}i:34;a:3:{i:0;s:5:"cdata";i:1;a:1:{i:0;s:218:"
O professor Comba propôs a modelagem 3D do I.I. A professora Carla também foi consultada. Felipe e Marcos já começaram a organizar o projeto. Espera-se que um dos novos bolsistas selecionados participe do projeto.";}i:2;i:885;}i:35;a:3:{i:0;s:7:"p_close";i:1;a:0:{}i:2;i:1103;}i:36;a:3:{i:0;s:13:"section_close";i:1;a:0:{}i:2;i:1105;}i:37;a:3:{i:0;s:12:"section_edit";i:1;a:4:{i:0;i:829;i:1;i:1104;i:2;i:2;i:3;s:43:"3. Proposta de Projeto pelo Professor Comba";}i:2;i:1105;}i:38;a:3:{i:0;s:6:"header";i:1;a:3:{i:0;s:37:"4. Proposta de Projeto para o Vicente";i:1;i:2;i:2;i:1105;}i:2;i:1105;}i:39;a:3:{i:0;s:12:"section_open";i:1;a:1:{i:0;i:2;}i:2;i:1105;}i:40;a:3:{i:0;s:6:"p_open";i:1;a:0:{}i:2;i:1154;}i:41;a:3:{i:0;s:5:"cdata";i:1;a:1:{i:0;s:279:"
Marcos propôs que Vicente, que está interessado em um projeto com de pesquisa e ensino usando química, cria-se um programa de auxílio ao ensino de geometria em nível de segundo grau. Dante comentou a possibildade de integrar suporte para usuários com deficiência virtual.";}i:2;i:1155;}i:42;a:3:{i:0;s:7:"p_close";i:1;a:0:{}i:2;i:1434;}i:43;a:3:{i:0;s:13:"section_close";i:1;a:0:{}i:2;i:1436;}i:44;a:3:{i:0;s:12:"section_edit";i:1;a:4:{i:0;i:1105;i:1;i:1435;i:2;i:2;i:3;s:37:"4. Proposta de Projeto para o Vicente";}i:2;i:1436;}i:45;a:3:{i:0;s:6:"header";i:1;a:3:{i:0;s:32:"5. Proposta do Professor Roberto";i:1;i:2;i:2;i:1436;}i:2;i:1436;}i:46;a:3:{i:0;s:12:"section_open";i:1;a:1:{i:0;i:2;}i:2;i:1436;}i:47;a:3:{i:0;s:6:"p_open";i:1;a:0:{}i:2;i:1480;}i:48;a:3:{i:0;s:5:"cdata";i:1;a:1:{i:0;s:138:"
O professor Roberto propôs o uso de computação científica para a modelagem númerica de proteínas. Vicente e Thiago se interessaram.";}i:2;i:1481;}i:49;a:3:{i:0;s:7:"p_close";i:1;a:0:{}i:2;i:1619;}i:50;a:3:{i:0;s:13:"section_close";i:1;a:0:{}i:2;i:1621;}i:51;a:3:{i:0;s:12:"section_edit";i:1;a:4:{i:0;i:1436;i:1;i:1620;i:2;i:2;i:3;s:32:"5. Proposta do Professor Roberto";}i:2;i:1621;}i:52;a:3:{i:0;s:6:"header";i:1;a:3:{i:0;s:39:"6. Seleção dos novos Bolsistas do PET";i:1;i:2;i:2;i:1621;}i:2;i:1621;}i:53;a:3:{i:0;s:12:"section_open";i:1;a:1:{i:0;i:2;}i:2;i:1621;}i:54;a:3:{i:0;s:6:"p_open";i:1;a:0:{}i:2;i:1672;}i:55;a:3:{i:0;s:5:"cdata";i:1;a:1:{i:0;s:218:"
Foi dado um relatório da atual situação da seleção, e ficou decidido que a entrevista para a seleção ser´no dia 24/03 ás 4h, para que todos os selecionados possam comparecer, mesmo aqueles com aula no centro.";}i:2;i:1673;}i:56;a:3:{i:0;s:7:"p_close";i:1;a:0:{}i:2;i:1891;}i:57;a:3:{i:0;s:13:"section_close";i:1;a:0:{}i:2;i:1893;}i:58;a:3:{i:0;s:12:"section_edit";i:1;a:4:{i:0;i:1621;i:1;i:1892;i:2;i:2;i:3;s:39:"6. Seleção dos novos Bolsistas do PET";}i:2;i:1893;}i:59;a:3:{i:0;s:6:"header";i:1;a:3:{i:0;s:34:"7.Atividade cultural e Seminários";i:1;i:2;i:2;i:1893;}i:2;i:1893;}i:60;a:3:{i:0;s:12:"section_open";i:1;a:1:{i:0;i:2;}i:2;i:1893;}i:61;a:3:{i:0;s:6:"p_open";i:1;a:0:{}i:2;i:1939;}i:62;a:3:{i:0;s:5:"cdata";i:1;a:1:{i:0;s:111:"
Ficou decidido que esses pontos de pauta ficariam para a próxima semana para que todos possam trazer idéias.";}i:2;i:1940;}i:63;a:3:{i:0;s:7:"p_close";i:1;a:0:{}i:2;i:2051;}i:64;a:3:{i:0;s:13:"section_close";i:1;a:0:{}i:2;i:2053;}i:65;a:3:{i:0;s:12:"section_edit";i:1;a:4:{i:0;i:1893;i:1;i:2052;i:2;i:2;i:3;s:34:"7.Atividade cultural e Seminários";}i:2;i:2053;}i:66;a:3:{i:0;s:6:"header";i:1;a:3:{i:0;s:26:"8.Avisos do InterPET 21/03";i:1;i:2;i:2;i:2053;}i:2;i:2053;}i:67;a:3:{i:0;s:12:"section_open";i:1;a:1:{i:0;i:2;}i:2;i:2053;}i:68;a:3:{i:0;s:6:"p_open";i:1;a:0:{}i:2;i:2091;}i:69;a:3:{i:0;s:5:"cdata";i:1;a:1:{i:0;s:147:"
Fabiano avisou que haverá InterPET no dia 21/03 na Odonto, ás 19h, que todos deverão comparecer. O tema a ser debatido será a Portaria do PET.";}i:2;i:2092;}i:70;a:3:{i:0;s:7:"p_close";i:1;a:0:{}i:2;i:2239;}i:71;a:3:{i:0;s:13:"section_close";i:1;a:0:{}i:2;i:2241;}i:72;a:3:{i:0;s:12:"section_edit";i:1;a:4:{i:0;i:2053;i:1;i:2240;i:2;i:2;i:3;s:26:"8.Avisos do InterPET 21/03";}i:2;i:2241;}i:73;a:3:{i:0;s:6:"header";i:1;a:3:{i:0;s:27:"9. Avisos do InterPET 22/03";i:1;i:2;i:2;i:2241;}i:2;i:2241;}i:74;a:3:{i:0;s:12:"section_open";i:1;a:1:{i:0;i:2;}i:2;i:2241;}i:75;a:3:{i:0;s:6:"p_open";i:1;a:0:{}i:2;i:2280;}i:76;a:3:{i:0;s:5:"cdata";i:1;a:1:{i:0;s:171:"
Fabiano avisou que haverá um mini-InterPET no dia 22/03 na Psico, ás 19h30min, em que Thiago e Marcos deverão comparecer. O tema a ser debatido será a Ida ao Sul PET.";}i:2;i:2281;}i:77;a:3:{i:0;s:7:"p_close";i:1;a:0:{}i:2;i:2452;}i:78;a:3:{i:0;s:13:"section_close";i:1;a:0:{}i:2;i:2454;}i:79;a:3:{i:0;s:12:"section_edit";i:1;a:4:{i:0;i:2241;i:1;i:2453;i:2;i:2;i:3;s:27:"9. Avisos do InterPET 22/03";}i:2;i:2454;}i:80;a:3:{i:0;s:6:"header";i:1;a:3:{i:0;s:25:"10. Orçamento das Pilhas";i:1;i:2;i:2;i:2454;}i:2;i:2454;}i:81;a:3:{i:0;s:12:"section_open";i:1;a:1:{i:0;i:2;}i:2;i:2454;}i:82;a:3:{i:0;s:6:"p_open";i:1;a:0:{}i:2;i:2491;}i:83;a:3:{i:0;s:5:"cdata";i:1;a:1:{i:0;s:64:"
Fabiano fez três orçamentos e irá encaminhar para a Propesq.";}i:2;i:2492;}i:84;a:3:{i:0;s:7:"p_close";i:1;a:0:{}i:2;i:2556;}i:85;a:3:{i:0;s:13:"section_close";i:1;a:0:{}i:2;i:2558;}i:86;a:3:{i:0;s:12:"section_edit";i:1;a:4:{i:0;i:2454;i:1;i:2557;i:2;i:2;i:3;s:25:"10. Orçamento das Pilhas";}i:2;i:2558;}i:87;a:3:{i:0;s:6:"header";i:1;a:3:{i:0;s:16:"11. Certificados";i:1;i:2;i:2;i:2558;}i:2;i:2558;}i:88;a:3:{i:0;s:12:"section_open";i:1;a:1:{i:0;i:2;}i:2;i:2558;}i:89;a:3:{i:0;s:6:"p_open";i:1;a:0:{}i:2;i:2586;}i:90;a:3:{i:0;s:5:"cdata";i:1;a:1:{i:0;s:229:"
Estevão ficou responsável, com ajuda de Diego, de imprimir todos os relatórios necessários e encaminhar os certificados. O grupo deverá bancar o pagamento do certificods pertinentes ás atividades em que o grupo participou.";}i:2;i:2587;}i:91;a:3:{i:0;s:7:"p_close";i:1;a:0:{}i:2;i:2816;}i:92;a:3:{i:0;s:13:"section_close";i:1;a:0:{}i:2;i:2818;}i:93;a:3:{i:0;s:12:"section_edit";i:1;a:4:{i:0;i:2558;i:1;i:2817;i:2;i:2;i:3;s:16:"11. Certificados";}i:2;i:2818;}i:94;a:3:{i:0;s:6:"header";i:1;a:3:{i:0;s:16:"12.Comitê Local";i:1;i:2;i:2;i:2818;}i:2;i:2818;}i:95;a:3:{i:0;s:12:"section_open";i:1;a:1:{i:0;i:2;}i:2;i:2818;}i:96;a:3:{i:0;s:6:"p_open";i:1;a:0:{}i:2;i:2846;}i:97;a:3:{i:0;s:5:"cdata";i:1;a:1:{i:0;s:101:"
Fabiano relatou as decisões da reunião do comitê local. Comenta da má organização da reunião.";}i:2;i:2847;}i:98;a:3:{i:0;s:7:"p_close";i:1;a:0:{}i:2;i:2948;}i:99;a:3:{i:0;s:13:"section_close";i:1;a:0:{}i:2;i:2950;}i:100;a:3:{i:0;s:12:"section_edit";i:1;a:4:{i:0;i:2818;i:1;i:2949;i:2;i:2;i:3;s:16:"12.Comitê Local";}i:2;i:2950;}i:101;a:3:{i:0;s:6:"header";i:1;a:3:{i:0;s:39:"13. Comissão Pet-Ufrgs para a Portaria";i:1;i:2;i:2;i:2950;}i:2;i:2950;}i:102;a:3:{i:0;s:12:"section_open";i:1;a:1:{i:0;i:2;}i:2;i:2950;}i:103;a:3:{i:0;s:6:"p_open";i:1;a:0:{}i:2;i:3001;}i:104;a:3:{i:0;s:5:"cdata";i:1;a:1:{i:0;s:58:"
Diego relata os principais tópicos da última reunião:
";}i:2;i:3002;}i:105;a:3:{i:0;s:7:"p_close";i:1;a:0:{}i:2;i:3060;}i:106;a:3:{i:0;s:10:"listu_open";i:1;a:0:{}i:2;i:3060;}i:107;a:3:{i:0;s:13:"listitem_open";i:1;a:1:{i:0;i:1;}i:2;i:3060;}i:108;a:3:{i:0;s:16:"listcontent_open";i:1;a:0:{}i:2;i:3060;}i:109;a:3:{i:0;s:5:"cdata";i:1;a:1:{i:0;s:41:" Definição da Comissão de Avaliação.";}i:2;i:3064;}i:110;a:3:{i:0;s:17:"listcontent_close";i:1;a:0:{}i:2;i:3105;}i:111;a:3:{i:0;s:14:"listitem_close";i:1;a:0:{}i:2;i:3105;}i:112;a:3:{i:0;s:13:"listitem_open";i:1;a:1:{i:0;i:1;}i:2;i:3105;}i:113;a:3:{i:0;s:16:"listcontent_open";i:1;a:0:{}i:2;i:3105;}i:114;a:3:{i:0;s:5:"cdata";i:1;a:1:{i:0;s:148:" Em relação à avaliação dos petianos, o uso do I3 entrar em votação, porém foi decidido que um conceito K no histórico não será relevado.";}i:2;i:3109;}i:115;a:3:{i:0;s:17:"listcontent_close";i:1;a:0:{}i:2;i:3257;}i:116;a:3:{i:0;s:14:"listitem_close";i:1;a:0:{}i:2;i:3257;}i:117;a:3:{i:0;s:13:"listitem_open";i:1;a:1:{i:0;i:1;}i:2;i:3257;}i:118;a:3:{i:0;s:16:"listcontent_open";i:1;a:0:{}i:2;i:3257;}i:119;a:3:{i:0;s:5:"cdata";i:1;a:1:{i:0;s:51:" Vários pontos serão votados no próximo InterPET";}i:2;i:3261;}i:120;a:3:{i:0;s:17:"listcontent_close";i:1;a:0:{}i:2;i:3312;}i:121;a:3:{i:0;s:14:"listitem_close";i:1;a:0:{}i:2;i:3312;}i:122;a:3:{i:0;s:13:"listitem_open";i:1;a:1:{i:0;i:1;}i:2;i:3312;}i:123;a:3:{i:0;s:16:"listcontent_open";i:1;a:0:{}i:2;i:3312;}i:124;a:3:{i:0;s:5:"cdata";i:1;a:1:{i:0;s:74:" O limite de duas reprovações enquanto no PET foi bem aceito na reunião";}i:2;i:3316;}i:125;a:3:{i:0;s:17:"listcontent_close";i:1;a:0:{}i:2;i:3390;}i:126;a:3:{i:0;s:14:"listitem_close";i:1;a:0:{}i:2;i:3390;}i:127;a:3:{i:0;s:13:"listitem_open";i:1;a:1:{i:0;i:1;}i:2;i:3390;}i:128;a:3:{i:0;s:16:"listcontent_open";i:1;a:0:{}i:2;i:3390;}i:129;a:3:{i:0;s:5:"cdata";i:1;a:1:{i:0;s:101:" A evolução do PET e o valor da bolsa não deverão ser atrelados ou seguir o valos das bolsas CNPQ";}i:2;i:3394;}i:130;a:3:{i:0;s:17:"listcontent_close";i:1;a:0:{}i:2;i:3495;}i:131;a:3:{i:0;s:14:"listitem_close";i:1;a:0:{}i:2;i:3495;}i:132;a:3:{i:0;s:13:"listitem_open";i:1;a:1:{i:0;i:1;}i:2;i:3495;}i:133;a:3:{i:0;s:16:"listcontent_open";i:1;a:0:{}i:2;i:3495;}i:134;a:3:{i:0;s:5:"cdata";i:1;a:1:{i:0;s:83:" Deverá ser votado no InterPET também o artigo que trata da permanência do tutor";}i:2;i:3499;}i:135;a:3:{i:0;s:17:"listcontent_close";i:1;a:0:{}i:2;i:3582;}i:136;a:3:{i:0;s:14:"listitem_close";i:1;a:0:{}i:2;i:3582;}i:137;a:3:{i:0;s:11:"listu_close";i:1;a:0:{}i:2;i:3582;}i:138;a:3:{i:0;s:13:"section_close";i:1;a:0:{}i:2;i:3584;}i:139;a:3:{i:0;s:12:"section_edit";i:1;a:4:{i:0;i:2950;i:1;i:3583;i:2;i:2;i:3;s:39:"13. Comissão Pet-Ufrgs para a Portaria";}i:2;i:3584;}i:140;a:3:{i:0;s:6:"header";i:1;a:3:{i:0;s:48:"14. Planejamento Trimestral (Março até Agosto)";i:1;i:2;i:2;i:3584;}i:2;i:3584;}i:141;a:3:{i:0;s:12:"section_open";i:1;a:1:{i:0;i:2;}i:2;i:3584;}i:142;a:3:{i:0;s:6:"p_open";i:1;a:0:{}i:2;i:3644;}i:143;a:3:{i:0;s:5:"cdata";i:1;a:1:{i:0;s:285:"
O grupo decidiu encerrrar por completo o planejamento na próxima reunião, para que certas decisões possam ser feitas. Fabiano salientou que de acordo com a Portaria, deverá se usado um novo modelo para o relatório trimestral, porém o formulário do planejamento será o antigo.
";}i:2;i:3645;}i:144;a:3:{i:0;s:7:"p_close";i:1;a:0:{}i:2;i:3930;}i:145;a:3:{i:0;s:10:"listu_open";i:1;a:0:{}i:2;i:3930;}i:146;a:3:{i:0;s:13:"listitem_open";i:1;a:1:{i:0;i:1;}i:2;i:3930;}i:147;a:3:{i:0;s:16:"listcontent_open";i:1;a:0:{}i:2;i:3930;}i:148;a:3:{i:0;s:5:"cdata";i:1;a:1:{i:0;s:8:" Eventos";}i:2;i:3934;}i:149;a:3:{i:0;s:17:"listcontent_close";i:1;a:0:{}i:2;i:3942;}i:150;a:3:{i:0;s:10:"listu_open";i:1;a:0:{}i:2;i:3942;}i:151;a:3:{i:0;s:13:"listitem_open";i:1;a:1:{i:0;i:2;}i:2;i:3942;}i:152;a:3:{i:0;s:16:"listcontent_open";i:1;a:0:{}i:2;i:3942;}i:153;a:3:{i:0;s:5:"cdata";i:1;a:1:{i:0;s:15:" Portas Abertas";}i:2;i:3948;}i:154;a:3:{i:0;s:17:"listcontent_close";i:1;a:0:{}i:2;i:3963;}i:155;a:3:{i:0;s:14:"listitem_close";i:1;a:0:{}i:2;i:3963;}i:156;a:3:{i:0;s:13:"listitem_open";i:1;a:1:{i:0;i:2;}i:2;i:3963;}i:157;a:3:{i:0;s:16:"listcontent_open";i:1;a:0:{}i:2;i:3963;}i:158;a:3:{i:0;s:5:"cdata";i:1;a:1:{i:0;s:71:" RoboPET ( quais em específico depende do estado da visão dos rôbos)";}i:2;i:3969;}i:159;a:3:{i:0;s:17:"listcontent_close";i:1;a:0:{}i:2;i:4040;}i:160;a:3:{i:0;s:14:"listitem_close";i:1;a:0:{}i:2;i:4040;}i:161;a:3:{i:0;s:13:"listitem_open";i:1;a:1:{i:0;i:2;}i:2;i:4040;}i:162;a:3:{i:0;s:16:"listcontent_open";i:1;a:0:{}i:2;i:4040;}i:163;a:3:{i:0;s:5:"cdata";i:1;a:1:{i:0;s:1:" ";}i:2;i:4046;}i:164;a:3:{i:0;s:12:"internallink";i:1;a:2:{i:0;s:21:"/trac/wiki/GlobalTech";i:1;s:11:"GlobalTech?";}i:2;i:4047;}i:165;a:3:{i:0;s:5:"cdata";i:1;a:1:{i:0;s:90:" (Dante salientou que certos problemas na organização podem atrapalhar a participação)";}i:2;i:4084;}i:166;a:3:{i:0;s:17:"listcontent_close";i:1;a:0:{}i:2;i:4174;}i:167;a:3:{i:0;s:14:"listitem_close";i:1;a:0:{}i:2;i:4174;}i:168;a:3:{i:0;s:11:"listu_close";i:1;a:0:{}i:2;i:4174;}i:169;a:3:{i:0;s:14:"listitem_close";i:1;a:0:{}i:2;i:4174;}i:170;a:3:{i:0;s:11:"listu_close";i:1;a:0:{}i:2;i:4174;}i:171;a:3:{i:0;s:10:"listu_open";i:1;a:0:{}i:2;i:4175;}i:172;a:3:{i:0;s:13:"listitem_open";i:1;a:1:{i:0;i:1;}i:2;i:4175;}i:173;a:3:{i:0;s:16:"listcontent_open";i:1;a:0:{}i:2;i:4175;}i:174;a:3:{i:0;s:5:"cdata";i:1;a:1:{i:0;s:7:" Ensino";}i:2;i:4179;}i:175;a:3:{i:0;s:17:"listcontent_close";i:1;a:0:{}i:2;i:4186;}i:176;a:3:{i:0;s:10:"listu_open";i:1;a:0:{}i:2;i:4186;}i:177;a:3:{i:0;s:13:"listitem_open";i:1;a:1:{i:0;i:2;}i:2;i:4186;}i:178;a:3:{i:0;s:16:"listcontent_open";i:1;a:0:{}i:2;i:4186;}i:179;a:3:{i:0;s:5:"cdata";i:1;a:1:{i:0;s:73:" Bolívar e Simulador de ARQ2 (deverão ser incluídos em ensino também)";}i:2;i:4192;}i:180;a:3:{i:0;s:17:"listcontent_close";i:1;a:0:{}i:2;i:4265;}i:181;a:3:{i:0;s:14:"listitem_close";i:1;a:0:{}i:2;i:4265;}i:182;a:3:{i:0;s:13:"listitem_open";i:1;a:1:{i:0;i:2;}i:2;i:4265;}i:183;a:3:{i:0;s:16:"listcontent_open";i:1;a:0:{}i:2;i:4265;}i:184;a:3:{i:0;s:5:"cdata";i:1;a:1:{i:0;s:16:" Mini-Cursos de ";}i:2;i:4271;}i:185;a:3:{i:0;s:7:"acronym";i:1;a:1:{i:0;s:4:"HTML";}i:2;i:4287;}i:186;a:3:{i:0;s:5:"cdata";i:1;a:1:{i:0;s:6:" e GTK";}i:2;i:4291;}i:187;a:3:{i:0;s:17:"listcontent_close";i:1;a:0:{}i:2;i:4297;}i:188;a:3:{i:0;s:14:"listitem_close";i:1;a:0:{}i:2;i:4297;}i:189;a:3:{i:0;s:13:"listitem_open";i:1;a:1:{i:0;i:2;}i:2;i:4297;}i:190;a:3:{i:0;s:16:"listcontent_open";i:1;a:0:{}i:2;i:4297;}i:191;a:3:{i:0;s:5:"cdata";i:1;a:1:{i:0;s:113:" Análise de Currículos com os alunos franceses ou que foram à França (Thiago e Nondillo ficaram engarregados)";}i:2;i:4303;}i:192;a:3:{i:0;s:17:"listcontent_close";i:1;a:0:{}i:2;i:4416;}i:193;a:3:{i:0;s:14:"listitem_close";i:1;a:0:{}i:2;i:4416;}i:194;a:3:{i:0;s:11:"listu_close";i:1;a:0:{}i:2;i:4416;}i:195;a:3:{i:0;s:14:"listitem_close";i:1;a:0:{}i:2;i:4416;}i:196;a:3:{i:0;s:11:"listu_close";i:1;a:0:{}i:2;i:4416;}i:197;a:3:{i:0;s:10:"listu_open";i:1;a:0:{}i:2;i:4417;}i:198;a:3:{i:0;s:13:"listitem_open";i:1;a:1:{i:0;i:1;}i:2;i:4417;}i:199;a:3:{i:0;s:16:"listcontent_open";i:1;a:0:{}i:2;i:4417;}i:200;a:3:{i:0;s:5:"cdata";i:1;a:1:{i:0;s:9:" Pesquisa";}i:2;i:4421;}i:201;a:3:{i:0;s:17:"listcontent_close";i:1;a:0:{}i:2;i:4430;}i:202;a:3:{i:0;s:10:"listu_open";i:1;a:0:{}i:2;i:4430;}i:203;a:3:{i:0;s:13:"listitem_open";i:1;a:1:{i:0;i:2;}i:2;i:4430;}i:204;a:3:{i:0;s:16:"listcontent_open";i:1;a:0:{}i:2;i:4430;}i:205;a:3:{i:0;s:5:"cdata";i:1;a:1:{i:0;s:63:" Modelo 3D (ficou deteminado que será exclusivamente pesquisa)";}i:2;i:4436;}i:206;a:3:{i:0;s:17:"listcontent_close";i:1;a:0:{}i:2;i:4499;}i:207;a:3:{i:0;s:14:"listitem_close";i:1;a:0:{}i:2;i:4499;}i:208;a:3:{i:0;s:11:"listu_close";i:1;a:0:{}i:2;i:4499;}i:209;a:3:{i:0;s:14:"listitem_close";i:1;a:0:{}i:2;i:4499;}i:210;a:3:{i:0;s:11:"listu_close";i:1;a:0:{}i:2;i:4499;}i:211;a:3:{i:0;s:13:"section_close";i:1;a:0:{}i:2;i:4500;}i:212;a:3:{i:0;s:12:"section_edit";i:1;a:4:{i:0;i:3584;i:1;i:0;i:2;i:2;i:3;s:48:"14. Planejamento Trimestral (Março até Agosto)";}i:2;i:4500;}i:213;a:3:{i:0;s:12:"document_end";i:1;a:0:{}i:2;i:4500;}}