a:262:{i:0;a:3:{i:0;s:14:"document_start";i:1;a:0:{}i:2;i:0;}i:1;a:3:{i:0;s:6:"p_open";i:1;a:0:{}i:2;i:0;}i:2;a:3:{i:0;s:7:"p_close";i:1;a:0:{}i:2;i:1;}i:3;a:3:{i:0;s:12:"section_edit";i:1;a:4:{i:0;i:-1;i:1;i:0;i:2;i:1;i:3;s:0:"";}i:2;i:1;}i:4;a:3:{i:0;s:6:"header";i:1;a:3:{i:0;s:29:"Ata da Reunião de 26/07/2006";i:1;i:1;i:2;i:1;}i:2;i:1;}i:5;a:3:{i:0;s:12:"section_open";i:1;a:1:{i:0;i:1;}i:2;i:1;}i:6;a:3:{i:0;s:6:"p_open";i:1;a:0:{}i:2;i:44;}i:7;a:3:{i:0;s:5:"cdata";i:1;a:1:{i:0;s:150:"
Presentes: Alexandre, Dante, Estevão, Fabiano, Felipe, Gabriela, Lucas Cavalheiro, Lucas Mizusaki, Marcelo, Marcos, Nondillo, Pablo, Ricardo, Thiago";}i:2;i:45;}i:8;a:3:{i:0;s:7:"p_close";i:1;a:0:{}i:2;i:195;}i:9;a:3:{i:0;s:6:"p_open";i:1;a:0:{}i:2;i:195;}i:10;a:3:{i:0;s:5:"cdata";i:1;a:1:{i:0;s:11:"Ausentes: -";}i:2;i:197;}i:11;a:3:{i:0;s:7:"p_close";i:1;a:0:{}i:2;i:208;}i:12;a:3:{i:0;s:6:"p_open";i:1;a:0:{}i:2;i:208;}i:13;a:3:{i:0;s:5:"cdata";i:1;a:1:{i:0;s:25:"Relator: Lucas Cavalheiro";}i:2;i:210;}i:14;a:3:{i:0;s:7:"p_close";i:1;a:0:{}i:2;i:235;}i:15;a:3:{i:0;s:13:"section_close";i:1;a:0:{}i:2;i:237;}i:16;a:3:{i:0;s:12:"section_edit";i:1;a:4:{i:0;i:1;i:1;i:236;i:2;i:1;i:3;s:29:"Ata da Reunião de 26/07/2006";}i:2;i:237;}i:17;a:3:{i:0;s:6:"header";i:1;a:3:{i:0;s:9:"1. ENAPET";i:1;i:2;i:2;i:237;}i:2;i:237;}i:18;a:3:{i:0;s:12:"section_open";i:1;a:1:{i:0;i:2;}i:2;i:237;}i:19;a:3:{i:0;s:6:"p_open";i:1;a:0:{}i:2;i:258;}i:20;a:3:{i:0;s:5:"cdata";i:1;a:1:{i:0;s:716:"
Dante comentou sobre os acontecimentos do Enapet, as assembléias, considerando o evento, como um todo, positivo para o movimento Pet, já que conseguiu-se finalmente aprovar o regimento. Ressaltou também a ação da oposição no Enapet, que tentou desgastar as assembléias. Fabiano e Crippa comentaram que a oposição não apresentou chapa concorrente na eleição, o que caracterizou ainda mais os objetivos da oposição, que eram impedir ou retardar a aprovação do regimento. Thiago comentou sobre o posicionamendo da Prof. Iguatemy, que pareceu não ser favorável ao pet. Entre os comentários gerais sobre o evento, Fabiano comentou sobre a postura do Tiago (Pet Geografia) e Janaína (Pet Psicologia).";}i:2;i:259;}i:21;a:3:{i:0;s:7:"p_close";i:1;a:0:{}i:2;i:975;}i:22;a:3:{i:0;s:13:"section_close";i:1;a:0:{}i:2;i:977;}i:23;a:3:{i:0;s:12:"section_edit";i:1;a:4:{i:0;i:237;i:1;i:976;i:2;i:2;i:3;s:9:"1. ENAPET";}i:2;i:977;}i:24;a:3:{i:0;s:6:"header";i:1;a:3:{i:0;s:27:"2. Horas Pendentes (Enapet)";i:1;i:2;i:2;i:977;}i:2;i:977;}i:25;a:3:{i:0;s:12:"section_open";i:1;a:1:{i:0;i:2;}i:2;i:977;}i:26;a:3:{i:0;s:6:"p_open";i:1;a:0:{}i:2;i:1016;}i:27;a:3:{i:0;s:5:"cdata";i:1;a:1:{i:0;s:116:"
Todos menos o Thiago fizeram a solicitação e tiveram a solicitação aprovada. Thiago verificará o erro que fez.";}i:2;i:1017;}i:28;a:3:{i:0;s:7:"p_close";i:1;a:0:{}i:2;i:1133;}i:29;a:3:{i:0;s:13:"section_close";i:1;a:0:{}i:2;i:1135;}i:30;a:3:{i:0;s:12:"section_edit";i:1;a:4:{i:0;i:977;i:1;i:1134;i:2;i:2;i:3;s:27:"2. Horas Pendentes (Enapet)";}i:2;i:1135;}i:31;a:3:{i:0;s:6:"header";i:1;a:3:{i:0;s:22:"3. Certificados Enapet";i:1;i:2;i:2;i:1135;}i:2;i:1135;}i:32;a:3:{i:0;s:12:"section_open";i:1;a:1:{i:0;i:2;}i:2;i:1135;}i:33;a:3:{i:0;s:6:"p_open";i:1;a:0:{}i:2;i:1169;}i:34;a:3:{i:0;s:5:"cdata";i:1;a:1:{i:0;s:144:"
Entregar na Prograd xerox do certificado do Enapet juntamente com um relatório. Ficaram responsáveis de elaborar o relatório Flores e Pablo.";}i:2;i:1170;}i:35;a:3:{i:0;s:7:"p_close";i:1;a:0:{}i:2;i:1314;}i:36;a:3:{i:0;s:13:"section_close";i:1;a:0:{}i:2;i:1316;}i:37;a:3:{i:0;s:12:"section_edit";i:1;a:4:{i:0;i:1135;i:1;i:1315;i:2;i:2;i:3;s:22:"3. Certificados Enapet";}i:2;i:1316;}i:38;a:3:{i:0;s:6:"header";i:1;a:3:{i:0;s:9:"4. Pet-BR";i:1;i:2;i:2;i:1316;}i:2;i:1316;}i:39;a:3:{i:0;s:12:"section_open";i:1;a:1:{i:0;i:2;}i:2;i:1316;}i:40;a:3:{i:0;s:6:"p_open";i:1;a:0:{}i:2;i:1337;}i:41;a:3:{i:0;s:5:"cdata";i:1;a:1:{i:0;s:82:"
Nondillo comentou brevemente o que se passou na Pet-BR durante a semana do Enapet";}i:2;i:1338;}i:42;a:3:{i:0;s:7:"p_close";i:1;a:0:{}i:2;i:1420;}i:43;a:3:{i:0;s:13:"section_close";i:1;a:0:{}i:2;i:1422;}i:44;a:3:{i:0;s:12:"section_edit";i:1;a:4:{i:0;i:1316;i:1;i:1421;i:2;i:2;i:3;s:9:"4. Pet-BR";}i:2;i:1422;}i:45;a:3:{i:0;s:6:"header";i:1;a:3:{i:0;s:32:"5. Material Pet Matemática/UFSC";i:1;i:2;i:2;i:1422;}i:2;i:1422;}i:46;a:3:{i:0;s:12:"section_open";i:1;a:1:{i:0;i:2;}i:2;i:1422;}i:47;a:3:{i:0;s:6:"p_open";i:1;a:0:{}i:2;i:1466;}i:48;a:3:{i:0;s:5:"cdata";i:1;a:1:{i:0;s:183:"
Flores mostrou ao grupos um material entregue no GT do pessoal do Pet Matem. da UFSC. Dante comentou que seria interessante desenvolver material semelhante para o projeto do Roboedu.";}i:2;i:1467;}i:49;a:3:{i:0;s:7:"p_close";i:1;a:0:{}i:2;i:1650;}i:50;a:3:{i:0;s:13:"section_close";i:1;a:0:{}i:2;i:1652;}i:51;a:3:{i:0;s:12:"section_edit";i:1;a:4:{i:0;i:1422;i:1;i:1651;i:2;i:2;i:3;s:32:"5. Material Pet Matemática/UFSC";}i:2;i:1652;}i:52;a:3:{i:0;s:6:"header";i:1;a:3:{i:0;s:32:"6. Sites dos outros Pet da UFRGS";i:1;i:2;i:2;i:1652;}i:2;i:1652;}i:53;a:3:{i:0;s:12:"section_open";i:1;a:1:{i:0;i:2;}i:2;i:1652;}i:54;a:3:{i:0;s:6:"p_open";i:1;a:0:{}i:2;i:1696;}i:55;a:3:{i:0;s:5:"cdata";i:1;a:1:{i:0;s:154:"
Durante o Enapet, os outros Pet's comunicaram o Pablo de que seus sites já estão prontos e ficaram de enviar os dados para o Pablo atualizar a página.";}i:2;i:1697;}i:56;a:3:{i:0;s:7:"p_close";i:1;a:0:{}i:2;i:1851;}i:57;a:3:{i:0;s:13:"section_close";i:1;a:0:{}i:2;i:1853;}i:58;a:3:{i:0;s:12:"section_edit";i:1;a:4:{i:0;i:1652;i:1;i:1852;i:2;i:2;i:3;s:32:"6. Sites dos outros Pet da UFRGS";}i:2;i:1853;}i:59;a:3:{i:0;s:6:"header";i:1;a:3:{i:0;s:26:"7. Recepção aos Calouros";i:1;i:2;i:2;i:1853;}i:2;i:1853;}i:60;a:3:{i:0;s:12:"section_open";i:1;a:1:{i:0;i:2;}i:2;i:1853;}i:61;a:3:{i:0;s:6:"p_open";i:1;a:0:{}i:2;i:1891;}i:62;a:3:{i:0;s:5:"cdata";i:1;a:1:{i:0;s:151:"
Discutiu-se a possibilidade de fazer um contato inicial com os calouros. Ficou para a reunião da 1ª semana de aula a definição do que será feito.";}i:2;i:1892;}i:63;a:3:{i:0;s:7:"p_close";i:1;a:0:{}i:2;i:2043;}i:64;a:3:{i:0;s:13:"section_close";i:1;a:0:{}i:2;i:2045;}i:65;a:3:{i:0;s:12:"section_edit";i:1;a:4:{i:0;i:1853;i:1;i:2044;i:2;i:2;i:3;s:26:"7. Recepção aos Calouros";}i:2;i:2045;}i:66;a:3:{i:0;s:6:"header";i:1;a:3:{i:0;s:22:"8. Salão de Extensão";i:1;i:2;i:2;i:2045;}i:2;i:2045;}i:67;a:3:{i:0;s:12:"section_open";i:1;a:1:{i:0;i:2;}i:2;i:2045;}i:68;a:3:{i:0;s:6:"p_open";i:1;a:0:{}i:2;i:2079;}i:69;a:3:{i:0;s:5:"cdata";i:1;a:1:{i:0;s:150:"
Dante informou que poderemos inscrever trabalhos no evento. As possibilidades discutidas foram as seguintes: Roboedu, Museu e curso de Linux do Ceue.";}i:2;i:2080;}i:70;a:3:{i:0;s:7:"p_close";i:1;a:0:{}i:2;i:2230;}i:71;a:3:{i:0;s:13:"section_close";i:1;a:0:{}i:2;i:2232;}i:72;a:3:{i:0;s:12:"section_edit";i:1;a:4:{i:0;i:2045;i:1;i:2231;i:2;i:2;i:3;s:22:"8. Salão de Extensão";}i:2;i:2232;}i:73;a:3:{i:0;s:6:"header";i:1;a:3:{i:0;s:24:"9. Férias/horas do mês";i:1;i:2;i:2;i:2232;}i:2;i:2232;}i:74;a:3:{i:0;s:12:"section_open";i:1;a:1:{i:0;i:2;}i:2;i:2232;}i:75;a:3:{i:0;s:6:"p_open";i:1;a:0:{}i:2;i:2268;}i:76;a:3:{i:0;s:5:"cdata";i:1;a:1:{i:0;s:185:"
Definiu-se que os petianos devem cumprir 36h no mês, a semana de férias será a 3ª(31/07) e o fechamento das horas se dará na 4ª semana que corresponde à primeira semana de aula.";}i:2;i:2269;}i:77;a:3:{i:0;s:7:"p_close";i:1;a:0:{}i:2;i:2454;}i:78;a:3:{i:0;s:13:"section_close";i:1;a:0:{}i:2;i:2456;}i:79;a:3:{i:0;s:12:"section_edit";i:1;a:4:{i:0;i:2232;i:1;i:2455;i:2;i:2;i:3;s:24:"9. Férias/horas do mês";}i:2;i:2456;}i:80;a:3:{i:0;s:6:"header";i:1;a:3:{i:0;s:22:"10. Atividade Cultural";i:1;i:2;i:2;i:2456;}i:2;i:2456;}i:81;a:3:{i:0;s:12:"section_open";i:1;a:1:{i:0;i:2;}i:2;i:2456;}i:82;a:3:{i:0;s:6:"p_open";i:1;a:0:{}i:2;i:2490;}i:83;a:3:{i:0;s:5:"cdata";i:1;a:1:{i:0;s:18:"
Peça de Teatro:
";}i:2;i:2491;}i:84;a:3:{i:0;s:7:"p_close";i:1;a:0:{}i:2;i:2509;}i:85;a:3:{i:0;s:10:"quote_open";i:1;a:0:{}i:2;i:2509;}i:86;a:3:{i:0;s:5:"cdata";i:1;a:1:{i:0;s:96:" Theatro São Pedro, comédia, R$ 20,00, sábado Gasômetro, gratuito, quinta e sexta-feira, 21h";}i:2;i:2511;}i:87;a:3:{i:0;s:11:"quote_close";i:1;a:0:{}i:2;i:2607;}i:88;a:3:{i:0;s:13:"section_close";i:1;a:0:{}i:2;i:2609;}i:89;a:3:{i:0;s:12:"section_edit";i:1;a:4:{i:0;i:2456;i:1;i:2608;i:2;i:2;i:3;s:22:"10. Atividade Cultural";}i:2;i:2609;}i:90;a:3:{i:0;s:6:"header";i:1;a:3:{i:0;s:25:"11. Desligamento Nondillo";i:1;i:2;i:2;i:2609;}i:2;i:2609;}i:91;a:3:{i:0;s:12:"section_open";i:1;a:1:{i:0;i:2;}i:2;i:2609;}i:92;a:3:{i:0;s:6:"p_open";i:1;a:0:{}i:2;i:2646;}i:93;a:3:{i:0;s:5:"cdata";i:1;a:1:{i:0;s:177:"
Definiu-se que o Nondillo fará parte do grupo Pet Computação até 30 de Julho de 2006. Flores ficou responsável pelas tarefas buracráticas junto à prograd respectivas ao ";}i:2;i:2647;}i:94;a:3:{i:0;s:11:"strong_open";i:1;a:0:{}i:2;i:2824;}i:95;a:3:{i:0;s:5:"cdata";i:1;a:1:{i:0;s:24:"desligamento do Nondillo";}i:2;i:2826;}i:96;a:3:{i:0;s:12:"strong_close";i:1;a:0:{}i:2;i:2850;}i:97;a:3:{i:0;s:5:"cdata";i:1;a:1:{i:0;s:23:" e a efetivação como ";}i:2;i:2852;}i:98;a:3:{i:0;s:11:"strong_open";i:1;a:0:{}i:2;i:2875;}i:99;a:3:{i:0;s:5:"cdata";i:1;a:1:{i:0;s:8:"Bolsista";}i:2;i:2877;}i:100;a:3:{i:0;s:12:"strong_close";i:1;a:0:{}i:2;i:2885;}i:101;a:3:{i:0;s:5:"cdata";i:1;a:1:{i:0;s:14:" do Mizusaki. ";}i:2;i:2887;}i:102;a:3:{i:0;s:11:"strong_open";i:1;a:0:{}i:2;i:2901;}i:103;a:3:{i:0;s:5:"cdata";i:1;a:1:{i:0;s:41:"Fabiano ficou encarregado pela Tesouraria";}i:2;i:2903;}i:104;a:3:{i:0;s:12:"strong_close";i:1;a:0:{}i:2;i:2944;}i:105;a:3:{i:0;s:5:"cdata";i:1;a:1:{i:0;s:75:", sendo encarregado de efetuar e transmitir um balanço semestral ao grupo.";}i:2;i:2946;}i:106;a:3:{i:0;s:7:"p_close";i:1;a:0:{}i:2;i:3021;}i:107;a:3:{i:0;s:13:"section_close";i:1;a:0:{}i:2;i:3023;}i:108;a:3:{i:0;s:12:"section_edit";i:1;a:4:{i:0;i:2609;i:1;i:3022;i:2;i:2;i:3;s:25:"11. Desligamento Nondillo";}i:2;i:3023;}i:109;a:3:{i:0;s:6:"header";i:1;a:3:{i:0;s:24:"12. Planejamento Prograd";i:1;i:2;i:2;i:3023;}i:2;i:3023;}i:110;a:3:{i:0;s:12:"section_open";i:1;a:1:{i:0;i:2;}i:2;i:3023;}i:111;a:3:{i:0;s:6:"p_open";i:1;a:0:{}i:2;i:3059;}i:112;a:3:{i:0;s:5:"cdata";i:1;a:1:{i:0;s:108:"
Flores comunicou que os relatórios mensais da prograd devem ser colocados no trac até sexta-feira (28/07)";}i:2;i:3060;}i:113;a:3:{i:0;s:7:"p_close";i:1;a:0:{}i:2;i:3168;}i:114;a:3:{i:0;s:13:"section_close";i:1;a:0:{}i:2;i:3170;}i:115;a:3:{i:0;s:12:"section_edit";i:1;a:4:{i:0;i:3023;i:1;i:3169;i:2;i:2;i:3;s:24:"12. Planejamento Prograd";}i:2;i:3170;}i:116;a:3:{i:0;s:6:"header";i:1;a:3:{i:0;s:34:"13. Reunião com Marcelo da kaizen";i:1;i:2;i:2;i:3170;}i:2;i:3170;}i:117;a:3:{i:0;s:12:"section_open";i:1;a:1:{i:0;i:2;}i:2;i:3170;}i:118;a:3:{i:0;s:6:"p_open";i:1;a:0:{}i:2;i:3216;}i:119;a:3:{i:0;s:5:"cdata";i:1;a:1:{i:0;s:135:"
Zambiasi comunicou ao grupo que terá uma reunião com o representante da kaizen que definirá as estruturas para a parceria II/Kaizen";}i:2;i:3217;}i:120;a:3:{i:0;s:7:"p_close";i:1;a:0:{}i:2;i:3352;}i:121;a:3:{i:0;s:13:"section_close";i:1;a:0:{}i:2;i:3354;}i:122;a:3:{i:0;s:12:"section_edit";i:1;a:4:{i:0;i:3170;i:1;i:3353;i:2;i:2;i:3;s:34:"13. Reunião com Marcelo da kaizen";}i:2;i:3354;}i:123;a:3:{i:0;s:6:"header";i:1;a:3:{i:0;s:12:"14. Tecnopuc";i:1;i:2;i:2;i:3354;}i:2;i:3354;}i:124;a:3:{i:0;s:12:"section_open";i:1;a:1:{i:0;i:2;}i:2;i:3354;}i:125;a:3:{i:0;s:6:"p_open";i:1;a:0:{}i:2;i:3378;}i:126;a:3:{i:0;s:5:"cdata";i:1;a:1:{i:0;s:123:"
A visita ao tecnopuc ocorrerá no dia 27/07, às 14h30, prédio 96B, PUCRS. Os petianos devem estar 15 min antes no local.";}i:2;i:3379;}i:127;a:3:{i:0;s:7:"p_close";i:1;a:0:{}i:2;i:3502;}i:128;a:3:{i:0;s:13:"section_close";i:1;a:0:{}i:2;i:3504;}i:129;a:3:{i:0;s:12:"section_edit";i:1;a:4:{i:0;i:3354;i:1;i:3503;i:2;i:2;i:3;s:12:"14. Tecnopuc";}i:2;i:3504;}i:130;a:3:{i:0;s:6:"header";i:1;a:3:{i:0;s:30:"15. Discussão dos Relatórios";i:1;i:2;i:2;i:3504;}i:2;i:3504;}i:131;a:3:{i:0;s:12:"section_open";i:1;a:1:{i:0;i:2;}i:2;i:3504;}i:132;a:3:{i:0;s:6:"p_open";i:1;a:0:{}i:2;i:3546;}i:133;a:3:{i:0;s:5:"cdata";i:1;a:1:{i:0;s:184:"
Ficou marcada para quinta-feira, 27/07, às 12h, com duração máxima de 1h em vista ao item 14. Discutiu-se a possibilidade de pedir uma pizza para se realizar uma reunião-almoço.";}i:2;i:3547;}i:134;a:3:{i:0;s:7:"p_close";i:1;a:0:{}i:2;i:3731;}i:135;a:3:{i:0;s:13:"section_close";i:1;a:0:{}i:2;i:3733;}i:136;a:3:{i:0;s:12:"section_edit";i:1;a:4:{i:0;i:3504;i:1;i:3732;i:2;i:2;i:3;s:30:"15. Discussão dos Relatórios";}i:2;i:3733;}i:137;a:3:{i:0;s:6:"header";i:1;a:3:{i:0;s:37:"16. Integração com alunos franceses";i:1;i:2;i:2;i:3733;}i:2;i:3733;}i:138;a:3:{i:0;s:12:"section_open";i:1;a:1:{i:0;i:2;}i:2;i:3733;}i:139;a:3:{i:0;s:6:"p_open";i:1;a:0:{}i:2;i:3782;}i:140;a:3:{i:0;s:5:"cdata";i:1;a:1:{i:0;s:171:"
Será feita uma atividade de integração com os alunos que estão chegando da França no inicio do semestre letivo. Ficará definida a atividade (Pizza, churras, futebol";}i:2;i:3783;}i:141;a:3:{i:0;s:6:"entity";i:1;a:1:{i:0;s:3:"...";}i:2;i:3954;}i:142;a:3:{i:0;s:5:"cdata";i:1;a:1:{i:0;s:35:") na reunião de volta das férias.";}i:2;i:3957;}i:143;a:3:{i:0;s:7:"p_close";i:1;a:0:{}i:2;i:3992;}i:144;a:3:{i:0;s:13:"section_close";i:1;a:0:{}i:2;i:3994;}i:145;a:3:{i:0;s:12:"section_edit";i:1;a:4:{i:0;i:3733;i:1;i:3993;i:2;i:2;i:3;s:37:"16. Integração com alunos franceses";}i:2;i:3994;}i:146;a:3:{i:0;s:6:"header";i:1;a:3:{i:0;s:32:"17. Planejamento dos Mini-Cursos";i:1;i:2;i:2;i:3994;}i:2;i:3994;}i:147;a:3:{i:0;s:12:"section_open";i:1;a:1:{i:0;i:2;}i:2;i:3994;}i:148;a:3:{i:0;s:10:"listu_open";i:1;a:0:{}i:2;i:4039;}i:149;a:3:{i:0;s:13:"listitem_open";i:1;a:1:{i:0;i:1;}i:2;i:4039;}i:150;a:3:{i:0;s:16:"listcontent_open";i:1;a:0:{}i:2;i:4039;}i:151;a:3:{i:0;s:5:"cdata";i:1;a:1:{i:0;s:7:" Linux:";}i:2;i:4043;}i:152;a:3:{i:0;s:17:"listcontent_close";i:1;a:0:{}i:2;i:4050;}i:153;a:3:{i:0;s:10:"listu_open";i:1;a:0:{}i:2;i:4050;}i:154;a:3:{i:0;s:13:"listitem_open";i:1;a:1:{i:0;i:2;}i:2;i:4050;}i:155;a:3:{i:0;s:16:"listcontent_open";i:1;a:0:{}i:2;i:4050;}i:156;a:3:{i:0;s:5:"cdata";i:1;a:1:{i:0;s:99:" Ficará para o período de aula, a serem decididos posteriormente o laboratórios e as datas, etc.";}i:2;i:4056;}i:157;a:3:{i:0;s:17:"listcontent_close";i:1;a:0:{}i:2;i:4155;}i:158;a:3:{i:0;s:14:"listitem_close";i:1;a:0:{}i:2;i:4155;}i:159;a:3:{i:0;s:11:"listu_close";i:1;a:0:{}i:2;i:4155;}i:160;a:3:{i:0;s:14:"listitem_close";i:1;a:0:{}i:2;i:4155;}i:161;a:3:{i:0;s:13:"listitem_open";i:1;a:1:{i:0;i:1;}i:2;i:4155;}i:162;a:3:{i:0;s:16:"listcontent_open";i:1;a:0:{}i:2;i:4155;}i:163;a:3:{i:0;s:5:"cdata";i:1;a:1:{i:0;s:3:" C:";}i:2;i:4159;}i:164;a:3:{i:0;s:17:"listcontent_close";i:1;a:0:{}i:2;i:4162;}i:165;a:3:{i:0;s:10:"listu_open";i:1;a:0:{}i:2;i:4162;}i:166;a:3:{i:0;s:13:"listitem_open";i:1;a:1:{i:0;i:2;}i:2;i:4162;}i:167;a:3:{i:0;s:16:"listcontent_open";i:1;a:0:{}i:2;i:4162;}i:168;a:3:{i:0;s:5:"cdata";i:1;a:1:{i:0;s:58:" Ainda em fase de planejamento e organização do material";}i:2;i:4168;}i:169;a:3:{i:0;s:17:"listcontent_close";i:1;a:0:{}i:2;i:4226;}i:170;a:3:{i:0;s:14:"listitem_close";i:1;a:0:{}i:2;i:4226;}i:171;a:3:{i:0;s:11:"listu_close";i:1;a:0:{}i:2;i:4226;}i:172;a:3:{i:0;s:14:"listitem_close";i:1;a:0:{}i:2;i:4226;}i:173;a:3:{i:0;s:13:"listitem_open";i:1;a:1:{i:0;i:1;}i:2;i:4226;}i:174;a:3:{i:0;s:16:"listcontent_open";i:1;a:0:{}i:2;i:4226;}i:175;a:3:{i:0;s:5:"cdata";i:1;a:1:{i:0;s:6:" Html:";}i:2;i:4230;}i:176;a:3:{i:0;s:17:"listcontent_close";i:1;a:0:{}i:2;i:4236;}i:177;a:3:{i:0;s:10:"listu_open";i:1;a:0:{}i:2;i:4236;}i:178;a:3:{i:0;s:13:"listitem_open";i:1;a:1:{i:0;i:2;}i:2;i:4236;}i:179;a:3:{i:0;s:16:"listcontent_open";i:1;a:0:{}i:2;i:4236;}i:180;a:3:{i:0;s:5:"cdata";i:1;a:1:{i:0;s:103:" O curso será dado na 3ª semana de aula. Pablo está desenvolvendo o material juntamente com o Thiago";}i:2;i:4242;}i:181;a:3:{i:0;s:17:"listcontent_close";i:1;a:0:{}i:2;i:4345;}i:182;a:3:{i:0;s:14:"listitem_close";i:1;a:0:{}i:2;i:4345;}i:183;a:3:{i:0;s:11:"listu_close";i:1;a:0:{}i:2;i:4345;}i:184;a:3:{i:0;s:14:"listitem_close";i:1;a:0:{}i:2;i:4345;}i:185;a:3:{i:0;s:11:"listu_close";i:1;a:0:{}i:2;i:4345;}i:186;a:3:{i:0;s:13:"section_close";i:1;a:0:{}i:2;i:4347;}i:187;a:3:{i:0;s:12:"section_edit";i:1;a:4:{i:0;i:3994;i:1;i:4346;i:2;i:2;i:3;s:32:"17. Planejamento dos Mini-Cursos";}i:2;i:4347;}i:188;a:3:{i:0;s:6:"header";i:1;a:3:{i:0;s:46:"18. Acompanhamento das mudanças no currículo";i:1;i:2;i:2;i:4347;}i:2;i:4347;}i:189;a:3:{i:0;s:12:"section_open";i:1;a:1:{i:0;i:2;}i:2;i:4347;}i:190;a:3:{i:0;s:6:"p_open";i:1;a:0:{}i:2;i:4405;}i:191;a:3:{i:0;s:5:"cdata";i:1;a:1:{i:0;s:123:"
A comgrad comprometeu-se a comunicar ao Pet e graduação a análise das propostas desenvolvidas no Ciclo de Debates até ";}i:2;i:4406;}i:192;a:3:{i:0;s:11:"strong_open";i:1;a:0:{}i:2;i:4529;}i:193;a:3:{i:0;s:5:"cdata";i:1;a:1:{i:0;s:13:"7 de Setembro";}i:2;i:4531;}i:194;a:3:{i:0;s:12:"strong_close";i:1;a:0:{}i:2;i:4544;}i:195;a:3:{i:0;s:5:"cdata";i:1;a:1:{i:0;s:108:". Fabiano e Mizusaki (ECP) e Zambiasi e Crippa (CIC) se encarregaram de acompanhar mais de perto o processo.";}i:2;i:4546;}i:196;a:3:{i:0;s:7:"p_close";i:1;a:0:{}i:2;i:4654;}i:197;a:3:{i:0;s:13:"section_close";i:1;a:0:{}i:2;i:4656;}i:198;a:3:{i:0;s:12:"section_edit";i:1;a:4:{i:0;i:4347;i:1;i:4655;i:2;i:2;i:3;s:46:"18. Acompanhamento das mudanças no currículo";}i:2;i:4656;}i:199;a:3:{i:0;s:6:"header";i:1;a:3:{i:0;s:11:"19. Cameras";i:1;i:2;i:2;i:4656;}i:2;i:4656;}i:200;a:3:{i:0;s:12:"section_open";i:1;a:1:{i:0;i:2;}i:2;i:4656;}i:201;a:3:{i:0;s:6:"p_open";i:1;a:0:{}i:2;i:4679;}i:202;a:3:{i:0;s:5:"cdata";i:1;a:1:{i:0;s:83:"
Lucas Cavalheiro e Thiago expuseram um posicionamento sobre a camera do André da ";}i:2;i:4680;}i:203;a:3:{i:0;s:12:"internallink";i:1;a:2:{i:0;s:20:"/trac/wiki/TechRobot";i:1;s:10:"TechRobot?";}i:2;i:4763;}i:204;a:3:{i:0;s:5:"cdata";i:1;a:1:{i:0;s:2:": ";}i:2;i:4798;}i:205;a:3:{i:0;s:11:"strong_open";i:1;a:0:{}i:2;i:4800;}i:206;a:3:{i:0;s:5:"cdata";i:1;a:1:{i:0;s:48:"a princípio, a camera não serve para o Robopet";}i:2;i:4802;}i:207;a:3:{i:0;s:12:"strong_close";i:1;a:0:{}i:2;i:4850;}i:208;a:3:{i:0;s:5:"cdata";i:1;a:1:{i:0;s:200:", já que a câmera apresenta (aparentemente sem solução) uma correção automática de exposição, o que torna as cores (laranja, magenta e amarelo) muito próximas do branco, inviabilisando o PI.";}i:2;i:4852;}i:209;a:3:{i:0;s:7:"p_close";i:1;a:0:{}i:2;i:5052;}i:210;a:3:{i:0;s:13:"section_close";i:1;a:0:{}i:2;i:5054;}i:211;a:3:{i:0;s:12:"section_edit";i:1;a:4:{i:0;i:4656;i:1;i:5053;i:2;i:2;i:3;s:11:"19. Cameras";}i:2;i:5054;}i:212;a:3:{i:0;s:6:"header";i:1;a:3:{i:0;s:18:"20. Artigo Roboedu";i:1;i:2;i:2;i:5054;}i:2;i:5054;}i:213;a:3:{i:0;s:12:"section_open";i:1;a:1:{i:0;i:2;}i:2;i:5054;}i:214;a:3:{i:0;s:6:"p_open";i:1;a:0:{}i:2;i:5084;}i:215;a:3:{i:0;s:5:"cdata";i:1;a:1:{i:0;s:120:"
Thiago expos a possibilidade de uma publicação em um simpósio e uma revista na área de Informática na Educação. ";}i:2;i:5085;}i:216;a:3:{i:0;s:11:"strong_open";i:1;a:0:{}i:2;i:5205;}i:217;a:3:{i:0;s:5:"cdata";i:1;a:1:{i:0;s:26:"O deadline é 11 de Agosto";}i:2;i:5207;}i:218;a:3:{i:0;s:12:"strong_close";i:1;a:0:{}i:2;i:5233;}i:219;a:3:{i:0;s:5:"cdata";i:1;a:1:{i:0;s:117:". Os participantes do projeto do Roboedu se comprometeram a auxiliar, na medida do possível, na redação do artigo.";}i:2;i:5235;}i:220;a:3:{i:0;s:7:"p_close";i:1;a:0:{}i:2;i:5352;}i:221;a:3:{i:0;s:13:"section_close";i:1;a:0:{}i:2;i:5354;}i:222;a:3:{i:0;s:12:"section_edit";i:1;a:4:{i:0;i:5054;i:1;i:5353;i:2;i:2;i:3;s:18:"20. Artigo Roboedu";}i:2;i:5354;}i:223;a:3:{i:0;s:6:"header";i:1;a:3:{i:0;s:9:"21. Museu";i:1;i:2;i:2;i:5354;}i:2;i:5354;}i:224;a:3:{i:0;s:12:"section_open";i:1;a:1:{i:0;i:2;}i:2;i:5354;}i:225;a:3:{i:0;s:6:"p_open";i:1;a:0:{}i:2;i:5375;}i:226;a:3:{i:0;s:5:"cdata";i:1;a:1:{i:0;s:146:"
Dante comunicou suas idéias em relação ao desenvolvimento do museu na Semana Nacional de Tecnologia. Definiu-se parcialmente algumas idéias:
";}i:2;i:5376;}i:227;a:3:{i:0;s:7:"p_close";i:1;a:0:{}i:2;i:5522;}i:228;a:3:{i:0;s:10:"listu_open";i:1;a:0:{}i:2;i:5522;}i:229;a:3:{i:0;s:13:"listitem_open";i:1;a:1:{i:0;i:1;}i:2;i:5522;}i:230;a:3:{i:0;s:16:"listcontent_open";i:1;a:0:{}i:2;i:5522;}i:231;a:3:{i:0;s:5:"cdata";i:1;a:1:{i:0;s:25:" Gaúchos na Informática";}i:2;i:5526;}i:232;a:3:{i:0;s:17:"listcontent_close";i:1;a:0:{}i:2;i:5551;}i:233;a:3:{i:0;s:14:"listitem_close";i:1;a:0:{}i:2;i:5551;}i:234;a:3:{i:0;s:13:"listitem_open";i:1;a:1:{i:0;i:1;}i:2;i:5551;}i:235;a:3:{i:0;s:16:"listcontent_open";i:1;a:0:{}i:2;i:5551;}i:236;a:3:{i:0;s:5:"cdata";i:1;a:1:{i:0;s:73:" Entrevistar Navaux, Daltro, Lisboa (desenvolver um roteiro de perguntas)";}i:2;i:5555;}i:237;a:3:{i:0;s:17:"listcontent_close";i:1;a:0:{}i:2;i:5628;}i:238;a:3:{i:0;s:14:"listitem_close";i:1;a:0:{}i:2;i:5628;}i:239;a:3:{i:0;s:13:"listitem_open";i:1;a:1:{i:0;i:1;}i:2;i:5628;}i:240;a:3:{i:0;s:16:"listcontent_open";i:1;a:0:{}i:2;i:5628;}i:241;a:3:{i:0;s:5:"cdata";i:1;a:1:{i:0;s:94:" Fabiano informará um contato de um ECP para auxiliar na parte da comunicação, cameras, etc";}i:2;i:5632;}i:242;a:3:{i:0;s:17:"listcontent_close";i:1;a:0:{}i:2;i:5726;}i:243;a:3:{i:0;s:14:"listitem_close";i:1;a:0:{}i:2;i:5726;}i:244;a:3:{i:0;s:11:"listu_close";i:1;a:0:{}i:2;i:5726;}i:245;a:3:{i:0;s:13:"section_close";i:1;a:0:{}i:2;i:5728;}i:246;a:3:{i:0;s:12:"section_edit";i:1;a:4:{i:0;i:5354;i:1;i:5727;i:2;i:2;i:3;s:9:"21. Museu";}i:2;i:5728;}i:247;a:3:{i:0;s:6:"header";i:1;a:3:{i:0;s:9:"22. Seurs";i:1;i:2;i:2;i:5728;}i:2;i:5728;}i:248;a:3:{i:0;s:12:"section_open";i:1;a:1:{i:0;i:2;}i:2;i:5728;}i:249;a:3:{i:0;s:6:"p_open";i:1;a:0:{}i:2;i:5749;}i:250;a:3:{i:0;s:5:"cdata";i:1;a:1:{i:0;s:92:"
Thiago preparará os slides e decidirá se vai ou não à Rio Grande juntamente com o Dante";}i:2;i:5750;}i:251;a:3:{i:0;s:7:"p_close";i:1;a:0:{}i:2;i:5842;}i:252;a:3:{i:0;s:13:"section_close";i:1;a:0:{}i:2;i:5844;}i:253;a:3:{i:0;s:12:"section_edit";i:1;a:4:{i:0;i:5728;i:1;i:5843;i:2;i:2;i:3;s:9:"22. Seurs";}i:2;i:5844;}i:254;a:3:{i:0;s:6:"header";i:1;a:3:{i:0;s:33:"23. Certificados Ciclo de Debates";i:1;i:2;i:2;i:5844;}i:2;i:5844;}i:255;a:3:{i:0;s:12:"section_open";i:1;a:1:{i:0;i:2;}i:2;i:5844;}i:256;a:3:{i:0;s:6:"p_open";i:1;a:0:{}i:2;i:5889;}i:257;a:3:{i:0;s:5:"cdata";i:1;a:1:{i:0;s:47:"
Interessados comunicar Flores o seu interesse.";}i:2;i:5890;}i:258;a:3:{i:0;s:7:"p_close";i:1;a:0:{}i:2;i:5937;}i:259;a:3:{i:0;s:13:"section_close";i:1;a:0:{}i:2;i:5938;}i:260;a:3:{i:0;s:12:"section_edit";i:1;a:4:{i:0;i:5844;i:1;i:0;i:2;i:2;i:3;s:33:"23. Certificados Ciclo de Debates";}i:2;i:5938;}i:261;a:3:{i:0;s:12:"document_end";i:1;a:0:{}i:2;i:5938;}}