a:160:{i:0;a:3:{i:0;s:14:"document_start";i:1;a:0:{}i:2;i:0;}i:1;a:3:{i:0;s:6:"p_open";i:1;a:0:{}i:2;i:0;}i:2;a:3:{i:0;s:7:"p_close";i:1;a:0:{}i:2;i:1;}i:3;a:3:{i:0;s:12:"section_edit";i:1;a:4:{i:0;i:-1;i:1;i:0;i:2;i:1;i:3;s:0:"";}i:2;i:1;}i:4;a:3:{i:0;s:6:"header";i:1;a:3:{i:0;s:29:"Ata da Reunião de 06/07/2006";i:1;i:1;i:2;i:1;}i:2;i:1;}i:5;a:3:{i:0;s:12:"section_open";i:1;a:1:{i:0;i:1;}i:2;i:1;}i:6;a:3:{i:0;s:6:"p_open";i:1;a:0:{}i:2;i:44;}i:7;a:3:{i:0;s:5:"cdata";i:1;a:1:{i:0;s:150:"
Presentes: Alexandre, Dante, Estevão, Fabiano, Felipe, Gabriela, Lucas Cavalheiro, Lucas Mizusaki, Marcelo, Marcos, Nondillo, Pablo, Ricardo, Thiago";}i:2;i:45;}i:8;a:3:{i:0;s:7:"p_close";i:1;a:0:{}i:2;i:195;}i:9;a:3:{i:0;s:6:"p_open";i:1;a:0:{}i:2;i:195;}i:10;a:3:{i:0;s:5:"cdata";i:1;a:1:{i:0;s:11:"Ausentes: -";}i:2;i:197;}i:11;a:3:{i:0;s:7:"p_close";i:1;a:0:{}i:2;i:208;}i:12;a:3:{i:0;s:6:"p_open";i:1;a:0:{}i:2;i:208;}i:13;a:3:{i:0;s:5:"cdata";i:1;a:1:{i:0;s:15:"Relator: Felipe";}i:2;i:210;}i:14;a:3:{i:0;s:7:"p_close";i:1;a:0:{}i:2;i:225;}i:15;a:3:{i:0;s:13:"section_close";i:1;a:0:{}i:2;i:227;}i:16;a:3:{i:0;s:12:"section_edit";i:1;a:4:{i:0;i:1;i:1;i:226;i:2;i:1;i:3;s:29:"Ata da Reunião de 06/07/2006";}i:2;i:227;}i:17;a:3:{i:0;s:6:"header";i:1;a:3:{i:0;s:41:"1. Próxima Reunião e Confraternização";i:1;i:2;i:2;i:227;}i:2;i:227;}i:18;a:3:{i:0;s:12:"section_open";i:1;a:1:{i:0;i:2;}i:2;i:227;}i:19;a:3:{i:0;s:6:"p_open";i:1;a:0:{}i:2;i:280;}i:20;a:3:{i:0;s:5:"cdata";i:1;a:1:{i:0;s:553:"
Foi perguntada ao grupo qual dia e horário seriam feitas a próxima reunião e a confraternização. Dante comenta que não pode na quarta e quinta. Felipe e Alexandre não podem sexta; Gabriela e Pablo, segunda; Lucas Cavalheiro, terça. Acaba sendo decidido que a reunião será terça às 14h e a confraternização terça às 19h30min, na FAURGS. Estevão vai marcar o local com a Silvânia. Se estiver ocupado, marcará segunda. Se também estiver ocupado, será marcado terça em outro lugar. Deve ser em torno de 10 reais por pessoa, diz Dante.";}i:2;i:281;}i:21;a:3:{i:0;s:7:"p_close";i:1;a:0:{}i:2;i:834;}i:22;a:3:{i:0;s:6:"p_open";i:1;a:0:{}i:2;i:834;}i:23;a:3:{i:0;s:5:"cdata";i:1;a:1:{i:0;s:450:"== 2. Comitê Local – Tutoria ESEF== Pablo comenta como foi a reunião do Comitê Local sobre a escolha do novo tutor do PET ESEF. Havia dois candidatos: Alex e Janice. Alex foi o candidato que o Comitê Local gostou mais e se saiu melhor, bem como era o candidato preferido dos petianos da Educação Física. No entanto, ele não cumpria o requisito dos três últimos anos consecutivos de experiência em Exensão. Assim, Janice foi a escolhida.";}i:2;i:836;}i:24;a:3:{i:0;s:7:"p_close";i:1;a:0:{}i:2;i:1286;}i:25;a:3:{i:0;s:13:"section_close";i:1;a:0:{}i:2;i:1288;}i:26;a:3:{i:0;s:12:"section_edit";i:1;a:4:{i:0;i:227;i:1;i:1287;i:2;i:2;i:3;s:41:"1. Próxima Reunião e Confraternização";}i:2;i:1288;}i:27;a:3:{i:0;s:6:"header";i:1;a:3:{i:0;s:28:"3. Falta no Último Interpet";i:1;i:2;i:2;i:1288;}i:2;i:1288;}i:28;a:3:{i:0;s:12:"section_open";i:1;a:1:{i:0;i:2;}i:2;i:1288;}i:29;a:3:{i:0;s:6:"p_open";i:1;a:0:{}i:2;i:1328;}i:30;a:3:{i:0;s:5:"cdata";i:1;a:1:{i:0;s:154:"
Fabiano comenta que, de todos que haviam se comprometido em ir ao Interpet, somente ele foi. Ele pede explicações. Felipe, Marcos e Thiago se explicam.";}i:2;i:1329;}i:31;a:3:{i:0;s:7:"p_close";i:1;a:0:{}i:2;i:1483;}i:32;a:3:{i:0;s:13:"section_close";i:1;a:0:{}i:2;i:1485;}i:33;a:3:{i:0;s:12:"section_edit";i:1;a:4:{i:0;i:1288;i:1;i:1484;i:2;i:2;i:3;s:28:"3. Falta no Último Interpet";}i:2;i:1485;}i:34;a:3:{i:0;s:6:"header";i:1;a:3:{i:0;s:27:"4. Recepção dos Franceses";i:1;i:2;i:2;i:1485;}i:2;i:1485;}i:35;a:3:{i:0;s:12:"section_open";i:1;a:1:{i:0;i:2;}i:2;i:1485;}i:36;a:3:{i:0;s:6:"p_open";i:1;a:0:{}i:2;i:1524;}i:37;a:3:{i:0;s:5:"cdata";i:1;a:1:{i:0;s:373:"
Dante e Pablo comentam sobre como deve ser feita a nossa recepção aos franceses que chegarão. Indaga-se sobre se devemos fazer algo mais, como um futebol, e então é comentado que devemos convidá-los para a nossa confraternização. Pablo fica encarregado de convidar Simões por e-mail, dizendo que ele convide os outros franceses. Deve ser comentado sobre o preço.";}i:2;i:1525;}i:38;a:3:{i:0;s:7:"p_close";i:1;a:0:{}i:2;i:1898;}i:39;a:3:{i:0;s:13:"section_close";i:1;a:0:{}i:2;i:1900;}i:40;a:3:{i:0;s:12:"section_edit";i:1;a:4:{i:0;i:1485;i:1;i:1899;i:2;i:2;i:3;s:27:"4. Recepção dos Franceses";}i:2;i:1900;}i:41;a:3:{i:0;s:6:"header";i:1;a:3:{i:0;s:32:"5. Saída do Ônibus para ENAPET";i:1;i:2;i:2;i:1900;}i:2;i:1900;}i:42;a:3:{i:0;s:12:"section_open";i:1;a:1:{i:0;i:2;}i:2;i:1900;}i:43;a:3:{i:0;s:6:"p_open";i:1;a:0:{}i:2;i:1944;}i:44;a:3:{i:0;s:5:"cdata";i:1;a:1:{i:0;s:109:"
Fabiano comenta que no Interpet, foi decidido que a saída do ônibus para o ENAPET será às 9h de domingo.";}i:2;i:1945;}i:45;a:3:{i:0;s:7:"p_close";i:1;a:0:{}i:2;i:2054;}i:46;a:3:{i:0;s:13:"section_close";i:1;a:0:{}i:2;i:2056;}i:47;a:3:{i:0;s:12:"section_edit";i:1;a:4:{i:0;i:1900;i:1;i:2055;i:2;i:2;i:3;s:32:"5. Saída do Ônibus para ENAPET";}i:2;i:2056;}i:48;a:3:{i:0;s:6:"header";i:1;a:3:{i:0;s:18:"6. Lista PET-UFRGS";i:1;i:2;i:2;i:2056;}i:2;i:2056;}i:49;a:3:{i:0;s:12:"section_open";i:1;a:1:{i:0;i:2;}i:2;i:2056;}i:50;a:3:{i:0;s:6:"p_open";i:1;a:0:{}i:2;i:2086;}i:51;a:3:{i:0;s:5:"cdata";i:1;a:1:{i:0;s:384:"
Dante comenta que algumas coisas que foram faladas apenas por e-mail na lista pet-ufrgs acabaram aparecendo na petbr. Assim, foi comentado que na lista do pet-ufrgs deve estar apenas os atuais petianos. Dessa forma, Alexandre irá mandar e-mail para lista pedindo que cada grupo mande lsita com os e-mails dos atuais petianos e, após, ele excluirá os não-listados por grupo algum.";}i:2;i:2087;}i:52;a:3:{i:0;s:7:"p_close";i:1;a:0:{}i:2;i:2471;}i:53;a:3:{i:0;s:13:"section_close";i:1;a:0:{}i:2;i:2473;}i:54;a:3:{i:0;s:12:"section_edit";i:1;a:4:{i:0;i:2056;i:1;i:2472;i:2;i:2;i:3;s:18:"6. Lista PET-UFRGS";}i:2;i:2473;}i:55;a:3:{i:0;s:6:"header";i:1;a:3:{i:0;s:30:"7. Assembléia Geral do ENAPET";i:1;i:2;i:2;i:2473;}i:2;i:2473;}i:56;a:3:{i:0;s:12:"section_open";i:1;a:1:{i:0;i:2;}i:2;i:2473;}i:57;a:3:{i:0;s:6:"p_open";i:1;a:0:{}i:2;i:2515;}i:58;a:3:{i:0;s:5:"cdata";i:1;a:1:{i:0;s:272:"
Felipe vai ser o representante do PET Computação na discussão entre os PETs da UFRGS a respeito da Assembléia Geral do ENAPET. Fabiano pergunta se há outros interessados. Ninguém se voluntaria. Dante comenta alguns pontos a esse respeito, falando mal dos cearenses.";}i:2;i:2516;}i:59;a:3:{i:0;s:7:"p_close";i:1;a:0:{}i:2;i:2788;}i:60;a:3:{i:0;s:13:"section_close";i:1;a:0:{}i:2;i:2790;}i:61;a:3:{i:0;s:12:"section_edit";i:1;a:4:{i:0;i:2473;i:1;i:2789;i:2;i:2;i:3;s:30:"7. Assembléia Geral do ENAPET";}i:2;i:2790;}i:62;a:3:{i:0;s:6:"header";i:1;a:3:{i:0;s:25:"8. Organograma da CENAPET";i:1;i:2;i:2;i:2790;}i:2;i:2790;}i:63;a:3:{i:0;s:12:"section_open";i:1;a:1:{i:0;i:2;}i:2;i:2790;}i:64;a:3:{i:0;s:6:"p_open";i:1;a:0:{}i:2;i:2827;}i:65;a:3:{i:0;s:5:"cdata";i:1;a:1:{i:0;s:149:"
Dante comenta sobre o organograma da CENAPET. Felipe já fez uma parte e Pablo botou no site do pet. Dante e Felipe se reunirão para fazer o resto.";}i:2;i:2828;}i:66;a:3:{i:0;s:7:"p_close";i:1;a:0:{}i:2;i:2977;}i:67;a:3:{i:0;s:13:"section_close";i:1;a:0:{}i:2;i:2979;}i:68;a:3:{i:0;s:12:"section_edit";i:1;a:4:{i:0;i:2790;i:1;i:2978;i:2;i:2;i:3;s:25:"8. Organograma da CENAPET";}i:2;i:2979;}i:69;a:3:{i:0;s:6:"header";i:1;a:3:{i:0;s:23:"9. Diploma Amigo do PET";i:1;i:2;i:2;i:2979;}i:2;i:2979;}i:70;a:3:{i:0;s:12:"section_open";i:1;a:1:{i:0;i:2;}i:2;i:2979;}i:71;a:3:{i:0;s:6:"p_open";i:1;a:0:{}i:2;i:3014;}i:72;a:3:{i:0;s:5:"cdata";i:1;a:1:{i:0;s:521:"
Dante comenta que deveria ser feito um diploma de Amigo do PET, a ser dado para Ministro, Secretários, Iguatemy, Celso, Isaura, Júlio Linhares, Maria do Rosário, etc., os quais ajudaram o PET. O certificado seria entregue durante o ENAPET. Comenta-se que isso seria bom para quebrar a animosidade. Thiago fala que não deve-se cuidar para não esquecer ninguém. Após, o Conselho da CENAPET poderia selecionar pessoas de forma anual. Dante e Giovanni assinariam e o Ministro da Educação também. Marcos fará isso.";}i:2;i:3015;}i:73;a:3:{i:0;s:7:"p_close";i:1;a:0:{}i:2;i:3536;}i:74;a:3:{i:0;s:13:"section_close";i:1;a:0:{}i:2;i:3538;}i:75;a:3:{i:0;s:12:"section_edit";i:1;a:4:{i:0;i:2979;i:1;i:3537;i:2;i:2;i:3;s:23:"9. Diploma Amigo do PET";}i:2;i:3538;}i:76;a:3:{i:0;s:6:"header";i:1;a:3:{i:0;s:16:"10. RITAs e CETs";i:1;i:2;i:2;i:3538;}i:2;i:3538;}i:77;a:3:{i:0;s:12:"section_open";i:1;a:1:{i:0;i:2;}i:2;i:3538;}i:78;a:3:{i:0;s:6:"p_open";i:1;a:0:{}i:2;i:3566;}i:79;a:3:{i:0;s:5:"cdata";i:1;a:1:{i:0;s:484:"
Marcos fala que retirou da biblioteca os RITA's sobre Sistemas Operacionais, Computação Gráfica e Procesamento de Imagens, Robótica Sensorial e Motora, Microeletrônica e um chamado 'Rumo ao Título de Doutor e Mestre'. Marcos também comenta que está no pet-docs os documentos que contém os resumos dos trabalhos apresentado no Salão de Iniciação Científica de 2000-2005 na área de Ciências Exatas e da Terra. Todos deveriam dar uma olhada. Também dá para consultar o ";}i:2;i:3567;}i:80;a:3:{i:0;s:12:"externallink";i:1;a:2:{i:0;s:34:"http://www.periodicos.capes.gov.br";i:1;s:27:"www.periodicos.capes.gov.br";}i:2;i:4051;}i:81;a:3:{i:0;s:5:"cdata";i:1;a:1:{i:0;s:2:" .";}i:2;i:4078;}i:82;a:3:{i:0;s:7:"p_close";i:1;a:0:{}i:2;i:4080;}i:83;a:3:{i:0;s:13:"section_close";i:1;a:0:{}i:2;i:4082;}i:84;a:3:{i:0;s:12:"section_edit";i:1;a:4:{i:0;i:3538;i:1;i:4081;i:2;i:2;i:3;s:16:"10. RITAs e CETs";}i:2;i:4082;}i:85;a:3:{i:0;s:6:"header";i:1;a:3:{i:0;s:23:"11. Revista Abstração";i:1;i:2;i:2;i:4082;}i:2;i:4082;}i:86;a:3:{i:0;s:12:"section_open";i:1;a:1:{i:0;i:2;}i:2;i:4082;}i:87;a:3:{i:0;s:6:"p_open";i:1;a:0:{}i:2;i:4117;}i:88;a:3:{i:0;s:5:"cdata";i:1;a:1:{i:0;s:238:"
Thiago diz que não sabe o que apresentar de novo. Dante fala do Ceurs e que Thiago entrou no artigo. O artigo fala do PET (pesquisa, ensino e extensão). Dante comenta que ficou impressionado com as atividades do grupo dos últimos anos";}i:2;i:4118;}i:89;a:3:{i:0;s:7:"p_close";i:1;a:0:{}i:2;i:4356;}i:90;a:3:{i:0;s:13:"section_close";i:1;a:0:{}i:2;i:4358;}i:91;a:3:{i:0;s:12:"section_edit";i:1;a:4:{i:0;i:4082;i:1;i:4357;i:2;i:2;i:3;s:23:"11. Revista Abstração";}i:2;i:4358;}i:92;a:3:{i:0;s:6:"header";i:1;a:3:{i:0;s:23:"12. Cursos de Extensão";i:1;i:2;i:2;i:4358;}i:2;i:4358;}i:93;a:3:{i:0;s:12:"section_open";i:1;a:1:{i:0;i:2;}i:2;i:4358;}i:94;a:3:{i:0;s:10:"listu_open";i:1;a:0:{}i:2;i:4394;}i:95;a:3:{i:0;s:13:"listitem_open";i:1;a:1:{i:0;i:1;}i:2;i:4394;}i:96;a:3:{i:0;s:16:"listcontent_open";i:1;a:0:{}i:2;i:4394;}i:97;a:3:{i:0;s:5:"cdata";i:1;a:1:{i:0;s:155:" Curso de Linux: Thiago diz que tem 100 interessados, mas o Sérgio ainda não mandou todos os dados. Provavelmente, acontecerá uma semana após o ENAPET.";}i:2;i:4398;}i:98;a:3:{i:0;s:17:"listcontent_close";i:1;a:0:{}i:2;i:4553;}i:99;a:3:{i:0;s:14:"listitem_close";i:1;a:0:{}i:2;i:4553;}i:100;a:3:{i:0;s:13:"listitem_open";i:1;a:1:{i:0;i:1;}i:2;i:4553;}i:101;a:3:{i:0;s:16:"listcontent_open";i:1;a:0:{}i:2;i:4553;}i:102;a:3:{i:0;s:5:"cdata";i:1;a:1:{i:0;s:10:" Curso de ";}i:2;i:4557;}i:103;a:3:{i:0;s:7:"acronym";i:1;a:1:{i:0;s:4:"HTML";}i:2;i:4567;}i:104;a:3:{i:0;s:5:"cdata";i:1;a:1:{i:0;s:3:" e ";}i:2;i:4571;}i:105;a:3:{i:0;s:7:"acronym";i:1;a:1:{i:0;s:3:"PHP";}i:2;i:4574;}i:106;a:3:{i:0;s:5:"cdata";i:1;a:1:{i:0;s:68:": Thiago e Pablo. Será feito no fim de agosto, início de setembro.";}i:2;i:4577;}i:107;a:3:{i:0;s:17:"listcontent_close";i:1;a:0:{}i:2;i:4645;}i:108;a:3:{i:0;s:14:"listitem_close";i:1;a:0:{}i:2;i:4645;}i:109;a:3:{i:0;s:13:"listitem_open";i:1;a:1:{i:0;i:1;}i:2;i:4645;}i:110;a:3:{i:0;s:16:"listcontent_open";i:1;a:0:{}i:2;i:4645;}i:111;a:3:{i:0;s:5:"cdata";i:1;a:1:{i:0;s:111:" Curso de C: na próxima reunião, será visto os interessados. Provavelmente ocorrerá no início de Setembro.";}i:2;i:4649;}i:112;a:3:{i:0;s:17:"listcontent_close";i:1;a:0:{}i:2;i:4760;}i:113;a:3:{i:0;s:14:"listitem_close";i:1;a:0:{}i:2;i:4760;}i:114;a:3:{i:0;s:11:"listu_close";i:1;a:0:{}i:2;i:4760;}i:115;a:3:{i:0;s:13:"section_close";i:1;a:0:{}i:2;i:4762;}i:116;a:3:{i:0;s:12:"section_edit";i:1;a:4:{i:0;i:4358;i:1;i:4761;i:2;i:2;i:3;s:23:"12. Cursos de Extensão";}i:2;i:4762;}i:117;a:3:{i:0;s:6:"header";i:1;a:3:{i:0;s:12:"13. Tibério";i:1;i:2;i:2;i:4762;}i:2;i:4762;}i:118;a:3:{i:0;s:12:"section_open";i:1;a:1:{i:0;i:2;}i:2;i:4762;}i:119;a:3:{i:0;s:6:"p_open";i:1;a:0:{}i:2;i:4786;}i:120;a:3:{i:0;s:5:"cdata";i:1;a:1:{i:0;s:452:"
Dante comenta que o Tibério da ANU (Australian National University) está na UFRGS, tanto que veio até no Ciclo. Parece que há propostas concreta, com passagem e bolsa incluídos para ir para lá. É édido que se cole cartazes na Informática e Campus do Vale a esse respeito na semana que vem. Comenta-se que Tiberio dará um curso para pós-graduação no final de julho. Thiago fará o cadastramento dessa atividade e Marcelo fará os cartazes.";}i:2;i:4787;}i:121;a:3:{i:0;s:7:"p_close";i:1;a:0:{}i:2;i:5239;}i:122;a:3:{i:0;s:13:"section_close";i:1;a:0:{}i:2;i:5241;}i:123;a:3:{i:0;s:12:"section_edit";i:1;a:4:{i:0;i:4762;i:1;i:5240;i:2;i:2;i:3;s:12:"13. Tibério";}i:2;i:5241;}i:124;a:3:{i:0;s:6:"header";i:1;a:3:{i:0;s:25:"14. Encerramento do Ciclo";i:1;i:2;i:2;i:5241;}i:2;i:5241;}i:125;a:3:{i:0;s:12:"section_open";i:1;a:1:{i:0;i:2;}i:2;i:5241;}i:126;a:3:{i:0;s:6:"p_open";i:1;a:0:{}i:2;i:5278;}i:127;a:3:{i:0;s:5:"cdata";i:1;a:1:{i:0;s:704:"
Foi entregue os documentos do Ciclo e Currículos para os diretores e coordenadores da CONGRAD. Foi dado um prazo até o início das aulas para que eles dêem notícias sobre o currículo. Fabiano diz que Cecília, representante discente da ECP, respondeu alguns tópicos. Marcos perguntará a Weber qual a data para ocorrer mudanças no currículo. Marcelo, Felipe e Thiago contam a história de Categorias Computacionais. Fabiano fala de Eng. De Software com o professor Pimenta, que fez uma avaliação aberta e citou o Ciclo diversas vezes. É comentado que TCP já está na mira do pessoal encarregado. Foi comentado também que, no geral, a discussão do currículo da ECP foi melhor que a do CIC.";}i:2;i:5279;}i:128;a:3:{i:0;s:7:"p_close";i:1;a:0:{}i:2;i:5983;}i:129;a:3:{i:0;s:13:"section_close";i:1;a:0:{}i:2;i:5985;}i:130;a:3:{i:0;s:12:"section_edit";i:1;a:4:{i:0;i:5241;i:1;i:5984;i:2;i:2;i:3;s:25:"14. Encerramento do Ciclo";}i:2;i:5985;}i:131;a:3:{i:0;s:6:"header";i:1;a:3:{i:0;s:10:"15. Kaisen";i:1;i:2;i:2;i:5985;}i:2;i:5985;}i:132;a:3:{i:0;s:12:"section_open";i:1;a:1:{i:0;i:2;}i:2;i:5985;}i:133;a:3:{i:0;s:6:"p_open";i:1;a:0:{}i:2;i:6007;}i:134;a:3:{i:0;s:5:"cdata";i:1;a:1:{i:0;s:281:"
Marcelo se interessou. Dante fala que querem contribuir para conhecimento de tecnologias de banco de dados. Será oferecido palestra ou mini-cruso. Marcelo falará com cara da Kaisen. Marcelo comenta que, como a Dell está saindo do Instituto, alguém deveria entrar no seu lugar.";}i:2;i:6008;}i:135;a:3:{i:0;s:7:"p_close";i:1;a:0:{}i:2;i:6289;}i:136;a:3:{i:0;s:13:"section_close";i:1;a:0:{}i:2;i:6291;}i:137;a:3:{i:0;s:12:"section_edit";i:1;a:4:{i:0;i:5985;i:1;i:6290;i:2;i:2;i:3;s:10:"15. Kaisen";}i:2;i:6291;}i:138;a:3:{i:0;s:6:"header";i:1;a:3:{i:0;s:14:"16. Techno PUC";i:1;i:2;i:2;i:6291;}i:2;i:6291;}i:139;a:3:{i:0;s:12:"section_open";i:1;a:1:{i:0;i:2;}i:2;i:6291;}i:140;a:3:{i:0;s:6:"p_open";i:1;a:0:{}i:2;i:6317;}i:141;a:3:{i:0;s:5:"cdata";i:1;a:1:{i:0;s:82:"
Pablo confirmará local exato e horário. Falará novamente na próxima reunião.";}i:2;i:6318;}i:142;a:3:{i:0;s:7:"p_close";i:1;a:0:{}i:2;i:6400;}i:143;a:3:{i:0;s:13:"section_close";i:1;a:0:{}i:2;i:6402;}i:144;a:3:{i:0;s:12:"section_edit";i:1;a:4:{i:0;i:6291;i:1;i:6401;i:2;i:2;i:3;s:14:"16. Techno PUC";}i:2;i:6402;}i:145;a:3:{i:0;s:6:"header";i:1;a:3:{i:0;s:11:"17. Simões";i:1;i:2;i:2;i:6402;}i:2;i:6402;}i:146;a:3:{i:0;s:12:"section_open";i:1;a:1:{i:0;i:2;}i:2;i:6402;}i:147;a:3:{i:0;s:6:"p_open";i:1;a:0:{}i:2;i:6425;}i:148;a:3:{i:0;s:5:"cdata";i:1;a:1:{i:0;s:185:"
Fabiano pergunta sobre o dia que Simões chega. Dante diz que ele chegará na segunda ou terça e devemos levá-lo ao LRI. O local físico onde ele estará é ao lado da sala do Dante.";}i:2;i:6426;}i:149;a:3:{i:0;s:7:"p_close";i:1;a:0:{}i:2;i:6611;}i:150;a:3:{i:0;s:13:"section_close";i:1;a:0:{}i:2;i:6613;}i:151;a:3:{i:0;s:12:"section_edit";i:1;a:4:{i:0;i:6402;i:1;i:6612;i:2;i:2;i:3;s:11:"17. Simões";}i:2;i:6613;}i:152;a:3:{i:0;s:6:"header";i:1;a:3:{i:0;s:22:"18. Atividade Cultural";i:1;i:2;i:2;i:6613;}i:2;i:6613;}i:153;a:3:{i:0;s:12:"section_open";i:1;a:1:{i:0;i:2;}i:2;i:6613;}i:154;a:3:{i:0;s:6:"p_open";i:1;a:0:{}i:2;i:6647;}i:155;a:3:{i:0;s:5:"cdata";i:1;a:1:{i:0;s:30:"
Pensar para a semana que vem.";}i:2;i:6648;}i:156;a:3:{i:0;s:7:"p_close";i:1;a:0:{}i:2;i:6678;}i:157;a:3:{i:0;s:13:"section_close";i:1;a:0:{}i:2;i:6679;}i:158;a:3:{i:0;s:12:"section_edit";i:1;a:4:{i:0;i:6613;i:1;i:0;i:2;i:2;i:3;s:22:"18. Atividade Cultural";}i:2;i:6679;}i:159;a:3:{i:0;s:12:"document_end";i:1;a:0:{}i:2;i:6679;}}