a:272:{i:0;a:3:{i:0;s:14:"document_start";i:1;a:0:{}i:2;i:0;}i:1;a:3:{i:0;s:6:"p_open";i:1;a:0:{}i:2;i:0;}i:2;a:3:{i:0;s:7:"p_close";i:1;a:0:{}i:2;i:1;}i:3;a:3:{i:0;s:12:"section_edit";i:1;a:4:{i:0;i:-1;i:1;i:0;i:2;i:1;i:3;s:0:"";}i:2;i:1;}i:4;a:3:{i:0;s:6:"header";i:1;a:3:{i:0;s:40:"Ata da Reunião de 28 de Outubro de 2008";i:1;i:1;i:2;i:1;}i:2;i:1;}i:5;a:3:{i:0;s:12:"section_open";i:1;a:1:{i:0;i:1;}i:2;i:1;}i:6;a:3:{i:0;s:10:"listu_open";i:1;a:0:{}i:2;i:56;}i:7;a:3:{i:0;s:13:"listitem_open";i:1;a:1:{i:0;i:1;}i:2;i:56;}i:8;a:3:{i:0;s:16:"listcontent_open";i:1;a:0:{}i:2;i:56;}i:9;a:3:{i:0;s:5:"cdata";i:1;a:1:{i:0;s:170:" Presentes: Antônio, Bruno Albrecht, Bruno Guedes, Bruno Jurkovski, Cassiana, Fábio, Felipe, Gabriel, Kauê, Leonardo, Lucas, Marcos, Matheus, Matheus Proença e Tyron;";}i:2;i:60;}i:10;a:3:{i:0;s:17:"listcontent_close";i:1;a:0:{}i:2;i:230;}i:11;a:3:{i:0;s:14:"listitem_close";i:1;a:0:{}i:2;i:230;}i:12;a:3:{i:0;s:13:"listitem_open";i:1;a:1:{i:0;i:1;}i:2;i:230;}i:13;a:3:{i:0;s:16:"listcontent_open";i:1;a:0:{}i:2;i:230;}i:14;a:3:{i:0;s:5:"cdata";i:1;a:1:{i:0;s:17:" Ausentes: Dante;";}i:2;i:234;}i:15;a:3:{i:0;s:17:"listcontent_close";i:1;a:0:{}i:2;i:251;}i:16;a:3:{i:0;s:14:"listitem_close";i:1;a:0:{}i:2;i:251;}i:17;a:3:{i:0;s:13:"listitem_open";i:1;a:1:{i:0;i:1;}i:2;i:251;}i:18;a:3:{i:0;s:16:"listcontent_open";i:1;a:0:{}i:2;i:251;}i:19;a:3:{i:0;s:5:"cdata";i:1;a:1:{i:0;s:144:" Saídas Adiantadas: Bruno Guedes e Matheus Proença (sairam para a reunião do grupo InterPET), Felipe e Marcos (sairam para dar o curso de C).";}i:2;i:255;}i:20;a:3:{i:0;s:17:"listcontent_close";i:1;a:0:{}i:2;i:399;}i:21;a:3:{i:0;s:14:"listitem_close";i:1;a:0:{}i:2;i:399;}i:22;a:3:{i:0;s:13:"listitem_open";i:1;a:1:{i:0;i:1;}i:2;i:399;}i:23;a:3:{i:0;s:16:"listcontent_open";i:1;a:0:{}i:2;i:399;}i:24;a:3:{i:0;s:5:"cdata";i:1;a:1:{i:0;s:16:" Relator: Tyron.";}i:2;i:403;}i:25;a:3:{i:0;s:17:"listcontent_close";i:1;a:0:{}i:2;i:419;}i:26;a:3:{i:0;s:14:"listitem_close";i:1;a:0:{}i:2;i:419;}i:27;a:3:{i:0;s:11:"listu_close";i:1;a:0:{}i:2;i:419;}i:28;a:3:{i:0;s:13:"section_close";i:1;a:0:{}i:2;i:421;}i:29;a:3:{i:0;s:12:"section_edit";i:1;a:4:{i:0;i:1;i:1;i:420;i:2;i:1;i:3;s:40:"Ata da Reunião de 28 de Outubro de 2008";}i:2;i:421;}i:30;a:3:{i:0;s:6:"header";i:1;a:3:{i:0;s:9:"1. Lanche";i:1;i:2;i:2;i:421;}i:2;i:421;}i:31;a:3:{i:0;s:12:"section_open";i:1;a:1:{i:0;i:2;}i:2;i:421;}i:32;a:3:{i:0;s:6:"p_open";i:1;a:0:{}i:2;i:442;}i:33;a:3:{i:0;s:5:"cdata";i:1;a:1:{i:0;s:77:"
Antônio trouxe. Faltaram duas Negrescos e um Waffer, que ele promete repor.";}i:2;i:443;}i:34;a:3:{i:0;s:7:"p_close";i:1;a:0:{}i:2;i:520;}i:35;a:3:{i:0;s:13:"section_close";i:1;a:0:{}i:2;i:522;}i:36;a:3:{i:0;s:12:"section_edit";i:1;a:4:{i:0;i:421;i:1;i:521;i:2;i:2;i:3;s:9:"1. Lanche";}i:2;i:522;}i:37;a:3:{i:0;s:6:"header";i:1;a:3:{i:0;s:29:"2. InterPET (Felipe e Guedes)";i:1;i:2;i:2;i:522;}i:2;i:522;}i:38;a:3:{i:0;s:12:"section_open";i:1;a:1:{i:0;i:2;}i:2;i:522;}i:39;a:3:{i:0;s:6:"p_open";i:1;a:0:{}i:2;i:563;}i:40;a:3:{i:0;s:5:"cdata";i:1;a:1:{i:0;s:417:"
Felipe e Guedes acham melhor ficar na reunião do grupo. Entretanto, o grupo decide que nossa participação na reunião do InterPET é importante! Como o Felipe tem Curso de C, ficou decidido que o Proença e o Guedes devem ir. Proença perderá seu ponto de falta, mas continua na fila do Interpetão. Guedes havia sido escolhido por ter faltado ao Interpetão. Na próxima reunião, Felipe deverá estar presente.";}i:2;i:564;}i:41;a:3:{i:0;s:7:"p_close";i:1;a:0:{}i:2;i:981;}i:42;a:3:{i:0;s:13:"section_close";i:1;a:0:{}i:2;i:983;}i:43;a:3:{i:0;s:12:"section_edit";i:1;a:4:{i:0;i:522;i:1;i:982;i:2;i:2;i:3;s:29:"2. InterPET (Felipe e Guedes)";}i:2;i:983;}i:44;a:3:{i:0;s:6:"header";i:1;a:3:{i:0;s:45:"3. Representante Discente (Proença e Guedes)";i:1;i:2;i:2;i:983;}i:2;i:983;}i:45;a:3:{i:0;s:12:"section_open";i:1;a:1:{i:0;i:2;}i:2;i:983;}i:46;a:3:{i:0;s:6:"p_open";i:1;a:0:{}i:2;i:1040;}i:47;a:3:{i:0;s:5:"cdata";i:1;a:1:{i:0;s:81:"
Representantes Discentes da ECP continuam sendo petianos! Parabéns aos colegas!";}i:2;i:1041;}i:48;a:3:{i:0;s:7:"p_close";i:1;a:0:{}i:2;i:1122;}i:49;a:3:{i:0;s:13:"section_close";i:1;a:0:{}i:2;i:1124;}i:50;a:3:{i:0;s:12:"section_edit";i:1;a:4:{i:0;i:983;i:1;i:1123;i:2;i:2;i:3;s:45:"3. Representante Discente (Proença e Guedes)";}i:2;i:1124;}i:51;a:3:{i:0;s:6:"header";i:1;a:3:{i:0;s:47:"4. Trabalhos inadequados para o PET (grupo PET)";i:1;i:2;i:2;i:1124;}i:2;i:1124;}i:52;a:3:{i:0;s:12:"section_open";i:1;a:1:{i:0;i:2;}i:2;i:1124;}i:53;a:3:{i:0;s:6:"p_open";i:1;a:0:{}i:2;i:1183;}i:54;a:3:{i:0;s:5:"cdata";i:1;a:1:{i:0;s:39:"
Ponto adiado para a próxima reunião ";}i:2;i:1184;}i:55;a:3:{i:0;s:6:"entity";i:1;a:1:{i:0;s:2:"--";}i:2;i:1223;}i:56;a:3:{i:0;s:5:"cdata";i:1;a:1:{i:0;s:36:"&gt; necessita a presença do Dante.";}i:2;i:1225;}i:57;a:3:{i:0;s:7:"p_close";i:1;a:0:{}i:2;i:1261;}i:58;a:3:{i:0;s:13:"section_close";i:1;a:0:{}i:2;i:1263;}i:59;a:3:{i:0;s:12:"section_edit";i:1;a:4:{i:0;i:1124;i:1;i:1262;i:2;i:2;i:3;s:47:"4. Trabalhos inadequados para o PET (grupo PET)";}i:2;i:1263;}i:60;a:3:{i:0;s:6:"header";i:1;a:3:{i:0;s:57:"5. Word 2003 não está funcionando na Juliana (Cassiana)";i:1;i:2;i:2;i:1263;}i:2;i:1263;}i:61;a:3:{i:0;s:12:"section_open";i:1;a:1:{i:0;i:2;}i:2;i:1263;}i:62;a:3:{i:0;s:6:"p_open";i:1;a:0:{}i:2;i:1332;}i:63;a:3:{i:0;s:5:"cdata";i:1;a:1:{i:0;s:342:"
Cassiana falou que qualquer documento aberto no Word na Juliana é automaticamente fechado. O grupo diz que isso ocorre com diversos programas. Bruno se comprometeu em olhar. Comentando sobre a formatação dos PC's, Tyron lembrou que o Camaro (LRI) deveria ter sido formatado. Bruno vai tentar formatá-lo na quinta, ou assim que possível.";}i:2;i:1333;}i:64;a:3:{i:0;s:7:"p_close";i:1;a:0:{}i:2;i:1675;}i:65;a:3:{i:0;s:13:"section_close";i:1;a:0:{}i:2;i:1677;}i:66;a:3:{i:0;s:12:"section_edit";i:1;a:4:{i:0;i:1263;i:1;i:1676;i:2;i:2;i:3;s:57:"5. Word 2003 não está funcionando na Juliana (Cassiana)";}i:2;i:1677;}i:67;a:3:{i:0;s:6:"header";i:1;a:3:{i:0;s:24:"6. Wallpapers (Leonardo)";i:1;i:2;i:2;i:1677;}i:2;i:1677;}i:68;a:3:{i:0;s:12:"section_open";i:1;a:1:{i:0;i:2;}i:2;i:1677;}i:69;a:3:{i:0;s:6:"p_open";i:1;a:0:{}i:2;i:1713;}i:70;a:3:{i:0;s:5:"cdata";i:1;a:1:{i:0;s:401:"
Leonardo relata que na mostra do RoboPET ficou chato o visual do PC (com o fundo da amiga da prima do Jurkovski). Ele alegou que os wallpapers são inadequados para um ambiente de trabalho. O grupo decidiu que os wallpapers serão trocados e devem ser mantidos com imagens de paisagens, temas padrão do SO, etc. Estão proibidas as fotos de pessoas e imagens (capa de álbum, por exemplo) de bandas.";}i:2;i:1714;}i:71;a:3:{i:0;s:7:"p_close";i:1;a:0:{}i:2;i:2115;}i:72;a:3:{i:0;s:13:"section_close";i:1;a:0:{}i:2;i:2117;}i:73;a:3:{i:0;s:12:"section_edit";i:1;a:4:{i:0;i:1677;i:1;i:2116;i:2;i:2;i:3;s:24:"6. Wallpapers (Leonardo)";}i:2;i:2117;}i:74;a:3:{i:0;s:6:"header";i:1;a:3:{i:0;s:37:"7. Curso de HTML para a Psico (Bruno)";i:1;i:2;i:2;i:2117;}i:2;i:2117;}i:75;a:3:{i:0;s:12:"section_open";i:1;a:1:{i:0;i:2;}i:2;i:2117;}i:76;a:3:{i:0;s:6:"p_open";i:1;a:0:{}i:2;i:2166;}i:77;a:3:{i:0;s:5:"cdata";i:1;a:1:{i:0;s:30:"
Ao invés de dar um curso de ";}i:2;i:2167;}i:78;a:3:{i:0;s:7:"acronym";i:1;a:1:{i:0;s:4:"HTML";}i:2;i:2197;}i:79;a:3:{i:0;s:5:"cdata";i:1;a:1:{i:0;s:77:", vamos dar um curso de Dreamweaver. Antônio e Proença estão encarregados.";}i:2;i:2201;}i:80;a:3:{i:0;s:7:"p_close";i:1;a:0:{}i:2;i:2278;}i:81;a:3:{i:0;s:13:"section_close";i:1;a:0:{}i:2;i:2280;}i:82;a:3:{i:0;s:12:"section_edit";i:1;a:4:{i:0;i:2117;i:1;i:2279;i:2;i:2;i:3;s:37:"7. Curso de HTML para a Psico (Bruno)";}i:2;i:2280;}i:83;a:3:{i:0;s:6:"header";i:1;a:3:{i:0;s:31:"8. Reunião com a Psico (Bruno)";i:1;i:2;i:2;i:2280;}i:2;i:2280;}i:84;a:3:{i:0;s:12:"section_open";i:1;a:1:{i:0;i:2;}i:2;i:2280;}i:85;a:3:{i:0;s:6:"p_open";i:1;a:0:{}i:2;i:2323;}i:86;a:3:{i:0;s:5:"cdata";i:1;a:1:{i:0;s:108:"
Proposta de fazer oficinas paralelas com a Psico, usando RCX, para que os ensinamentos não se sobreponham.";}i:2;i:2324;}i:87;a:3:{i:0;s:7:"p_close";i:1;a:0:{}i:2;i:2432;}i:88;a:3:{i:0;s:13:"section_close";i:1;a:0:{}i:2;i:2434;}i:89;a:3:{i:0;s:12:"section_edit";i:1;a:4:{i:0;i:2280;i:1;i:2433;i:2;i:2;i:3;s:31:"8. Reunião com a Psico (Bruno)";}i:2;i:2434;}i:90;a:3:{i:0;s:6:"header";i:1;a:3:{i:0;s:19:"9. PETCafé (Bruno)";i:1;i:2;i:2;i:2434;}i:2;i:2434;}i:91;a:3:{i:0;s:12:"section_open";i:1;a:1:{i:0;i:2;}i:2;i:2434;}i:92;a:3:{i:0;s:6:"p_open";i:1;a:0:{}i:2;i:2465;}i:93;a:3:{i:0;s:5:"cdata";i:1;a:1:{i:0;s:182:"
A cafeteira nova foi comprada hoje. Semana que vem deve estar presente! Cada petiano que toma café deverá pagar 5 (cinco) reais. E quem não pagou o café de Novembro, deve pagar!";}i:2;i:2466;}i:94;a:3:{i:0;s:7:"p_close";i:1;a:0:{}i:2;i:2648;}i:95;a:3:{i:0;s:13:"section_close";i:1;a:0:{}i:2;i:2650;}i:96;a:3:{i:0;s:12:"section_edit";i:1;a:4:{i:0;i:2434;i:1;i:2649;i:2;i:2;i:3;s:19:"9. PETCafé (Bruno)";}i:2;i:2650;}i:97;a:3:{i:0;s:6:"header";i:1;a:3:{i:0;s:39:"10. Condicionador de ar no LRI (Felipe)";i:1;i:2;i:2;i:2650;}i:2;i:2650;}i:98;a:3:{i:0;s:12:"section_open";i:1;a:1:{i:0;i:2;}i:2;i:2650;}i:99;a:3:{i:0;s:6:"p_open";i:1;a:0:{}i:2;i:2701;}i:100;a:3:{i:0;s:5:"cdata";i:1;a:1:{i:0;s:226:"
Felipe relata necessidade urgente de comprar um ar-condicionado novo para o LRI ou arrumar o atual. O grupo decide comprar um novo. Felipe e Bruno ficam responsáveis por ver orçamentos (2 Felipe, 1 Bruno) em nome da FAURGS.";}i:2;i:2702;}i:101;a:3:{i:0;s:7:"p_close";i:1;a:0:{}i:2;i:2928;}i:102;a:3:{i:0;s:13:"section_close";i:1;a:0:{}i:2;i:2930;}i:103;a:3:{i:0;s:12:"section_edit";i:1;a:4:{i:0;i:2650;i:1;i:2929;i:2;i:2;i:3;s:39:"10. Condicionador de ar no LRI (Felipe)";}i:2;i:2930;}i:104;a:3:{i:0;s:6:"header";i:1;a:3:{i:0;s:41:"11. Formatação do Planejamento (Felipe)";i:1;i:2;i:2;i:2930;}i:2;i:2930;}i:105;a:3:{i:0;s:12:"section_open";i:1;a:1:{i:0;i:2;}i:2;i:2930;}i:106;a:3:{i:0;s:6:"p_open";i:1;a:0:{}i:2;i:2983;}i:107;a:3:{i:0;s:5:"cdata";i:1;a:1:{i:0;s:1:"
";}i:2;i:2984;}i:108;a:3:{i:0;s:18:"doublequoteopening";i:1;a:0:{}i:2;i:2985;}i:109;a:3:{i:0;s:5:"cdata";i:1;a:1:{i:0;s:42:"Pessoal, por favor formatem o planejamento";}i:2;i:2986;}i:110;a:3:{i:0;s:18:"doublequoteclosing";i:1;a:0:{}i:2;i:3028;}i:111;a:3:{i:0;s:5:"cdata";i:1;a:1:{i:0;s:60:", conforme pedido do Felipe: no final de cada linha colocar ";}i:2;i:3029;}i:112;a:3:{i:0;s:18:"doublequoteclosing";i:1;a:0:{}i:2;i:3089;}i:113;a:3:{i:0;s:5:"cdata";i:1;a:1:{i:0;s:1:";";}i:2;i:3090;}i:114;a:3:{i:0;s:18:"doublequoteclosing";i:1;a:0:{}i:2;i:3091;}i:115;a:3:{i:0;s:5:"cdata";i:1;a:1:{i:0;s:169:", e no final do planejamento de cada pessoa colocar ponto final. Cassiana vai levar o planejamento na quarta-feira. A folha de efetividade deve ser assinada pelo Dante. ";}i:2;i:3092;}i:116;a:3:{i:0;s:9:"linebreak";i:1;a:0:{}i:2;i:3261;}i:117;a:3:{i:0;s:5:"cdata";i:1;a:1:{i:0;s:1:" ";}i:2;i:3263;}i:118;a:3:{i:0;s:9:"linebreak";i:1;a:0:{}i:2;i:3264;}i:119;a:3:{i:0;s:7:"p_close";i:1;a:0:{}i:2;i:3266;}i:120;a:3:{i:0;s:13:"section_close";i:1;a:0:{}i:2;i:3268;}i:121;a:3:{i:0;s:12:"section_edit";i:1;a:4:{i:0;i:2930;i:1;i:3267;i:2;i:2;i:3;s:41:"11. Formatação do Planejamento (Felipe)";}i:2;i:3268;}i:122;a:3:{i:0;s:6:"header";i:1;a:3:{i:0;s:98:"-------- Saída de Guedes e Proença (reunião do InterPET), Felipe e Marcos (curso de C) --------";i:1;i:3;i:2;i:3268;}i:2;i:3268;}i:123;a:3:{i:0;s:12:"section_open";i:1;a:1:{i:0;i:3;}i:2;i:3268;}i:124;a:3:{i:0;s:13:"section_close";i:1;a:0:{}i:2;i:3378;}i:125;a:3:{i:0;s:12:"section_edit";i:1;a:4:{i:0;i:3268;i:1;i:3377;i:2;i:3;i:3;s:98:"-------- Saída de Guedes e Proença (reunião do InterPET), Felipe e Marcos (curso de C) --------";}i:2;i:3378;}i:126;a:3:{i:0;s:6:"header";i:1;a:3:{i:0;s:24:"12. Curso de PHP (Tyron)";i:1;i:2;i:2;i:3378;}i:2;i:3378;}i:127;a:3:{i:0;s:12:"section_open";i:1;a:1:{i:0;i:2;}i:2;i:3378;}i:128;a:3:{i:0;s:6:"p_open";i:1;a:0:{}i:2;i:3414;}i:129;a:3:{i:0;s:5:"cdata";i:1;a:1:{i:0;s:158:"
Como o curso ainda não está bem preparado e o período inicialmente proposto ia ficar junto com as provas finais, o curso foi adiado para semestre que vem.";}i:2;i:3415;}i:130;a:3:{i:0;s:7:"p_close";i:1;a:0:{}i:2;i:3573;}i:131;a:3:{i:0;s:13:"section_close";i:1;a:0:{}i:2;i:3575;}i:132;a:3:{i:0;s:12:"section_edit";i:1;a:4:{i:0;i:3378;i:1;i:3574;i:2;i:2;i:3;s:24:"12. Curso de PHP (Tyron)";}i:2;i:3575;}i:133;a:3:{i:0;s:6:"header";i:1;a:3:{i:0;s:55:"13. Seminário sexta-feira: Gérson Gabiatti (Cassiana)";i:1;i:2;i:2;i:3575;}i:2;i:3575;}i:134;a:3:{i:0;s:12:"section_open";i:1;a:1:{i:0;i:2;}i:2;i:3575;}i:135;a:3:{i:0;s:6:"p_open";i:1;a:0:{}i:2;i:3642;}i:136;a:3:{i:0;s:5:"cdata";i:1;a:1:{i:0;s:169:"
Devido a problemas durante a Semana Acadêmica, Gérson Gabiatti, da CP Eletrônica vai dar sua palestra nesta sexta-feira. Seria bom se os petianos fossem na palestra!";}i:2;i:3643;}i:137;a:3:{i:0;s:7:"p_close";i:1;a:0:{}i:2;i:3812;}i:138;a:3:{i:0;s:13:"section_close";i:1;a:0:{}i:2;i:3814;}i:139;a:3:{i:0;s:12:"section_edit";i:1;a:4:{i:0;i:3575;i:1;i:3813;i:2;i:2;i:3;s:55:"13. Seminário sexta-feira: Gérson Gabiatti (Cassiana)";}i:2;i:3814;}i:140;a:3:{i:0;s:6:"header";i:1;a:3:{i:0;s:21:"14. Semana Acadêmica";i:1;i:2;i:2;i:3814;}i:2;i:3814;}i:141;a:3:{i:0;s:12:"section_open";i:1;a:1:{i:0;i:2;}i:2;i:3814;}i:142;a:3:{i:0;s:10:"listu_open";i:1;a:0:{}i:2;i:3848;}i:143;a:3:{i:0;s:13:"listitem_open";i:1;a:1:{i:0;i:1;}i:2;i:3848;}i:144;a:3:{i:0;s:16:"listcontent_open";i:1;a:0:{}i:2;i:3848;}i:145;a:3:{i:0;s:5:"cdata";i:1;a:1:{i:0;s:36:" Oficina de LaTeX (Proença e Kauê)";}i:2;i:3852;}i:146;a:3:{i:0;s:17:"listcontent_close";i:1;a:0:{}i:2;i:3888;}i:147;a:3:{i:0;s:14:"listitem_close";i:1;a:0:{}i:2;i:3888;}i:148;a:3:{i:0;s:11:"listu_close";i:1;a:0:{}i:2;i:3888;}i:149;a:3:{i:0;s:6:"p_open";i:1;a:0:{}i:2;i:3888;}i:150;a:3:{i:0;s:5:"cdata";i:1;a:1:{i:0;s:139:"
Muitos faltantes na oficina de LaTeX. 15 participantes não simultâneos. O curso foi bom. Poucos alunos da graduação e muitos da pós.
";}i:2;i:3889;}i:151;a:3:{i:0;s:7:"p_close";i:1;a:0:{}i:2;i:4028;}i:152;a:3:{i:0;s:10:"listu_open";i:1;a:0:{}i:2;i:4028;}i:153;a:3:{i:0;s:13:"listitem_open";i:1;a:1:{i:0;i:1;}i:2;i:4028;}i:154;a:3:{i:0;s:16:"listcontent_open";i:1;a:0:{}i:2;i:4028;}i:155;a:3:{i:0;s:5:"cdata";i:1;a:1:{i:0;s:35:" Curso de Ruby (Fialho e Jurkovski)";}i:2;i:4032;}i:156;a:3:{i:0;s:17:"listcontent_close";i:1;a:0:{}i:2;i:4067;}i:157;a:3:{i:0;s:14:"listitem_close";i:1;a:0:{}i:2;i:4067;}i:158;a:3:{i:0;s:11:"listu_close";i:1;a:0:{}i:2;i:4067;}i:159;a:3:{i:0;s:6:"p_open";i:1;a:0:{}i:2;i:4067;}i:160;a:3:{i:0;s:5:"cdata";i:1;a:1:{i:0;s:223:"
No primeiro dia a matéria foi passada muito rapidamente e havia entre 20 e 30 pessoas. A segunda aula foi melhor, mais calma. No site do PET, criaram um sistema de avaliação do curso. Já foram postados 3 comentários!
";}i:2;i:4068;}i:161;a:3:{i:0;s:7:"p_close";i:1;a:0:{}i:2;i:4291;}i:162;a:3:{i:0;s:10:"listu_open";i:1;a:0:{}i:2;i:4291;}i:163;a:3:{i:0;s:13:"listitem_open";i:1;a:1:{i:0;i:1;}i:2;i:4291;}i:164;a:3:{i:0;s:16:"listcontent_open";i:1;a:0:{}i:2;i:4291;}i:165;a:3:{i:0;s:5:"cdata";i:1;a:1:{i:0;s:49:" Oficina de Robótica (Proença, Felipe e Guedes)";}i:2;i:4295;}i:166;a:3:{i:0;s:17:"listcontent_close";i:1;a:0:{}i:2;i:4344;}i:167;a:3:{i:0;s:14:"listitem_close";i:1;a:0:{}i:2;i:4344;}i:168;a:3:{i:0;s:11:"listu_close";i:1;a:0:{}i:2;i:4344;}i:169;a:3:{i:0;s:6:"p_open";i:1;a:0:{}i:2;i:4344;}i:170;a:3:{i:0;s:5:"cdata";i:1;a:1:{i:0;s:45:"
Faltou material. O curso foi bom, mas muito ";}i:2;i:4345;}i:171;a:3:{i:0;s:18:"doublequoteopening";i:1;a:0:{}i:2;i:4390;}i:172;a:3:{i:0;s:5:"cdata";i:1;a:1:{i:0;s:15:"receita de bolo";}i:2;i:4391;}i:173;a:3:{i:0;s:18:"doublequoteclosing";i:1;a:0:{}i:2;i:4406;}i:174;a:3:{i:0;s:5:"cdata";i:1;a:1:{i:0;s:57:", com pouco incentivo ao desenvolvimento do raciocínio.
";}i:2;i:4407;}i:175;a:3:{i:0;s:7:"p_close";i:1;a:0:{}i:2;i:4464;}i:176;a:3:{i:0;s:10:"listu_open";i:1;a:0:{}i:2;i:4464;}i:177;a:3:{i:0;s:13:"listitem_open";i:1;a:1:{i:0;i:1;}i:2;i:4464;}i:178;a:3:{i:0;s:16:"listcontent_open";i:1;a:0:{}i:2;i:4464;}i:179;a:3:{i:0;s:5:"cdata";i:1;a:1:{i:0;s:41:" Oficina de Shell Script (Bruno e Felipe)";}i:2;i:4468;}i:180;a:3:{i:0;s:17:"listcontent_close";i:1;a:0:{}i:2;i:4509;}i:181;a:3:{i:0;s:14:"listitem_close";i:1;a:0:{}i:2;i:4509;}i:182;a:3:{i:0;s:11:"listu_close";i:1;a:0:{}i:2;i:4509;}i:183;a:3:{i:0;s:6:"p_open";i:1;a:0:{}i:2;i:4509;}i:184;a:3:{i:0;s:5:"cdata";i:1;a:1:{i:0;s:108:"
Foi boa, no início muito corrida. Vários alunos chegaram atrasados e não fizeram os exercícios finais.
";}i:2;i:4510;}i:185;a:3:{i:0;s:7:"p_close";i:1;a:0:{}i:2;i:4618;}i:186;a:3:{i:0;s:10:"listu_open";i:1;a:0:{}i:2;i:4618;}i:187;a:3:{i:0;s:13:"listitem_open";i:1;a:1:{i:0;i:1;}i:2;i:4618;}i:188;a:3:{i:0;s:16:"listcontent_open";i:1;a:0:{}i:2;i:4618;}i:189;a:3:{i:0;s:5:"cdata";i:1;a:1:{i:0;s:18:" Palestras (todos)";}i:2;i:4622;}i:190;a:3:{i:0;s:17:"listcontent_close";i:1;a:0:{}i:2;i:4640;}i:191;a:3:{i:0;s:14:"listitem_close";i:1;a:0:{}i:2;i:4640;}i:192;a:3:{i:0;s:11:"listu_close";i:1;a:0:{}i:2;i:4640;}i:193;a:3:{i:0;s:6:"p_open";i:1;a:0:{}i:2;i:4640;}i:194;a:3:{i:0;s:5:"cdata";i:1;a:1:{i:0;s:255:"
Foram proveitosas, mas com pouco público. Propostas para tornar a Semana Acadêmica mais atrativas foram discutidas no estilo brainstorming. Na próxima reunião vamos discutir melhor o assunto, pensar e propor um novo formato para a Semana Acadêmica.
";}i:2;i:4641;}i:195;a:3:{i:0;s:7:"p_close";i:1;a:0:{}i:2;i:4896;}i:196;a:3:{i:0;s:10:"listu_open";i:1;a:0:{}i:2;i:4896;}i:197;a:3:{i:0;s:13:"listitem_open";i:1;a:1:{i:0;i:1;}i:2;i:4896;}i:198;a:3:{i:0;s:16:"listcontent_open";i:1;a:0:{}i:2;i:4896;}i:199;a:3:{i:0;s:5:"cdata";i:1;a:1:{i:0;s:16:" RoboPET (todos)";}i:2;i:4900;}i:200;a:3:{i:0;s:17:"listcontent_close";i:1;a:0:{}i:2;i:4916;}i:201;a:3:{i:0;s:14:"listitem_close";i:1;a:0:{}i:2;i:4916;}i:202;a:3:{i:0;s:11:"listu_close";i:1;a:0:{}i:2;i:4916;}i:203;a:3:{i:0;s:6:"p_open";i:1;a:0:{}i:2;i:4916;}i:204;a:3:{i:0;s:5:"cdata";i:1;a:1:{i:0;s:121:"
Apenas um não-petiano foi na mostra. Colegas da CIC foram ao final do curso de Ruby, mas a mostra já tinha terminado.
";}i:2;i:4917;}i:205;a:3:{i:0;s:7:"p_close";i:1;a:0:{}i:2;i:5038;}i:206;a:3:{i:0;s:10:"listu_open";i:1;a:0:{}i:2;i:5038;}i:207;a:3:{i:0;s:13:"listitem_open";i:1;a:1:{i:0;i:1;}i:2;i:5038;}i:208;a:3:{i:0;s:16:"listcontent_open";i:1;a:0:{}i:2;i:5038;}i:209;a:3:{i:0;s:5:"cdata";i:1;a:1:{i:0;s:25:" Museu (Cassiana e Tyron)";}i:2;i:5042;}i:210;a:3:{i:0;s:17:"listcontent_close";i:1;a:0:{}i:2;i:5067;}i:211;a:3:{i:0;s:14:"listitem_close";i:1;a:0:{}i:2;i:5067;}i:212;a:3:{i:0;s:11:"listu_close";i:1;a:0:{}i:2;i:5067;}i:213;a:3:{i:0;s:6:"p_open";i:1;a:0:{}i:2;i:5067;}i:214;a:3:{i:0;s:5:"cdata";i:1;a:1:{i:0;s:233:"
Museu estreou com sucesso! Lucas Cavalheiro, ECP ex-petiano vai ajudar o projeto tirando fotos das peças. Tyron fica responsável por buscar o Lucas e seus equipamentos para tirar as fotos. O caixa do PET deverá pagar a gasolina. ";}i:2;i:5068;}i:215;a:3:{i:0;s:9:"linebreak";i:1;a:0:{}i:2;i:5301;}i:216;a:3:{i:0;s:5:"cdata";i:1;a:1:{i:0;s:1:" ";}i:2;i:5303;}i:217;a:3:{i:0;s:9:"linebreak";i:1;a:0:{}i:2;i:5304;}i:218;a:3:{i:0;s:7:"p_close";i:1;a:0:{}i:2;i:5306;}i:219;a:3:{i:0;s:13:"section_close";i:1;a:0:{}i:2;i:5308;}i:220;a:3:{i:0;s:12:"section_edit";i:1;a:4:{i:0;i:3814;i:1;i:5307;i:2;i:2;i:3;s:21:"14. Semana Acadêmica";}i:2;i:5308;}i:221;a:3:{i:0;s:6:"header";i:1;a:3:{i:0;s:46:"-------- Retorno de Guedes e Proença --------";i:1;i:3;i:2;i:5308;}i:2;i:5308;}i:222;a:3:{i:0;s:12:"section_open";i:1;a:1:{i:0;i:3;}i:2;i:5308;}i:223;a:3:{i:0;s:13:"section_close";i:1;a:0:{}i:2;i:5366;}i:224;a:3:{i:0;s:12:"section_edit";i:1;a:4:{i:0;i:5308;i:1;i:5365;i:2;i:3;i:3;s:46:"-------- Retorno de Guedes e Proença --------";}i:2;i:5366;}i:225;a:3:{i:0;s:6:"header";i:1;a:3:{i:0;s:24:"15. Campus Party (Tyron)";i:1;i:2;i:2;i:5366;}i:2;i:5366;}i:226;a:3:{i:0;s:12:"section_open";i:1;a:1:{i:0;i:2;}i:2;i:5366;}i:227;a:3:{i:0;s:6:"p_open";i:1;a:0:{}i:2;i:5402;}i:228;a:3:{i:0;s:5:"cdata";i:1;a:1:{i:0;s:211:"
Tyron apresenta pesquisa de valores de passagens para o grupo. Proença ficou responsável por tentar desconto com seu conhecido na Gol. Interessados em participar do evento devem se inscrever até sexta-feira!";}i:2;i:5403;}i:229;a:3:{i:0;s:7:"p_close";i:1;a:0:{}i:2;i:5614;}i:230;a:3:{i:0;s:13:"section_close";i:1;a:0:{}i:2;i:5616;}i:231;a:3:{i:0;s:12:"section_edit";i:1;a:4:{i:0;i:5366;i:1;i:5615;i:2;i:2;i:3;s:24:"15. Campus Party (Tyron)";}i:2;i:5616;}i:232;a:3:{i:0;s:6:"header";i:1;a:3:{i:0;s:28:"16. NXT / PETCubo (Cassiana)";i:1;i:2;i:2;i:5616;}i:2;i:5616;}i:233;a:3:{i:0;s:12:"section_open";i:1;a:1:{i:0;i:2;}i:2;i:5616;}i:234;a:3:{i:0;s:6:"p_open";i:1;a:0:{}i:2;i:5656;}i:235;a:3:{i:0;s:5:"cdata";i:1;a:1:{i:0;s:125:"
Cassiana pede ao grupo para desmontar o NXT e começar a montar a estrutura do robô que resolve o cubo de Rubik. Concedido.";}i:2;i:5657;}i:236;a:3:{i:0;s:7:"p_close";i:1;a:0:{}i:2;i:5782;}i:237;a:3:{i:0;s:13:"section_close";i:1;a:0:{}i:2;i:5784;}i:238;a:3:{i:0;s:12:"section_edit";i:1;a:4:{i:0;i:5616;i:1;i:5783;i:2;i:2;i:3;s:28:"16. NXT / PETCubo (Cassiana)";}i:2;i:5784;}i:239;a:3:{i:0;s:6:"header";i:1;a:3:{i:0;s:31:"17. Futebol com o PET Geografia";i:1;i:2;i:2;i:5784;}i:2;i:5784;}i:240;a:3:{i:0;s:12:"section_open";i:1;a:1:{i:0;i:2;}i:2;i:5784;}i:241;a:3:{i:0;s:6:"p_open";i:1;a:0:{}i:2;i:5827;}i:242;a:3:{i:0;s:5:"cdata";i:1;a:1:{i:0;s:59:"
Futebol não será discutido nas reuniões; mandem emails!";}i:2;i:5828;}i:243;a:3:{i:0;s:7:"p_close";i:1;a:0:{}i:2;i:5887;}i:244;a:3:{i:0;s:13:"section_close";i:1;a:0:{}i:2;i:5889;}i:245;a:3:{i:0;s:12:"section_edit";i:1;a:4:{i:0;i:5784;i:1;i:5888;i:2;i:2;i:3;s:31:"17. Futebol com o PET Geografia";}i:2;i:5889;}i:246;a:3:{i:0;s:6:"header";i:1;a:3:{i:0;s:26:"18. Logo do PET (Proença)";i:1;i:2;i:2;i:5889;}i:2;i:5889;}i:247;a:3:{i:0;s:12:"section_open";i:1;a:1:{i:0;i:2;}i:2;i:5889;}i:248;a:3:{i:0;s:6:"p_open";i:1;a:0:{}i:2;i:5927;}i:249;a:3:{i:0;s:5:"cdata";i:1;a:1:{i:0;s:39:"
Um amigo do Proença vai fazer o logo.";}i:2;i:5928;}i:250;a:3:{i:0;s:7:"p_close";i:1;a:0:{}i:2;i:5967;}i:251;a:3:{i:0;s:13:"section_close";i:1;a:0:{}i:2;i:5969;}i:252;a:3:{i:0;s:12:"section_edit";i:1;a:4:{i:0;i:5889;i:1;i:5968;i:2;i:2;i:3;s:26:"18. Logo do PET (Proença)";}i:2;i:5969;}i:253;a:3:{i:0;s:6:"header";i:1;a:3:{i:0;s:48:"19. Relato reunião InterPET (Proença e Guedes)";i:1;i:2;i:2;i:5969;}i:2;i:5969;}i:254;a:3:{i:0;s:12:"section_open";i:1;a:1:{i:0;i:2;}i:2;i:5969;}i:255;a:3:{i:0;s:6:"p_open";i:1;a:0:{}i:2;i:6029;}i:256;a:3:{i:0;s:5:"cdata";i:1;a:1:{i:0;s:315:"
Todas as reuniões desse ano e de 2009 foram marcadas. Decidiram por reuniões bimestrais, mas esse ano ainda teremos uma em novembro, antes da reunião da comissão organizadora do ENAPET. A próxima reunião será no II, dia 13/11, às 18h. Cassiana irá marcar uma sala. Cassiana ficará como responsável pela ";}i:2;i:6030;}i:257;a:3:{i:0;s:18:"doublequoteopening";i:1;a:0:{}i:2;i:6345;}i:258;a:3:{i:0;s:5:"cdata";i:1;a:1:{i:0;s:13:"Comunicação";}i:2;i:6346;}i:259;a:3:{i:0;s:18:"doublequoteclosing";i:1;a:0:{}i:2;i:6359;}i:260;a:3:{i:0;s:5:"cdata";i:1;a:1:{i:0;s:159:" com o InterPET. Na reunião ficou decidido que deve-se fazer algo em relação ao CLA. A idéia é fazer um regimento interno para tentar organizar as coisas.";}i:2;i:6360;}i:261;a:3:{i:0;s:7:"p_close";i:1;a:0:{}i:2;i:6519;}i:262;a:3:{i:0;s:13:"section_close";i:1;a:0:{}i:2;i:6521;}i:263;a:3:{i:0;s:12:"section_edit";i:1;a:4:{i:0;i:5969;i:1;i:6520;i:2;i:2;i:3;s:48:"19. Relato reunião InterPET (Proença e Guedes)";}i:2;i:6521;}i:264;a:3:{i:0;s:6:"header";i:1;a:3:{i:0;s:33:"20. Troféus da maratona (Portal)";i:1;i:2;i:2;i:6521;}i:2;i:6521;}i:265;a:3:{i:0;s:12:"section_open";i:1;a:1:{i:0;i:2;}i:2;i:6521;}i:266;a:3:{i:0;s:6:"p_open";i:1;a:0:{}i:2;i:6566;}i:267;a:3:{i:0;s:5:"cdata";i:1;a:1:{i:0;s:79:"
O pagamento dos troféus foi feito pelo caixa do PET. O grupo está de acordo.";}i:2;i:6567;}i:268;a:3:{i:0;s:7:"p_close";i:1;a:0:{}i:2;i:6646;}i:269;a:3:{i:0;s:13:"section_close";i:1;a:0:{}i:2;i:6647;}i:270;a:3:{i:0;s:12:"section_edit";i:1;a:4:{i:0;i:6521;i:1;i:0;i:2;i:2;i:3;s:33:"20. Troféus da maratona (Portal)";}i:2;i:6647;}i:271;a:3:{i:0;s:12:"document_end";i:1;a:0:{}i:2;i:6647;}}