a:135:{i:0;a:3:{i:0;s:14:"document_start";i:1;a:0:{}i:2;i:0;}i:1;a:3:{i:0;s:6:"p_open";i:1;a:0:{}i:2;i:0;}i:2;a:3:{i:0;s:7:"p_close";i:1;a:0:{}i:2;i:1;}i:3;a:3:{i:0;s:12:"section_edit";i:1;a:4:{i:0;i:-1;i:1;i:0;i:2;i:1;i:3;s:0:"";}i:2;i:1;}i:4;a:3:{i:0;s:6:"header";i:1;a:3:{i:0;s:29:"Ata da reunião de 26/04/2006";i:1;i:2;i:2;i:1;}i:2;i:1;}i:5;a:3:{i:0;s:12:"section_open";i:1;a:1:{i:0;i:2;}i:2;i:1;}i:6;a:3:{i:0;s:6:"p_open";i:1;a:0:{}i:2;i:42;}i:7;a:3:{i:0;s:5:"cdata";i:1;a:1:{i:0;s:158:"
Presentes: Alexandre, Dante, Eduardo, Estevão, Fabiano, Felipe, Gabriela, Lucas Cavalheiro, Lucas Mizusaki, Marcelo, Marcos, Nondillo,Pablo, Ricardo, Thiago";}i:2;i:43;}i:8;a:3:{i:0;s:7:"p_close";i:1;a:0:{}i:2;i:201;}i:9;a:3:{i:0;s:6:"p_open";i:1;a:0:{}i:2;i:201;}i:10;a:3:{i:0;s:5:"cdata";i:1;a:1:{i:0;s:11:"Ausentes: -";}i:2;i:203;}i:11;a:3:{i:0;s:7:"p_close";i:1;a:0:{}i:2;i:214;}i:12;a:3:{i:0;s:6:"p_open";i:1;a:0:{}i:2;i:214;}i:13;a:3:{i:0;s:5:"cdata";i:1;a:1:{i:0;s:18:"Relator: Alexandre";}i:2;i:216;}i:14;a:3:{i:0;s:7:"p_close";i:1;a:0:{}i:2;i:234;}i:15;a:3:{i:0;s:13:"section_close";i:1;a:0:{}i:2;i:236;}i:16;a:3:{i:0;s:12:"section_edit";i:1;a:4:{i:0;i:1;i:1;i:235;i:2;i:2;i:3;s:29:"Ata da reunião de 26/04/2006";}i:2;i:236;}i:17;a:3:{i:0;s:6:"header";i:1;a:3:{i:0;s:26:"1)Fórum de Software Livre";i:1;i:2;i:2;i:236;}i:2;i:236;}i:18;a:3:{i:0;s:12:"section_open";i:1;a:1:{i:0;i:2;}i:2;i:236;}i:19;a:3:{i:0;s:6:"p_open";i:1;a:0:{}i:2;i:274;}i:20;a:3:{i:0;s:5:"cdata";i:1;a:1:{i:0;s:138:"
Thiago fala sobre apresentação no Fórum de Softaware Livre, conclui que é uma grande experiência e aconselha: “Façam pesquisa”.";}i:2;i:275;}i:21;a:3:{i:0;s:7:"p_close";i:1;a:0:{}i:2;i:413;}i:22;a:3:{i:0;s:13:"section_close";i:1;a:0:{}i:2;i:415;}i:23;a:3:{i:0;s:12:"section_edit";i:1;a:4:{i:0;i:236;i:1;i:414;i:2;i:2;i:3;s:26:"1)Fórum de Software Livre";}i:2;i:415;}i:24;a:3:{i:0;s:6:"header";i:1;a:3:{i:0;s:21:"2)Avalição do grupo";i:1;i:2;i:2;i:415;}i:2;i:415;}i:25;a:3:{i:0;s:12:"section_open";i:1;a:1:{i:0;i:2;}i:2;i:415;}i:26;a:3:{i:0;s:6:"p_open";i:1;a:0:{}i:2;i:448;}i:27;a:3:{i:0;s:5:"cdata";i:1;a:1:{i:0;s:83:"
Fabiano relembra que amanhã (27/04/06) às 18h será feita a avalição do grupo.";}i:2;i:449;}i:28;a:3:{i:0;s:7:"p_close";i:1;a:0:{}i:2;i:532;}i:29;a:3:{i:0;s:13:"section_close";i:1;a:0:{}i:2;i:534;}i:30;a:3:{i:0;s:12:"section_edit";i:1;a:4:{i:0;i:415;i:1;i:533;i:2;i:2;i:3;s:21:"2)Avalição do grupo";}i:2;i:534;}i:31;a:3:{i:0;s:6:"header";i:1;a:3:{i:0;s:17:"3)Horas cumpridas";i:1;i:2;i:2;i:534;}i:2;i:534;}i:32;a:3:{i:0;s:12:"section_open";i:1;a:1:{i:0;i:2;}i:2;i:534;}i:33;a:3:{i:0;s:10:"quote_open";i:1;a:0:{}i:2;i:564;}i:34;a:3:{i:0;s:5:"cdata";i:1;a:1:{i:0;s:982:" Fabiano lê a quantidade de horas que cada PETiano fez no último mês, comenta que o caso mais grave é o de Eduardo (35 horas). Eduardo justifica dizendo que as duas sextas-feiras que foram feriado o impediram de fazer mais, pois sexta-feira é o dia em que ele mais horas faz; mais a reunião passada na qual não pode comparecer pois estava no Fórum de Softaware Livre. Cavalheiro sugere que 45 horas seriam aceitáveis para os novos, que perderam meia semana no início do mês. Fabiano lembra que ficou decidido que as horas não cumpridas serão recuperadas no próximo mês. Marcelo pergunta se poderia pedir as horas do Fórum, pois não apresentou, Fabiano diz que isso deve ser discutido após o pedido de horas pendentes, que então será decidido pelo grupo. Fabiano pergunta se estão todos de acordo com ter que recuperar as horas no próximo mês, ninguém discorda. No logador serão deixadas “horas negativas” para que todos fechem 48 horas no final do mês.";}i:2;i:566;}i:35;a:3:{i:0;s:11:"quote_close";i:1;a:0:{}i:2;i:1548;}i:36;a:3:{i:0;s:13:"section_close";i:1;a:0:{}i:2;i:1550;}i:37;a:3:{i:0;s:12:"section_edit";i:1;a:4:{i:0;i:534;i:1;i:1549;i:2;i:2;i:3;s:17:"3)Horas cumpridas";}i:2;i:1550;}i:38;a:3:{i:0;s:6:"header";i:1;a:3:{i:0;s:20:"4)Relatório semanal";i:1;i:2;i:2;i:1550;}i:2;i:1550;}i:39;a:3:{i:0;s:12:"section_open";i:1;a:1:{i:0;i:2;}i:2;i:1550;}i:40;a:3:{i:0;s:10:"quote_open";i:1;a:0:{}i:2;i:1583;}i:41;a:3:{i:0;s:5:"cdata";i:1;a:1:{i:0;s:264:" Fabiano fala sobre o fato de esquecerem de fazer o relatório semanal, e para as pessoas que esquecerem mandarem por e-mail para a lista. E recomenda que todos coloquem o relatório logo após executada a tarefa. O grupo concorda em manter o histórico de faltas.";}i:2;i:1585;}i:42;a:3:{i:0;s:11:"quote_close";i:1;a:0:{}i:2;i:1849;}i:43;a:3:{i:0;s:13:"section_close";i:1;a:0:{}i:2;i:1851;}i:44;a:3:{i:0;s:12:"section_edit";i:1;a:4:{i:0;i:1550;i:1;i:1850;i:2;i:2;i:3;s:20:"4)Relatório semanal";}i:2;i:1851;}i:45;a:3:{i:0;s:6:"header";i:1;a:3:{i:0;s:8:"5)Faltas";i:1;i:2;i:2;i:1851;}i:2;i:1851;}i:46;a:3:{i:0;s:12:"section_open";i:1;a:1:{i:0;i:2;}i:2;i:1851;}i:47;a:3:{i:0;s:10:"quote_open";i:1;a:0:{}i:2;i:1872;}i:48;a:3:{i:0;s:5:"cdata";i:1;a:1:{i:0;s:207:" Fabiano pergunta se as faltas de Thiago e Eduardo na última reunão estariam justificadas. O grupo concorda que sim. É feita a ressalva de que casos como o de Eduardo devem ser avisados com antecedência.";}i:2;i:1874;}i:49;a:3:{i:0;s:11:"quote_close";i:1;a:0:{}i:2;i:2081;}i:50;a:3:{i:0;s:13:"section_close";i:1;a:0:{}i:2;i:2083;}i:51;a:3:{i:0;s:12:"section_edit";i:1;a:4:{i:0;i:1851;i:1;i:2082;i:2;i:2;i:3;s:8:"5)Faltas";}i:2;i:2083;}i:52;a:3:{i:0;s:6:"header";i:1;a:3:{i:0;s:24:"6)Chaves para o armário";i:1;i:2;i:2;i:2083;}i:2;i:2083;}i:53;a:3:{i:0;s:12:"section_open";i:1;a:1:{i:0;i:2;}i:2;i:2083;}i:54;a:3:{i:0;s:10:"quote_open";i:1;a:0:{}i:2;i:2120;}i:55;a:3:{i:0;s:5:"cdata";i:1;a:1:{i:0;s:293:" Fabiano pergunta o que acham sobre fazerem chaves do ármario para todos. Cavalheiro propõe que sejam feitas cópias da chave de apenas uma porta, e nessa porta fiquem guardadas as outras chaves. A idéia é aceita. Cavalheiro se propõe a procurar as fechaduras novas e conseguir as chaves.";}i:2;i:2122;}i:56;a:3:{i:0;s:11:"quote_close";i:1;a:0:{}i:2;i:2415;}i:57;a:3:{i:0;s:13:"section_close";i:1;a:0:{}i:2;i:2417;}i:58;a:3:{i:0;s:12:"section_edit";i:1;a:4:{i:0;i:2083;i:1;i:2416;i:2;i:2;i:3;s:24:"6)Chaves para o armário";}i:2;i:2417;}i:59;a:3:{i:0;s:6:"header";i:1;a:3:{i:0;s:11:"7)Cafeteira";i:1;i:2;i:2;i:2417;}i:2;i:2417;}i:60;a:3:{i:0;s:12:"section_open";i:1;a:1:{i:0;i:2;}i:2;i:2417;}i:61;a:3:{i:0;s:10:"quote_open";i:1;a:0:{}i:2;i:2441;}i:62;a:3:{i:0;s:5:"cdata";i:1;a:1:{i:0;s:210:" É mostrada a nova cafeteira. Gabriela sugere levá-la para casa para limpeza. Estevão fica responsável pelo compra do material necessário (café, açúcar, etc). Esse material será bancado pelos PETianos.";}i:2;i:2443;}i:63;a:3:{i:0;s:11:"quote_close";i:1;a:0:{}i:2;i:2653;}i:64;a:3:{i:0;s:13:"section_close";i:1;a:0:{}i:2;i:2655;}i:65;a:3:{i:0;s:12:"section_edit";i:1;a:4:{i:0;i:2417;i:1;i:2654;i:2;i:2;i:3;s:11:"7)Cafeteira";}i:2;i:2655;}i:66;a:3:{i:0;s:6:"header";i:1;a:3:{i:0;s:10:"8)Dinheiro";i:1;i:2;i:2;i:2655;}i:2;i:2655;}i:67;a:3:{i:0;s:12:"section_open";i:1;a:1:{i:0;i:2;}i:2;i:2655;}i:68;a:3:{i:0;s:10:"quote_open";i:1;a:0:{}i:2;i:2678;}i:69;a:3:{i:0;s:5:"cdata";i:1;a:1:{i:0;s:75:" Fabiano avisa que Dante informou que o dinheiro do PET já está na UFRGS.";}i:2;i:2680;}i:70;a:3:{i:0;s:11:"quote_close";i:1;a:0:{}i:2;i:2755;}i:71;a:3:{i:0;s:6:"p_open";i:1;a:0:{}i:2;i:2755;}i:72;a:3:{i:0;s:5:"cdata";i:1;a:1:{i:0;s:30:"
Obs: Dante chega na reunião.";}i:2;i:2756;}i:73;a:3:{i:0;s:7:"p_close";i:1;a:0:{}i:2;i:2786;}i:74;a:3:{i:0;s:13:"section_close";i:1;a:0:{}i:2;i:2788;}i:75;a:3:{i:0;s:12:"section_edit";i:1;a:4:{i:0;i:2655;i:1;i:2787;i:2;i:2;i:3;s:10:"8)Dinheiro";}i:2;i:2788;}i:76;a:3:{i:0;s:6:"header";i:1;a:3:{i:0;s:11:"9)Camisetas";i:1;i:2;i:2;i:2788;}i:2;i:2788;}i:77;a:3:{i:0;s:12:"section_open";i:1;a:1:{i:0;i:2;}i:2;i:2788;}i:78;a:3:{i:0;s:10:"quote_open";i:1;a:0:{}i:2;i:2812;}i:79;a:3:{i:0;s:5:"cdata";i:1;a:1:{i:0;s:222:" Fabiano sugere que deve ser decidido logo como serão as camisetas. A frente permanecerá igual à camiseta antiga, e às costas terá o logo da UFRGS em apenas uma cor. Ocorre votação para decidir as cores da camiseta.";}i:2;i:2814;}i:80;a:3:{i:0;s:11:"quote_close";i:1;a:0:{}i:2;i:3036;}i:81;a:3:{i:0;s:10:"quote_open";i:1;a:0:{}i:2;i:3037;}i:82;a:3:{i:0;s:5:"cdata";i:1;a:1:{i:0;s:109:" Opção 1: Amarelo e verde -&gt; 6 votos Opção 2: Laranja e preto -&gt; 9 votos Abstenções -&gt; 0 votos";}i:2;i:3039;}i:83;a:3:{i:0;s:11:"quote_close";i:1;a:0:{}i:2;i:3148;}i:84;a:3:{i:0;s:10:"quote_open";i:1;a:0:{}i:2;i:3149;}i:85;a:3:{i:0;s:10:"quote_open";i:1;a:0:{}i:2;i:3149;}i:86;a:3:{i:0;s:5:"cdata";i:1;a:1:{i:0;s:201:" Ficou então decidido que as camisetas serão laranjas com detalhes pretos. Preço pesquisado: 15 camisetas com friso, R$ 17,00 cada. Estevão fica responsável por conferir a qualidade das camisetas.";}i:2;i:3152;}i:87;a:3:{i:0;s:11:"quote_close";i:1;a:0:{}i:2;i:3353;}i:88;a:3:{i:0;s:11:"quote_close";i:1;a:0:{}i:2;i:3353;}i:89;a:3:{i:0;s:13:"section_close";i:1;a:0:{}i:2;i:3355;}i:90;a:3:{i:0;s:12:"section_edit";i:1;a:4:{i:0;i:2788;i:1;i:3354;i:2;i:2;i:3;s:11:"9)Camisetas";}i:2;i:3355;}i:91;a:3:{i:0;s:6:"header";i:1;a:3:{i:0;s:9:"10)SulPET";i:1;i:2;i:2;i:3355;}i:2;i:3355;}i:92;a:3:{i:0;s:12:"section_open";i:1;a:1:{i:0;i:2;}i:2;i:3355;}i:93;a:3:{i:0;s:10:"quote_open";i:1;a:0:{}i:2;i:3377;}i:94;a:3:{i:0;s:5:"cdata";i:1;a:1:{i:0;s:918:" Nondillo explica o que aconteceu na confusão entre PETs e PET Odonto, pois houve falta de integração no SulPET. Falam que seria bom fazer jogos de integração, como futebol. Nondillo explica como funcionam os Gts e conta que a Unversidade do Paraná propôs vários pontos em comum com a UFRGS, como todos discutirem os mesmos pontos para a assembléia. E comenta que houve pouco debate internamente na UFRGS, que por isso chegou pouo articulada ao SulPET. PETianos que foram ao SulPET comentam da falta de organização quanto a discussão do regimento do CENAPET. Marcos fala sobre a manifestação contra o MEC, pois este é contra o acúmulo de bolsas e conta sobre as experiências no SulPET. Felipe aconselha que todos vão ao ENAPET, pois são grandes experiências. Marcos e Felipe comentam que perguntaram sobre o projeto de “Transdisciplinaridade”, e que apenas lembravam que este tinha dado errado.";}i:2;i:3379;}i:95;a:3:{i:0;s:11:"quote_close";i:1;a:0:{}i:2;i:4297;}i:96;a:3:{i:0;s:13:"section_close";i:1;a:0:{}i:2;i:4299;}i:97;a:3:{i:0;s:12:"section_edit";i:1;a:4:{i:0;i:3355;i:1;i:4298;i:2;i:2;i:3;s:9:"10)SulPET";}i:2;i:4299;}i:98;a:3:{i:0;s:6:"header";i:1;a:3:{i:0;s:6:"11)LRI";i:1;i:2;i:2;i:4299;}i:2;i:4299;}i:99;a:3:{i:0;s:12:"section_open";i:1;a:1:{i:0;i:2;}i:2;i:4299;}i:100;a:3:{i:0;s:10:"quote_open";i:1;a:0:{}i:2;i:4318;}i:101;a:3:{i:0;s:5:"cdata";i:1;a:1:{i:0;s:101:" Fabiano fala das peças que foram levadas para o LRI, e pede que quem puder ajude a organizar o LRI.";}i:2;i:4320;}i:102;a:3:{i:0;s:11:"quote_close";i:1;a:0:{}i:2;i:4421;}i:103;a:3:{i:0;s:13:"section_close";i:1;a:0:{}i:2;i:4423;}i:104;a:3:{i:0;s:12:"section_edit";i:1;a:4:{i:0;i:4299;i:1;i:4422;i:2;i:2;i:3;s:6:"11)LRI";}i:2;i:4423;}i:105;a:3:{i:0;s:6:"header";i:1;a:3:{i:0;s:23:"12)Desligamento parcial";i:1;i:2;i:2;i:4423;}i:2;i:4423;}i:106;a:3:{i:0;s:12:"section_open";i:1;a:1:{i:0;i:2;}i:2;i:4423;}i:107;a:3:{i:0;s:10:"quote_open";i:1;a:0:{}i:2;i:4459;}i:108;a:3:{i:0;s:5:"cdata";i:1;a:1:{i:0;s:247:" Eduardo diz que não terá mais tempo disponível para cumprir as horas obrigatórias, e propõe seu desligamento parcial, ou seja, passe a ser colaborador. Fica decidido que a comissão de seleção se reunirá para deliberar sobre a situação.";}i:2;i:4461;}i:109;a:3:{i:0;s:11:"quote_close";i:1;a:0:{}i:2;i:4708;}i:110;a:3:{i:0;s:13:"section_close";i:1;a:0:{}i:2;i:4710;}i:111;a:3:{i:0;s:12:"section_edit";i:1;a:4:{i:0;i:4423;i:1;i:4709;i:2;i:2;i:3;s:23:"12)Desligamento parcial";}i:2;i:4710;}i:112;a:3:{i:0;s:6:"header";i:1;a:3:{i:0;s:21:"13)Ciclo de Palestras";i:1;i:2;i:2;i:4710;}i:2;i:4710;}i:113;a:3:{i:0;s:12:"section_open";i:1;a:1:{i:0;i:2;}i:2;i:4710;}i:114;a:3:{i:0;s:10:"quote_open";i:1;a:0:{}i:2;i:4744;}i:115;a:3:{i:0;s:5:"cdata";i:1;a:1:{i:0;s:335:" Dante já conversou com Maria de Fátima sobre as palestras. Marcos comenta sobre a possível falta de vagas nas palestras. Nondillo sugere que caso faltem vagas seja estabelicido um critério para selecionar as vagas. Comenta-se os problemas do horário complicado para os ECPs. Tiago sugere Castilhos como local. Divulgação será ";}i:2;i:4746;}i:116;a:3:{i:0;s:18:"doublequoteopening";i:1;a:0:{}i:2;i:5081;}i:117;a:3:{i:0;s:5:"cdata";i:1;a:1:{i:0;s:11:"boca-a-boca";}i:2;i:5082;}i:118;a:3:{i:0;s:18:"doublequoteclosing";i:1;a:0:{}i:2;i:5093;}i:119;a:3:{i:0;s:5:"cdata";i:1;a:1:{i:0;s:267:", cartazes e e-malis para a lista de gradução. Nondillo propõem que se entre em contato com os franceses para que eles participem com relatos de experiência, Dante se encarrega disso. Nondillo conta os detalhes desse projeto para que possa ser feita a propaganda ";}i:2;i:5094;}i:120;a:3:{i:0;s:18:"doublequoteopening";i:1;a:0:{}i:2;i:5361;}i:121;a:3:{i:0;s:5:"cdata";i:1;a:1:{i:0;s:11:"boca-a-boca";}i:2;i:5362;}i:122;a:3:{i:0;s:18:"doublequoteclosing";i:1;a:0:{}i:2;i:5373;}i:123;a:3:{i:0;s:5:"cdata";i:1;a:1:{i:0;s:178:". Felipe pergunta sobre como será cobrada a presença. Dante sugere: 1º dia apresentação dos dois cursos, com GTs separados para CIC e ECP, e mais uma data para encerramento.";}i:2;i:5374;}i:124;a:3:{i:0;s:11:"quote_close";i:1;a:0:{}i:2;i:5552;}i:125;a:3:{i:0;s:13:"section_close";i:1;a:0:{}i:2;i:5554;}i:126;a:3:{i:0;s:12:"section_edit";i:1;a:4:{i:0;i:4710;i:1;i:5553;i:2;i:2;i:3;s:21:"13)Ciclo de Palestras";}i:2;i:5554;}i:127;a:3:{i:0;s:6:"header";i:1;a:3:{i:0;s:24:"14)Problemas no servidor";i:1;i:2;i:2;i:5554;}i:2;i:5554;}i:128;a:3:{i:0;s:12:"section_open";i:1;a:1:{i:0;i:2;}i:2;i:5554;}i:129;a:3:{i:0;s:10:"quote_open";i:1;a:0:{}i:2;i:5591;}i:130;a:3:{i:0;s:5:"cdata";i:1;a:1:{i:0;s:196:" É comentado o problema no servidor, Thiago diz que irá resolver co ajuda de Nondillo e Eduardo. E também sobre o problema da Gabriela (PC) que não é possível utilizar, assim como a Daniela.";}i:2;i:5593;}i:131;a:3:{i:0;s:11:"quote_close";i:1;a:0:{}i:2;i:5789;}i:132;a:3:{i:0;s:13:"section_close";i:1;a:0:{}i:2;i:5790;}i:133;a:3:{i:0;s:12:"section_edit";i:1;a:4:{i:0;i:5554;i:1;i:0;i:2;i:2;i:3;s:24:"14)Problemas no servidor";}i:2;i:5790;}i:134;a:3:{i:0;s:12:"document_end";i:1;a:0:{}i:2;i:5790;}}