a:137:{i:0;a:3:{i:0;s:14:"document_start";i:1;a:0:{}i:2;i:0;}i:1;a:3:{i:0;s:6:"p_open";i:1;a:0:{}i:2;i:0;}i:2;a:3:{i:0;s:7:"p_close";i:1;a:0:{}i:2;i:1;}i:3;a:3:{i:0;s:12:"section_edit";i:1;a:4:{i:0;i:-1;i:1;i:0;i:2;i:1;i:3;s:0:"";}i:2;i:1;}i:4;a:3:{i:0;s:6:"header";i:1;a:3:{i:0;s:29:"Ata da Reunião de 26/01/2006";i:1;i:1;i:2;i:1;}i:2;i:1;}i:5;a:3:{i:0;s:12:"section_open";i:1;a:1:{i:0;i:1;}i:2;i:1;}i:6;a:3:{i:0;s:6:"p_open";i:1;a:0:{}i:2;i:44;}i:7;a:3:{i:0;s:5:"cdata";i:1;a:1:{i:0;s:88:"
Presentes: Dante, Diego, Estevão, Fabiano, Gustavo, Marcos, Nondillo, Robert e Vicente";}i:2;i:45;}i:8;a:3:{i:0;s:7:"p_close";i:1;a:0:{}i:2;i:133;}i:9;a:3:{i:0;s:6:"p_open";i:1;a:0:{}i:2;i:133;}i:10;a:3:{i:0;s:5:"cdata";i:1;a:1:{i:0;s:58:"Ausentes: Felipe (Justificado), Paula (Justificado), Paulo";}i:2;i:135;}i:11;a:3:{i:0;s:7:"p_close";i:1;a:0:{}i:2;i:193;}i:12;a:3:{i:0;s:6:"p_open";i:1;a:0:{}i:2;i:193;}i:13;a:3:{i:0;s:5:"cdata";i:1;a:1:{i:0;s:17:"Relator: Estevão";}i:2;i:195;}i:14;a:3:{i:0;s:7:"p_close";i:1;a:0:{}i:2;i:212;}i:15;a:3:{i:0;s:6:"p_open";i:1;a:0:{}i:2;i:212;}i:16;a:3:{i:0;s:5:"cdata";i:1;a:1:{i:0;s:147:"Ps: Esta é a minha primeira Ata e por isso conmsiderem erros e informações não condiscentes com a reunião .Qualquer coisa é só me comunicar.";}i:2;i:214;}i:17;a:3:{i:0;s:7:"p_close";i:1;a:0:{}i:2;i:361;}i:18;a:3:{i:0;s:13:"section_close";i:1;a:0:{}i:2;i:363;}i:19;a:3:{i:0;s:12:"section_edit";i:1;a:4:{i:0;i:1;i:1;i:362;i:2;i:1;i:3;s:29:"Ata da Reunião de 26/01/2006";}i:2;i:363;}i:20;a:3:{i:0;s:6:"header";i:1;a:3:{i:0;s:23:"1. Computador lendário";i:1;i:2;i:2;i:363;}i:2;i:363;}i:21;a:3:{i:0;s:12:"section_open";i:1;a:1:{i:0;i:2;}i:2;i:363;}i:22;a:3:{i:0;s:6:"p_open";i:1;a:0:{}i:2;i:398;}i:23;a:3:{i:0;s:5:"cdata";i:1;a:1:{i:0;s:187:"
Pede-se a colaboração de mais petianos p/ a pesquisa de preços do futuro PC . Fabiano fará o máximo possível para entregar o orçamento para o Luis Otávio até o final da semana .";}i:2;i:399;}i:24;a:3:{i:0;s:7:"p_close";i:1;a:0:{}i:2;i:586;}i:25;a:3:{i:0;s:13:"section_close";i:1;a:0:{}i:2;i:588;}i:26;a:3:{i:0;s:12:"section_edit";i:1;a:4:{i:0;i:363;i:1;i:587;i:2;i:2;i:3;s:23:"1. Computador lendário";}i:2;i:588;}i:27;a:3:{i:0;s:6:"header";i:1;a:3:{i:0;s:21:"2. Relatório RoboPet";i:1;i:2;i:2;i:588;}i:2;i:588;}i:28;a:3:{i:0;s:12:"section_open";i:1;a:1:{i:0;i:2;}i:2;i:588;}i:29;a:3:{i:0;s:6:"p_open";i:1;a:0:{}i:2;i:621;}i:30;a:3:{i:0;s:5:"cdata";i:1;a:1:{i:0;s:133:"
Fabiano prescisa de dados mais atualizados . Pede-se a colaboração de todos os petianos que possuem fotos ,informações ,noticias";}i:2;i:622;}i:31;a:3:{i:0;s:6:"entity";i:1;a:1:{i:0;s:3:"...";}i:2;i:755;}i:32;a:3:{i:0;s:7:"p_close";i:1;a:0:{}i:2;i:758;}i:33;a:3:{i:0;s:13:"section_close";i:1;a:0:{}i:2;i:760;}i:34;a:3:{i:0;s:12:"section_edit";i:1;a:4:{i:0;i:588;i:1;i:759;i:2;i:2;i:3;s:21:"2. Relatório RoboPet";}i:2;i:760;}i:35;a:3:{i:0;s:6:"header";i:1;a:3:{i:0;s:14:"3. Relatórios";i:1;i:2;i:2;i:760;}i:2;i:760;}i:36;a:3:{i:0;s:12:"section_open";i:1;a:1:{i:0;i:2;}i:2;i:760;}i:37;a:3:{i:0;s:6:"p_open";i:1;a:0:{}i:2;i:786;}i:38;a:3:{i:0;s:5:"cdata";i:1;a:1:{i:0;s:266:"
Fazer um mutirão para acabar os relatórios do curso de Linux ,Java e demais cursos. Terminar o mais rápido possível o relatório da Semana Nacional antes que a data de entrega expire. Gustavo ,Marcos e Estevão estão responsavéis de organizar os relatórios .";}i:2;i:787;}i:39;a:3:{i:0;s:7:"p_close";i:1;a:0:{}i:2;i:1053;}i:40;a:3:{i:0;s:13:"section_close";i:1;a:0:{}i:2;i:1055;}i:41;a:3:{i:0;s:12:"section_edit";i:1;a:4:{i:0;i:760;i:1;i:1054;i:2;i:2;i:3;s:14:"3. Relatórios";}i:2;i:1055;}i:42;a:3:{i:0;s:6:"header";i:1;a:3:{i:0;s:29:"4. Portar Abertas 2006 (maio)";i:1;i:2;i:2;i:1055;}i:2;i:1055;}i:43;a:3:{i:0;s:12:"section_open";i:1;a:1:{i:0;i:2;}i:2;i:1055;}i:44;a:3:{i:0;s:6:"p_open";i:1;a:0:{}i:2;i:1096;}i:45;a:3:{i:0;s:5:"cdata";i:1;a:1:{i:0;s:14:"
Sugestões :
";}i:2;i:1097;}i:46;a:3:{i:0;s:7:"p_close";i:1;a:0:{}i:2;i:1111;}i:47;a:3:{i:0;s:10:"listu_open";i:1;a:0:{}i:2;i:1111;}i:48;a:3:{i:0;s:13:"listitem_open";i:1;a:1:{i:0;i:1;}i:2;i:1111;}i:49;a:3:{i:0;s:16:"listcontent_open";i:1;a:0:{}i:2;i:1111;}i:50;a:3:{i:0;s:5:"cdata";i:1;a:1:{i:0;s:28:" Participação do RoboPet .";}i:2;i:1115;}i:51;a:3:{i:0;s:17:"listcontent_close";i:1;a:0:{}i:2;i:1143;}i:52;a:3:{i:0;s:14:"listitem_close";i:1;a:0:{}i:2;i:1143;}i:53;a:3:{i:0;s:13:"listitem_open";i:1;a:1:{i:0;i:1;}i:2;i:1143;}i:54;a:3:{i:0;s:16:"listcontent_open";i:1;a:0:{}i:2;i:1143;}i:55;a:3:{i:0;s:5:"cdata";i:1;a:1:{i:0;s:101:" Participação de 2 professores p/ palestra sobre os cursos de Ciencia e Engenharia de Computação.";}i:2;i:1147;}i:56;a:3:{i:0;s:17:"listcontent_close";i:1;a:0:{}i:2;i:1248;}i:57;a:3:{i:0;s:14:"listitem_close";i:1;a:0:{}i:2;i:1248;}i:58;a:3:{i:0;s:13:"listitem_open";i:1;a:1:{i:0;i:1;}i:2;i:1248;}i:59;a:3:{i:0;s:16:"listcontent_open";i:1;a:0:{}i:2;i:1248;}i:60;a:3:{i:0;s:5:"cdata";i:1;a:1:{i:0;s:44:" Nondillo poderia apresentar o Helicoptero .";}i:2;i:1252;}i:61;a:3:{i:0;s:17:"listcontent_close";i:1;a:0:{}i:2;i:1296;}i:62;a:3:{i:0;s:14:"listitem_close";i:1;a:0:{}i:2;i:1296;}i:63;a:3:{i:0;s:13:"listitem_open";i:1;a:1:{i:0;i:1;}i:2;i:1296;}i:64;a:3:{i:0;s:16:"listcontent_open";i:1;a:0:{}i:2;i:1296;}i:65;a:3:{i:0;s:5:"cdata";i:1;a:1:{i:0;s:34:" Mostrar algumas Peças do Museu .";}i:2;i:1300;}i:66;a:3:{i:0;s:17:"listcontent_close";i:1;a:0:{}i:2;i:1334;}i:67;a:3:{i:0;s:14:"listitem_close";i:1;a:0:{}i:2;i:1334;}i:68;a:3:{i:0;s:13:"listitem_open";i:1;a:1:{i:0;i:1;}i:2;i:1334;}i:69;a:3:{i:0;s:16:"listcontent_open";i:1;a:0:{}i:2;i:1334;}i:70;a:3:{i:0;s:5:"cdata";i:1;a:1:{i:0;s:87:" Tentar buscar uma interatividade com Jogos que farão parte do Museu e Jogos recentes.";}i:2;i:1338;}i:71;a:3:{i:0;s:17:"listcontent_close";i:1;a:0:{}i:2;i:1425;}i:72;a:3:{i:0;s:14:"listitem_close";i:1;a:0:{}i:2;i:1425;}i:73;a:3:{i:0;s:11:"listu_close";i:1;a:0:{}i:2;i:1425;}i:74;a:3:{i:0;s:13:"section_close";i:1;a:0:{}i:2;i:1427;}i:75;a:3:{i:0;s:12:"section_edit";i:1;a:4:{i:0;i:1055;i:1;i:1426;i:2;i:2;i:3;s:29:"4. Portar Abertas 2006 (maio)";}i:2;i:1427;}i:76;a:3:{i:0;s:6:"header";i:1;a:3:{i:0;s:18:"5. Falta do Thiago";i:1;i:2;i:2;i:1427;}i:2;i:1427;}i:77;a:3:{i:0;s:12:"section_open";i:1;a:1:{i:0;i:2;}i:2;i:1427;}i:78;a:3:{i:0;s:6:"p_open";i:1;a:0:{}i:2;i:1457;}i:79;a:3:{i:0;s:5:"cdata";i:1;a:1:{i:0;s:222:"
Ficou doente por uma semana e meia . É inviável cumprir suas horas até final de janeiro . Thiago propõe trabalhar em fevereiro a fim de compensar sua semana ausente e o Grupo Aceita. Thiago se interresa pelo LifaPort.";}i:2;i:1458;}i:80;a:3:{i:0;s:7:"p_close";i:1;a:0:{}i:2;i:1680;}i:81;a:3:{i:0;s:13:"section_close";i:1;a:0:{}i:2;i:1682;}i:82;a:3:{i:0;s:12:"section_edit";i:1;a:4:{i:0;i:1427;i:1;i:1681;i:2;i:2;i:3;s:18:"5. Falta do Thiago";}i:2;i:1682;}i:83;a:3:{i:0;s:6:"header";i:1;a:3:{i:0;s:97:"6. [[/trac/wiki/Sele%C3%A7%C3%A3o/Comiss%C3%A3o|Seleção/Comissão?]] dos novos Bolsistas do PET";i:1;i:2;i:2;i:1682;}i:2;i:1682;}i:84;a:3:{i:0;s:12:"section_open";i:1;a:1:{i:0;i:2;}i:2;i:1682;}i:85;a:3:{i:0;s:6:"p_open";i:1;a:0:{}i:2;i:1791;}i:86;a:3:{i:0;s:5:"cdata";i:1;a:1:{i:0;s:161:"
Seleção deverá ocorrer no inicio do ano letivo. Tentar respeitar a portaria. Comissão será formada por : Estevão ,Thiago e Vicente. Tentar chamar o Weber.";}i:2;i:1792;}i:87;a:3:{i:0;s:7:"p_close";i:1;a:0:{}i:2;i:1953;}i:88;a:3:{i:0;s:13:"section_close";i:1;a:0:{}i:2;i:1955;}i:89;a:3:{i:0;s:12:"section_edit";i:1;a:4:{i:0;i:1682;i:1;i:1954;i:2;i:2;i:3;s:97:"6. [[/trac/wiki/Sele%C3%A7%C3%A3o/Comiss%C3%A3o|Seleção/Comissão?]] dos novos Bolsistas do PET";}i:2;i:1955;}i:90;a:3:{i:0;s:6:"header";i:1;a:3:{i:0;s:23:"7. Atividades Culturais";i:1;i:2;i:2;i:1955;}i:2;i:1955;}i:91;a:3:{i:0;s:12:"section_open";i:1;a:1:{i:0;i:2;}i:2;i:1955;}i:92;a:3:{i:0;s:6:"p_open";i:1;a:0:{}i:2;i:1990;}i:93;a:3:{i:0;s:5:"cdata";i:1;a:1:{i:0;s:26:"
Dante sugere que o filme ";}i:2;i:1991;}i:94;a:3:{i:0;s:18:"doublequoteopening";i:1;a:0:{}i:2;i:2017;}i:95;a:3:{i:0;s:5:"cdata";i:1;a:1:{i:0;s:8:"Münique";}i:2;i:2018;}i:96;a:3:{i:0;s:18:"doublequoteclosing";i:1;a:0:{}i:2;i:2026;}i:97;a:3:{i:0;s:5:"cdata";i:1;a:1:{i:0;s:112:" de Steven Spielberg seja assistido pelo grupo. Marcos ,Gustavo ,Vicente e Thiago iniciam a discussão do livro ";}i:2;i:2027;}i:98;a:3:{i:0;s:18:"doublequoteopening";i:1;a:0:{}i:2;i:2139;}i:99;a:3:{i:0;s:5:"cdata";i:1;a:1:{i:0;s:17:"Fortaleza Digital";}i:2;i:2140;}i:100;a:3:{i:0;s:18:"doublequoteclosing";i:1;a:0:{}i:2;i:2157;}i:101;a:3:{i:0;s:5:"cdata";i:1;a:1:{i:0;s:138:". Dante sugere uma discusão conjunta com a graduação (leitura de algum livro) . Gustavo e Thiago não foram assistir a peça de teatro.";}i:2;i:2158;}i:102;a:3:{i:0;s:7:"p_close";i:1;a:0:{}i:2;i:2296;}i:103;a:3:{i:0;s:13:"section_close";i:1;a:0:{}i:2;i:2298;}i:104;a:3:{i:0;s:12:"section_edit";i:1;a:4:{i:0;i:1955;i:1;i:2297;i:2;i:2;i:3;s:23:"7. Atividades Culturais";}i:2;i:2298;}i:105;a:3:{i:0;s:6:"header";i:1;a:3:{i:0;s:24:"8.Recepçao dos calouros";i:1;i:2;i:2;i:2298;}i:2;i:2298;}i:106;a:3:{i:0;s:12:"section_open";i:1;a:1:{i:0;i:2;}i:2;i:2298;}i:107;a:3:{i:0;s:6:"p_open";i:1;a:0:{}i:2;i:2334;}i:108;a:3:{i:0;s:5:"cdata";i:1;a:1:{i:0;s:13:"
Sugestões:
";}i:2;i:2335;}i:109;a:3:{i:0;s:7:"p_close";i:1;a:0:{}i:2;i:2348;}i:110;a:3:{i:0;s:10:"listu_open";i:1;a:0:{}i:2;i:2348;}i:111;a:3:{i:0;s:13:"listitem_open";i:1;a:1:{i:0;i:1;}i:2;i:2348;}i:112;a:3:{i:0;s:16:"listcontent_open";i:1;a:0:{}i:2;i:2348;}i:113;a:3:{i:0;s:5:"cdata";i:1;a:1:{i:0;s:116:" Realizar uma questionário aos calouros à fim de sabermos seus interreses em algum curso que o PET possa promover.";}i:2;i:2352;}i:114;a:3:{i:0;s:17:"listcontent_close";i:1;a:0:{}i:2;i:2468;}i:115;a:3:{i:0;s:14:"listitem_close";i:1;a:0:{}i:2;i:2468;}i:116;a:3:{i:0;s:13:"listitem_open";i:1;a:1:{i:0;i:1;}i:2;i:2468;}i:117;a:3:{i:0;s:16:"listcontent_open";i:1;a:0:{}i:2;i:2468;}i:118;a:3:{i:0;s:5:"cdata";i:1;a:1:{i:0;s:32:" Realizar um ciclo de palestras.";}i:2;i:2472;}i:119;a:3:{i:0;s:17:"listcontent_close";i:1;a:0:{}i:2;i:2504;}i:120;a:3:{i:0;s:14:"listitem_close";i:1;a:0:{}i:2;i:2504;}i:121;a:3:{i:0;s:13:"listitem_open";i:1;a:1:{i:0;i:1;}i:2;i:2504;}i:122;a:3:{i:0;s:16:"listcontent_open";i:1;a:0:{}i:2;i:2504;}i:123;a:3:{i:0;s:5:"cdata";i:1;a:1:{i:0;s:63:" Tentar conseguir peças antigas para o MUseu de informática .";}i:2;i:2508;}i:124;a:3:{i:0;s:17:"listcontent_close";i:1;a:0:{}i:2;i:2571;}i:125;a:3:{i:0;s:14:"listitem_close";i:1;a:0:{}i:2;i:2571;}i:126;a:3:{i:0;s:11:"listu_close";i:1;a:0:{}i:2;i:2571;}i:127;a:3:{i:0;s:13:"section_close";i:1;a:0:{}i:2;i:2573;}i:128;a:3:{i:0;s:12:"section_edit";i:1;a:4:{i:0;i:2298;i:1;i:2572;i:2;i:2;i:3;s:24:"8.Recepçao dos calouros";}i:2;i:2573;}i:129;a:3:{i:0;s:6:"header";i:1;a:3:{i:0;s:20:"9.Relatório RoboPet";i:1;i:2;i:2;i:2573;}i:2;i:2573;}i:130;a:3:{i:0;s:12:"section_open";i:1;a:1:{i:0;i:2;}i:2;i:2573;}i:131;a:3:{i:0;s:6:"p_open";i:1;a:0:{}i:2;i:2605;}i:132;a:3:{i:0;s:5:"cdata";i:1;a:1:{i:0;s:141:"
Robert solcita ajuda aos petianos (por achar que Paulo não comparecerá mais ao PET até o fim da semana) , Diego se compromete em ajudar .";}i:2;i:2606;}i:133;a:3:{i:0;s:7:"p_close";i:1;a:0:{}i:2;i:2747;}i:134;a:3:{i:0;s:13:"section_close";i:1;a:0:{}i:2;i:2748;}i:135;a:3:{i:0;s:12:"section_edit";i:1;a:4:{i:0;i:2573;i:1;i:0;i:2;i:2;i:3;s:20:"9.Relatório RoboPet";}i:2;i:2748;}i:136;a:3:{i:0;s:12:"document_end";i:1;a:0:{}i:2;i:2748;}}