a:140:{i:0;a:3:{i:0;s:14:"document_start";i:1;a:0:{}i:2;i:0;}i:1;a:3:{i:0;s:6:"p_open";i:1;a:0:{}i:2;i:0;}i:2;a:3:{i:0;s:7:"p_close";i:1;a:0:{}i:2;i:1;}i:3;a:3:{i:0;s:12:"section_edit";i:1;a:4:{i:0;i:-1;i:1;i:0;i:2;i:1;i:3;s:0:"";}i:2;i:1;}i:4;a:3:{i:0;s:6:"header";i:1;a:3:{i:0;s:24:"Ata da reunião de 11/09";i:1;i:1;i:2;i:1;}i:2;i:1;}i:5;a:3:{i:0;s:12:"section_open";i:1;a:1:{i:0;i:1;}i:2;i:1;}i:6;a:3:{i:0;s:10:"listu_open";i:1;a:0:{}i:2;i:40;}i:7;a:3:{i:0;s:13:"listitem_open";i:1;a:1:{i:0;i:1;}i:2;i:40;}i:8;a:3:{i:0;s:16:"listcontent_open";i:1;a:0:{}i:2;i:40;}i:9;a:3:{i:0;s:5:"cdata";i:1;a:1:{i:0;s:152:" Presentes: Antonio, Bruno, Bruno G., Bruno J., Cassiana, Fábio, Guilherme, Kaue, Leonardo, Lucas, Lucas F., Marcos, Matheus, Matheus P., Tyron, Portal";}i:2;i:44;}i:10;a:3:{i:0;s:17:"listcontent_close";i:1;a:0:{}i:2;i:196;}i:11;a:3:{i:0;s:14:"listitem_close";i:1;a:0:{}i:2;i:196;}i:12;a:3:{i:0;s:13:"listitem_open";i:1;a:1:{i:0;i:1;}i:2;i:196;}i:13;a:3:{i:0;s:16:"listcontent_open";i:1;a:0:{}i:2;i:196;}i:14;a:3:{i:0;s:5:"cdata";i:1;a:1:{i:0;s:24:" Ausentes: Dante, Felipe";}i:2;i:200;}i:15;a:3:{i:0;s:17:"listcontent_close";i:1;a:0:{}i:2;i:224;}i:16;a:3:{i:0;s:14:"listitem_close";i:1;a:0:{}i:2;i:224;}i:17;a:3:{i:0;s:11:"listu_close";i:1;a:0:{}i:2;i:224;}i:18;a:3:{i:0;s:10:"listu_open";i:1;a:0:{}i:2;i:225;}i:19;a:3:{i:0;s:13:"listitem_open";i:1;a:1:{i:0;i:1;}i:2;i:225;}i:20;a:3:{i:0;s:16:"listcontent_open";i:1;a:0:{}i:2;i:225;}i:21;a:3:{i:0;s:5:"cdata";i:1;a:1:{i:0;s:17:" Relator: Matheus";}i:2;i:229;}i:22;a:3:{i:0;s:17:"listcontent_close";i:1;a:0:{}i:2;i:246;}i:23;a:3:{i:0;s:14:"listitem_close";i:1;a:0:{}i:2;i:246;}i:24;a:3:{i:0;s:11:"listu_close";i:1;a:0:{}i:2;i:246;}i:25;a:3:{i:0;s:13:"section_close";i:1;a:0:{}i:2;i:248;}i:26;a:3:{i:0;s:12:"section_edit";i:1;a:4:{i:0;i:1;i:1;i:247;i:2;i:1;i:3;s:24:"Ata da reunião de 11/09";}i:2;i:248;}i:27;a:3:{i:0;s:6:"header";i:1;a:3:{i:0;s:10:"1. Lanches";i:1;i:2;i:2;i:248;}i:2;i:248;}i:28;a:3:{i:0;s:12:"section_open";i:1;a:1:{i:0;i:2;}i:2;i:248;}i:29;a:3:{i:0;s:6:"p_open";i:1;a:0:{}i:2;i:270;}i:30;a:3:{i:0;s:5:"cdata";i:1;a:1:{i:0;s:53:"
Marcos trouxe o lanche e o próximo será o Bruno J.";}i:2;i:271;}i:31;a:3:{i:0;s:7:"p_close";i:1;a:0:{}i:2;i:324;}i:32;a:3:{i:0;s:13:"section_close";i:1;a:0:{}i:2;i:326;}i:33;a:3:{i:0;s:12:"section_edit";i:1;a:4:{i:0;i:248;i:1;i:325;i:2;i:2;i:3;s:10:"1. Lanches";}i:2;i:326;}i:34;a:3:{i:0;s:6:"header";i:1;a:3:{i:0;s:77:"2. Aula do Dante com a mulher da Fundação do Pensamento Digital (jurkovski)";i:1;i:2;i:2;i:326;}i:2;i:326;}i:35;a:3:{i:0;s:12:"section_open";i:1;a:1:{i:0;i:2;}i:2;i:326;}i:36;a:3:{i:0;s:6:"p_open";i:1;a:0:{}i:2;i:415;}i:37;a:3:{i:0;s:5:"cdata";i:1;a:1:{i:0;s:53:"
Adiado para proxima reunião, pois o Dante não veio";}i:2;i:416;}i:38;a:3:{i:0;s:7:"p_close";i:1;a:0:{}i:2;i:469;}i:39;a:3:{i:0;s:13:"section_close";i:1;a:0:{}i:2;i:471;}i:40;a:3:{i:0;s:12:"section_edit";i:1;a:4:{i:0;i:326;i:1;i:470;i:2;i:2;i:3;s:77:"2. Aula do Dante com a mulher da Fundação do Pensamento Digital (jurkovski)";}i:2;i:471;}i:41;a:3:{i:0;s:6:"header";i:1;a:3:{i:0;s:25:"3. InterPETão (leonardo)";i:1;i:2;i:2;i:471;}i:2;i:471;}i:42;a:3:{i:0;s:12:"section_open";i:1;a:1:{i:0;i:2;}i:2;i:471;}i:43;a:3:{i:0;s:6:"p_open";i:1;a:0:{}i:2;i:508;}i:44;a:3:{i:0;s:5:"cdata";i:1;a:1:{i:0;s:81:"
Será dia 11 de outubro, sábado, das 13:30 as 17:30 na ESEF. Será um lanchão.";}i:2;i:509;}i:45;a:3:{i:0;s:7:"p_close";i:1;a:0:{}i:2;i:590;}i:46;a:3:{i:0;s:13:"section_close";i:1;a:0:{}i:2;i:592;}i:47;a:3:{i:0;s:12:"section_edit";i:1;a:4:{i:0;i:471;i:1;i:591;i:2;i:2;i:3;s:25:"3. InterPETão (leonardo)";}i:2;i:592;}i:48;a:3:{i:0;s:6:"header";i:1;a:3:{i:0;s:33:"4. tesouraria - dívidas (portal)";i:1;i:2;i:2;i:592;}i:2;i:592;}i:49;a:3:{i:0;s:12:"section_open";i:1;a:1:{i:0;i:2;}i:2;i:592;}i:50;a:3:{i:0;s:6:"p_open";i:1;a:0:{}i:2;i:637;}i:51;a:3:{i:0;s:5:"cdata";i:1;a:1:{i:0;s:69:"
O PET caixa tem R$ 742,99, e ainda exitem dividas a serem quitadas.
";}i:2;i:638;}i:52;a:3:{i:0;s:7:"p_close";i:1;a:0:{}i:2;i:707;}i:53;a:3:{i:0;s:10:"listu_open";i:1;a:0:{}i:2;i:707;}i:54;a:3:{i:0;s:13:"listitem_open";i:1;a:1:{i:0;i:1;}i:2;i:707;}i:55;a:3:{i:0;s:16:"listcontent_open";i:1;a:0:{}i:2;i:707;}i:56;a:3:{i:0;s:5:"cdata";i:1;a:1:{i:0;s:9:" Antônio";}i:2;i:711;}i:57;a:3:{i:0;s:17:"listcontent_close";i:1;a:0:{}i:2;i:720;}i:58;a:3:{i:0;s:14:"listitem_close";i:1;a:0:{}i:2;i:720;}i:59;a:3:{i:0;s:13:"listitem_open";i:1;a:1:{i:0;i:1;}i:2;i:720;}i:60;a:3:{i:0;s:16:"listcontent_open";i:1;a:0:{}i:2;i:720;}i:61;a:3:{i:0;s:5:"cdata";i:1;a:1:{i:0;s:6:" Bruno";}i:2;i:724;}i:62;a:3:{i:0;s:17:"listcontent_close";i:1;a:0:{}i:2;i:730;}i:63;a:3:{i:0;s:14:"listitem_close";i:1;a:0:{}i:2;i:730;}i:64;a:3:{i:0;s:13:"listitem_open";i:1;a:1:{i:0;i:1;}i:2;i:730;}i:65;a:3:{i:0;s:16:"listcontent_open";i:1;a:0:{}i:2;i:730;}i:66;a:3:{i:0;s:5:"cdata";i:1;a:1:{i:0;s:21:" Zambiasi (R$ 600,00)";}i:2;i:734;}i:67;a:3:{i:0;s:17:"listcontent_close";i:1;a:0:{}i:2;i:755;}i:68;a:3:{i:0;s:14:"listitem_close";i:1;a:0:{}i:2;i:755;}i:69;a:3:{i:0;s:13:"listitem_open";i:1;a:1:{i:0;i:1;}i:2;i:755;}i:70;a:3:{i:0;s:16:"listcontent_open";i:1;a:0:{}i:2;i:755;}i:71;a:3:{i:0;s:5:"cdata";i:1;a:1:{i:0;s:19:" Thiago (R$ 300,00)";}i:2;i:759;}i:72;a:3:{i:0;s:17:"listcontent_close";i:1;a:0:{}i:2;i:778;}i:73;a:3:{i:0;s:14:"listitem_close";i:1;a:0:{}i:2;i:778;}i:74;a:3:{i:0;s:13:"listitem_open";i:1;a:1:{i:0;i:1;}i:2;i:778;}i:75;a:3:{i:0;s:16:"listcontent_open";i:1;a:0:{}i:2;i:778;}i:76;a:3:{i:0;s:5:"cdata";i:1;a:1:{i:0;s:16:" Talvez o Arthur";}i:2;i:782;}i:77;a:3:{i:0;s:17:"listcontent_close";i:1;a:0:{}i:2;i:798;}i:78;a:3:{i:0;s:14:"listitem_close";i:1;a:0:{}i:2;i:798;}i:79;a:3:{i:0;s:11:"listu_close";i:1;a:0:{}i:2;i:798;}i:80;a:3:{i:0;s:13:"section_close";i:1;a:0:{}i:2;i:800;}i:81;a:3:{i:0;s:12:"section_edit";i:1;a:4:{i:0;i:592;i:1;i:799;i:2;i:2;i:3;s:33:"4. tesouraria - dívidas (portal)";}i:2;i:800;}i:82;a:3:{i:0;s:6:"header";i:1;a:3:{i:0;s:19:"5. PETCafé (bruno)";i:1;i:2;i:2;i:800;}i:2;i:800;}i:83;a:3:{i:0;s:12:"section_open";i:1;a:1:{i:0;i:2;}i:2;i:800;}i:84;a:3:{i:0;s:6:"p_open";i:1;a:0:{}i:2;i:831;}i:85;a:3:{i:0;s:5:"cdata";i:1;a:1:{i:0;s:43:"
Quem não pagou, PAGAR setembro e outubro.";}i:2;i:832;}i:86;a:3:{i:0;s:7:"p_close";i:1;a:0:{}i:2;i:875;}i:87;a:3:{i:0;s:13:"section_close";i:1;a:0:{}i:2;i:877;}i:88;a:3:{i:0;s:12:"section_edit";i:1;a:4:{i:0;i:800;i:1;i:876;i:2;i:2;i:3;s:19:"5. PETCafé (bruno)";}i:2;i:877;}i:89;a:3:{i:0;s:6:"header";i:1;a:3:{i:0;s:50:"6. proximo pc a ser formatado e ajudantes? (bruno)";i:1;i:2;i:2;i:877;}i:2;i:877;}i:90;a:3:{i:0;s:12:"section_open";i:1;a:1:{i:0;i:2;}i:2;i:877;}i:91;a:3:{i:0;s:6:"p_open";i:1;a:0:{}i:2;i:939;}i:92;a:3:{i:0;s:5:"cdata";i:1;a:1:{i:0;s:72:"
A katyuchia será a próxima a ser formatada. O Matheus P. irá ajudar.";}i:2;i:940;}i:93;a:3:{i:0;s:7:"p_close";i:1;a:0:{}i:2;i:1012;}i:94;a:3:{i:0;s:13:"section_close";i:1;a:0:{}i:2;i:1014;}i:95;a:3:{i:0;s:12:"section_edit";i:1;a:4:{i:0;i:877;i:1;i:1013;i:2;i:2;i:3;s:50:"6. proximo pc a ser formatado e ajudantes? (bruno)";}i:2;i:1014;}i:96;a:3:{i:0;s:6:"header";i:1;a:3:{i:0;s:36:"7. barulho nos laboratórios (bruno)";i:1;i:2;i:2;i:1014;}i:2;i:1014;}i:97;a:3:{i:0;s:12:"section_open";i:1;a:1:{i:0;i:2;}i:2;i:1014;}i:98;a:3:{i:0;s:6:"p_open";i:1;a:0:{}i:2;i:1062;}i:99;a:3:{i:0;s:5:"cdata";i:1;a:1:{i:0;s:129:"
Aos que usam o LRI, tomar cuidado para nao fazer muito barulho. Houve professores que reclamaram das músicas e conversas altas.";}i:2;i:1063;}i:100;a:3:{i:0;s:7:"p_close";i:1;a:0:{}i:2;i:1192;}i:101;a:3:{i:0;s:13:"section_close";i:1;a:0:{}i:2;i:1194;}i:102;a:3:{i:0;s:12:"section_edit";i:1;a:4:{i:0;i:1014;i:1;i:1193;i:2;i:2;i:3;s:36:"7. barulho nos laboratórios (bruno)";}i:2;i:1194;}i:103;a:3:{i:0;s:6:"header";i:1;a:3:{i:0;s:8:"8. HCIMA";i:1;i:2;i:2;i:1194;}i:2;i:1194;}i:104;a:3:{i:0;s:12:"section_open";i:1;a:1:{i:0;i:2;}i:2;i:1194;}i:105;a:3:{i:0;s:6:"p_open";i:1;a:0:{}i:2;i:1214;}i:106;a:3:{i:0;s:5:"cdata";i:1;a:1:{i:0;s:144:"
É uma competição de Mecatrônica e Automação. O Bruno irá mandar o texto para todo mundo para avaliarmos a possibilidade de participamos.";}i:2;i:1215;}i:107;a:3:{i:0;s:7:"p_close";i:1;a:0:{}i:2;i:1359;}i:108;a:3:{i:0;s:13:"section_close";i:1;a:0:{}i:2;i:1361;}i:109;a:3:{i:0;s:12:"section_edit";i:1;a:4:{i:0;i:1194;i:1;i:1360;i:2;i:2;i:3;s:8:"8. HCIMA";}i:2;i:1361;}i:110;a:3:{i:0;s:6:"header";i:1;a:3:{i:0;s:14:"9. Arquivo PET";i:1;i:2;i:2;i:1361;}i:2;i:1361;}i:111;a:3:{i:0;s:12:"section_open";i:1;a:1:{i:0;i:2;}i:2;i:1361;}i:112;a:3:{i:0;s:6:"p_open";i:1;a:0:{}i:2;i:1387;}i:113;a:3:{i:0;s:5:"cdata";i:1;a:1:{i:0;s:224:"
Esperar pelo Dante para decidir o que é importante. Pelos organizadores a maioria poderia ir fora. Foi encontrados materiais de seleção antigos, currículos, slides, cartões postais, de natal, relatórios, certificados,";}i:2;i:1388;}i:114;a:3:{i:0;s:6:"entity";i:1;a:1:{i:0;s:3:"...";}i:2;i:1612;}i:115;a:3:{i:0;s:5:"cdata";i:1;a:1:{i:0;s:1:" ";}i:2;i:1615;}i:116;a:3:{i:0;s:6:"entity";i:1;a:1:{i:0;s:3:"...";}i:2;i:1616;}i:117;a:3:{i:0;s:5:"cdata";i:1;a:1:{i:0;s:1:" ";}i:2;i:1619;}i:118;a:3:{i:0;s:6:"entity";i:1;a:1:{i:0;s:3:"...";}i:2;i:1620;}i:119;a:3:{i:0;s:5:"cdata";i:1;a:1:{i:0;s:1:" ";}i:2;i:1623;}i:120;a:3:{i:0;s:6:"entity";i:1;a:1:{i:0;s:3:"...";}i:2;i:1624;}i:121;a:3:{i:0;s:5:"cdata";i:1;a:1:{i:0;s:1:"
";}i:2;i:1627;}i:122;a:3:{i:0;s:7:"p_close";i:1;a:0:{}i:2;i:1628;}i:123;a:3:{i:0;s:10:"listu_open";i:1;a:0:{}i:2;i:1628;}i:124;a:3:{i:0;s:13:"listitem_open";i:1;a:1:{i:0;i:1;}i:2;i:1628;}i:125;a:3:{i:0;s:16:"listcontent_open";i:1;a:0:{}i:2;i:1628;}i:126;a:3:{i:0;s:5:"cdata";i:1;a:1:{i:0;s:103:" Comentário do Portal: É bom guardar documentos com nome de ex-petianos a fim de estudos de egressos.";}i:2;i:1632;}i:127;a:3:{i:0;s:17:"listcontent_close";i:1;a:0:{}i:2;i:1735;}i:128;a:3:{i:0;s:14:"listitem_close";i:1;a:0:{}i:2;i:1735;}i:129;a:3:{i:0;s:11:"listu_close";i:1;a:0:{}i:2;i:1735;}i:130;a:3:{i:0;s:13:"section_close";i:1;a:0:{}i:2;i:1737;}i:131;a:3:{i:0;s:12:"section_edit";i:1;a:4:{i:0;i:1361;i:1;i:1736;i:2;i:2;i:3;s:14:"9. Arquivo PET";}i:2;i:1737;}i:132;a:3:{i:0;s:6:"header";i:1;a:3:{i:0;s:15:"10. PET Futibas";i:1;i:2;i:2;i:1737;}i:2;i:1737;}i:133;a:3:{i:0;s:12:"section_open";i:1;a:1:{i:0;i:2;}i:2;i:1737;}i:134;a:3:{i:0;s:6:"p_open";i:1;a:0:{}i:2;i:1764;}i:135;a:3:{i:0;s:5:"cdata";i:1;a:1:{i:0;s:115:"
26 de Setembro de 2008, sexta de noite, no Planet Ball ou HD. (os dois lugares são lá perto da cristiano fisher)";}i:2;i:1765;}i:136;a:3:{i:0;s:7:"p_close";i:1;a:0:{}i:2;i:1880;}i:137;a:3:{i:0;s:13:"section_close";i:1;a:0:{}i:2;i:1881;}i:138;a:3:{i:0;s:12:"section_edit";i:1;a:4:{i:0;i:1737;i:1;i:0;i:2;i:2;i:3;s:15:"10. PET Futibas";}i:2;i:1881;}i:139;a:3:{i:0;s:12:"document_end";i:1;a:0:{}i:2;i:1881;}}