a:174:{i:0;a:3:{i:0;s:14:"document_start";i:1;a:0:{}i:2;i:0;}i:1;a:3:{i:0;s:6:"p_open";i:1;a:0:{}i:2;i:0;}i:2;a:3:{i:0;s:7:"p_close";i:1;a:0:{}i:2;i:1;}i:3;a:3:{i:0;s:12:"section_edit";i:1;a:4:{i:0;i:-1;i:1;i:0;i:2;i:1;i:3;s:0:"";}i:2;i:1;}i:4;a:3:{i:0;s:6:"header";i:1;a:3:{i:0;s:29:"Ata da Reunião de 11/07/2006";i:1;i:1;i:2;i:1;}i:2;i:1;}i:5;a:3:{i:0;s:12:"section_open";i:1;a:1:{i:0;i:1;}i:2;i:1;}i:6;a:3:{i:0;s:6:"p_open";i:1;a:0:{}i:2;i:44;}i:7;a:3:{i:0;s:5:"cdata";i:1;a:1:{i:0;s:150:"
Presentes: Alexandre, Dante, Estevão, Fabiano, Felipe, Gabriela, Lucas Cavalheiro, Lucas Mizusaki, Marcelo, Marcos, Nondillo, Pablo, Ricardo, Thiago";}i:2;i:45;}i:8;a:3:{i:0;s:7:"p_close";i:1;a:0:{}i:2;i:195;}i:9;a:3:{i:0;s:6:"p_open";i:1;a:0:{}i:2;i:195;}i:10;a:3:{i:0;s:5:"cdata";i:1;a:1:{i:0;s:11:"Ausentes: -";}i:2;i:197;}i:11;a:3:{i:0;s:7:"p_close";i:1;a:0:{}i:2;i:208;}i:12;a:3:{i:0;s:6:"p_open";i:1;a:0:{}i:2;i:208;}i:13;a:3:{i:0;s:5:"cdata";i:1;a:1:{i:0;s:18:"Relatora: Gabriela";}i:2;i:210;}i:14;a:3:{i:0;s:7:"p_close";i:1;a:0:{}i:2;i:228;}i:15;a:3:{i:0;s:13:"section_close";i:1;a:0:{}i:2;i:230;}i:16;a:3:{i:0;s:12:"section_edit";i:1;a:4:{i:0;i:1;i:1;i:229;i:2;i:1;i:3;s:29:"Ata da Reunião de 11/07/2006";}i:2;i:230;}i:17;a:3:{i:0;s:6:"header";i:1;a:3:{i:0;s:13:"1. Curso de C";i:1;i:2;i:2;i:230;}i:2;i:230;}i:18;a:3:{i:0;s:12:"section_open";i:1;a:1:{i:0;i:2;}i:2;i:230;}i:19;a:3:{i:0;s:6:"p_open";i:1;a:0:{}i:2;i:255;}i:20;a:3:{i:0;s:5:"cdata";i:1;a:1:{i:0;s:267:"
Foi perguntado ao grupo quem estaria interessado em ministrar o Curso de C . Estevão, Marcos e Felipe se mostraram interessados e ficou decidido que na próxima reunião eles deveriam comunicar mais informações sobre o curso ( quando eles pretendem ministrá-lo).";}i:2;i:256;}i:21;a:3:{i:0;s:7:"p_close";i:1;a:0:{}i:2;i:523;}i:22;a:3:{i:0;s:13:"section_close";i:1;a:0:{}i:2;i:525;}i:23;a:3:{i:0;s:12:"section_edit";i:1;a:4:{i:0;i:230;i:1;i:524;i:2;i:2;i:3;s:13:"1. Curso de C";}i:2;i:525;}i:24;a:3:{i:0;s:6:"header";i:1;a:3:{i:0;s:11:"2. Reunião";i:1;i:2;i:2;i:525;}i:2;i:525;}i:25;a:3:{i:0;s:12:"section_open";i:1;a:1:{i:0;i:2;}i:2;i:525;}i:26;a:3:{i:0;s:6:"p_open";i:1;a:0:{}i:2;i:548;}i:27;a:3:{i:0;s:5:"cdata";i:1;a:1:{i:0;s:86:"
Ficou decidido que a próxima reunião ocorrerá no dia 27/07 (quarta-feira) às 14h.";}i:2;i:549;}i:28;a:3:{i:0;s:7:"p_close";i:1;a:0:{}i:2;i:635;}i:29;a:3:{i:0;s:13:"section_close";i:1;a:0:{}i:2;i:637;}i:30;a:3:{i:0;s:12:"section_edit";i:1;a:4:{i:0;i:525;i:1;i:636;i:2;i:2;i:3;s:11:"2. Reunião";}i:2;i:637;}i:31;a:3:{i:0;s:6:"header";i:1;a:3:{i:0;s:44:"3. Cadastramento das Atividades de Extensão";i:1;i:2;i:2;i:637;}i:2;i:637;}i:32;a:3:{i:0;s:12:"section_open";i:1;a:1:{i:0;i:2;}i:2;i:637;}i:33;a:3:{i:0;s:6:"p_open";i:1;a:0:{}i:2;i:693;}i:34;a:3:{i:0;s:5:"cdata";i:1;a:1:{i:0;s:162:"
Foi proposto ao grupo voluntários para o cadastramento das atividades de extensão, sendo assim, ficou decidido que os responsáveis por cada atividade serão:
";}i:2;i:694;}i:35;a:3:{i:0;s:7:"p_close";i:1;a:0:{}i:2;i:856;}i:36;a:3:{i:0;s:10:"listu_open";i:1;a:0:{}i:2;i:856;}i:37;a:3:{i:0;s:13:"listitem_open";i:1;a:1:{i:0;i:1;}i:2;i:856;}i:38;a:3:{i:0;s:16:"listcontent_open";i:1;a:0:{}i:2;i:856;}i:39;a:3:{i:0;s:5:"cdata";i:1;a:1:{i:0;s:20:" RoboEDU - Gabriela;";}i:2;i:860;}i:40;a:3:{i:0;s:17:"listcontent_close";i:1;a:0:{}i:2;i:880;}i:41;a:3:{i:0;s:14:"listitem_close";i:1;a:0:{}i:2;i:880;}i:42;a:3:{i:0;s:13:"listitem_open";i:1;a:1:{i:0;i:1;}i:2;i:880;}i:43;a:3:{i:0;s:16:"listcontent_open";i:1;a:0:{}i:2;i:880;}i:44;a:3:{i:0;s:5:"cdata";i:1;a:1:{i:0;s:17:" Museu - Marcelo;";}i:2;i:884;}i:45;a:3:{i:0;s:17:"listcontent_close";i:1;a:0:{}i:2;i:901;}i:46;a:3:{i:0;s:14:"listitem_close";i:1;a:0:{}i:2;i:901;}i:47;a:3:{i:0;s:13:"listitem_open";i:1;a:1:{i:0;i:1;}i:2;i:901;}i:48;a:3:{i:0;s:16:"listcontent_open";i:1;a:0:{}i:2;i:901;}i:49;a:3:{i:0;s:5:"cdata";i:1;a:1:{i:0;s:27:" Ciclo de Debates - Felipe;";}i:2;i:905;}i:50;a:3:{i:0;s:17:"listcontent_close";i:1;a:0:{}i:2;i:932;}i:51;a:3:{i:0;s:14:"listitem_close";i:1;a:0:{}i:2;i:932;}i:52;a:3:{i:0;s:13:"listitem_open";i:1;a:1:{i:0;i:1;}i:2;i:932;}i:53;a:3:{i:0;s:16:"listcontent_open";i:1;a:0:{}i:2;i:932;}i:54;a:3:{i:0;s:5:"cdata";i:1;a:1:{i:0;s:29:" Semana Nacional - Alexandre.";}i:2;i:936;}i:55;a:3:{i:0;s:17:"listcontent_close";i:1;a:0:{}i:2;i:965;}i:56;a:3:{i:0;s:14:"listitem_close";i:1;a:0:{}i:2;i:965;}i:57;a:3:{i:0;s:11:"listu_close";i:1;a:0:{}i:2;i:965;}i:58;a:3:{i:0;s:13:"section_close";i:1;a:0:{}i:2;i:967;}i:59;a:3:{i:0;s:12:"section_edit";i:1;a:4:{i:0;i:637;i:1;i:966;i:2;i:2;i:3;s:44:"3. Cadastramento das Atividades de Extensão";}i:2;i:967;}i:60;a:3:{i:0;s:6:"header";i:1;a:3:{i:0;s:21:"4. Atividade Cultural";i:1;i:2;i:2;i:967;}i:2;i:967;}i:61;a:3:{i:0;s:12:"section_open";i:1;a:1:{i:0;i:2;}i:2;i:967;}i:62;a:3:{i:0;s:6:"p_open";i:1;a:0:{}i:2;i:1000;}i:63;a:3:{i:0;s:5:"cdata";i:1;a:1:{i:0;s:125:"
Estevão e Dante propõe como atividade cultural uma peça de teatro. Dante comenta que essa semana está sendo apresentado ";}i:2;i:1001;}i:64;a:3:{i:0;s:18:"doublequoteopening";i:1;a:0:{}i:2;i:1126;}i:65;a:3:{i:0;s:5:"cdata";i:1;a:1:{i:0;s:6:"Hamlet";}i:2;i:1127;}i:66;a:3:{i:0;s:18:"doublequoteclosing";i:1;a:0:{}i:2;i:1133;}i:67;a:3:{i:0;s:5:"cdata";i:1;a:1:{i:0;s:212:". Fica decidido que quem não puder assistir essa semana, assistirá uma peça na semana após o enapet e essa atividade será discutida na reunião que terá depois das nossas férias, dia 09/08 (provavelmente).";}i:2;i:1134;}i:68;a:3:{i:0;s:7:"p_close";i:1;a:0:{}i:2;i:1346;}i:69;a:3:{i:0;s:13:"section_close";i:1;a:0:{}i:2;i:1348;}i:70;a:3:{i:0;s:12:"section_edit";i:1;a:4:{i:0;i:967;i:1;i:1347;i:2;i:2;i:3;s:21:"4. Atividade Cultural";}i:2;i:1348;}i:71;a:3:{i:0;s:6:"header";i:1;a:3:{i:0;s:29:"5. Novos projetos de pesquisa";i:1;i:2;i:2;i:1348;}i:2;i:1348;}i:72;a:3:{i:0;s:12:"section_open";i:1;a:1:{i:0;i:2;}i:2;i:1348;}i:73;a:3:{i:0;s:6:"p_open";i:1;a:0:{}i:2;i:1389;}i:74;a:3:{i:0;s:5:"cdata";i:1;a:1:{i:0;s:299:"
Dante quer saber como anda os projetos de pesquisa dos petianos. Marcos comenta que está muito em cima para apresentar algum projeto dos CICs na semana nacional. Dante propõe um projeto na área de multimídia, para projeções de cartazes na semana nacional, mas ninguém se mostra interessado.
";}i:2;i:1390;}i:75;a:3:{i:0;s:7:"p_close";i:1;a:0:{}i:2;i:1689;}i:76;a:3:{i:0;s:10:"listu_open";i:1;a:0:{}i:2;i:1689;}i:77;a:3:{i:0;s:13:"listitem_open";i:1;a:1:{i:0;i:1;}i:2;i:1689;}i:78;a:3:{i:0;s:16:"listcontent_open";i:1;a:0:{}i:2;i:1689;}i:79;a:3:{i:0;s:5:"cdata";i:1;a:1:{i:0;s:74:" RoboEDU: Fabiano comenta que os ECPs ficarão bem ocupados com o projeto.";}i:2;i:1693;}i:80;a:3:{i:0;s:17:"listcontent_close";i:1;a:0:{}i:2;i:1767;}i:81;a:3:{i:0;s:14:"listitem_close";i:1;a:0:{}i:2;i:1767;}i:82;a:3:{i:0;s:13:"listitem_open";i:1;a:1:{i:0;i:1;}i:2;i:1767;}i:83;a:3:{i:0;s:16:"listcontent_open";i:1;a:0:{}i:2;i:1767;}i:84;a:3:{i:0;s:5:"cdata";i:1;a:1:{i:0;s:103:" Curso de Linux: Marcelo e Thiago estão envolvidos, que provavelmente terá inicio no fim das férias.";}i:2;i:1771;}i:85;a:3:{i:0;s:17:"listcontent_close";i:1;a:0:{}i:2;i:1874;}i:86;a:3:{i:0;s:14:"listitem_close";i:1;a:0:{}i:2;i:1874;}i:87;a:3:{i:0;s:13:"listitem_open";i:1;a:1:{i:0;i:1;}i:2;i:1874;}i:88;a:3:{i:0;s:16:"listcontent_open";i:1;a:0:{}i:2;i:1874;}i:89;a:3:{i:0;s:5:"cdata";i:1;a:1:{i:0;s:81:" Projeto de CG: Marcos e Felipe conversarão sobre a continuação desse projeto.";}i:2;i:1878;}i:90;a:3:{i:0;s:17:"listcontent_close";i:1;a:0:{}i:2;i:1959;}i:91;a:3:{i:0;s:14:"listitem_close";i:1;a:0:{}i:2;i:1959;}i:92;a:3:{i:0;s:13:"listitem_open";i:1;a:1:{i:0;i:1;}i:2;i:1959;}i:93;a:3:{i:0;s:16:"listcontent_open";i:1;a:0:{}i:2;i:1959;}i:94;a:3:{i:0;s:5:"cdata";i:1;a:1:{i:0;s:119:" Projeto do Museu: Marcelo e Felipe estão encarregados de fazer uns cartazes sobre a história da informática no RGS.";}i:2;i:1963;}i:95;a:3:{i:0;s:17:"listcontent_close";i:1;a:0:{}i:2;i:2082;}i:96;a:3:{i:0;s:14:"listitem_close";i:1;a:0:{}i:2;i:2082;}i:97;a:3:{i:0;s:11:"listu_close";i:1;a:0:{}i:2;i:2082;}i:98;a:3:{i:0;s:6:"p_open";i:1;a:0:{}i:2;i:2082;}i:99;a:3:{i:0;s:5:"cdata";i:1;a:1:{i:0;s:119:"
Ficou concluido que os CICs ficarão mais voltados para o ensino, até surgir uma boa idéia para projeto de pesquisa.";}i:2;i:2083;}i:100;a:3:{i:0;s:7:"p_close";i:1;a:0:{}i:2;i:2202;}i:101;a:3:{i:0;s:13:"section_close";i:1;a:0:{}i:2;i:2204;}i:102;a:3:{i:0;s:12:"section_edit";i:1;a:4:{i:0;i:1348;i:1;i:2203;i:2;i:2;i:3;s:29:"5. Novos projetos de pesquisa";}i:2;i:2204;}i:103;a:3:{i:0;s:6:"header";i:1;a:3:{i:0;s:9:"6. Enapet";i:1;i:2;i:2;i:2204;}i:2;i:2204;}i:104;a:3:{i:0;s:12:"section_open";i:1;a:1:{i:0;i:2;}i:2;i:2204;}i:105;a:3:{i:0;s:6:"p_open";i:1;a:0:{}i:2;i:2225;}i:106;a:3:{i:0;s:5:"cdata";i:1;a:1:{i:0;s:199:"
Fica acertado que todos os petianos devem depositar 185 reais na conta do PET, exceto Gabriela que terá que depositar só 125 reais, porque deve entregar os 60 reais referente à parte do Mizusaki.";}i:2;i:2226;}i:107;a:3:{i:0;s:7:"p_close";i:1;a:0:{}i:2;i:2425;}i:108;a:3:{i:0;s:13:"section_close";i:1;a:0:{}i:2;i:2427;}i:109;a:3:{i:0;s:12:"section_edit";i:1;a:4:{i:0;i:2204;i:1;i:2426;i:2;i:2;i:3;s:9:"6. Enapet";}i:2;i:2427;}i:110;a:3:{i:0;s:6:"header";i:1;a:3:{i:0;s:22:"7. Ar Condicionado LRI";i:1;i:2;i:2;i:2427;}i:2;i:2427;}i:111;a:3:{i:0;s:12:"section_open";i:1;a:1:{i:0;i:2;}i:2;i:2427;}i:112;a:3:{i:0;s:6:"p_open";i:1;a:0:{}i:2;i:2461;}i:113;a:3:{i:0;s:5:"cdata";i:1;a:1:{i:0;s:102:"
É sugerido colocar um aviso na porta do LRI para ninguém esquecer de desligar o ar quando for sair.";}i:2;i:2462;}i:114;a:3:{i:0;s:7:"p_close";i:1;a:0:{}i:2;i:2564;}i:115;a:3:{i:0;s:13:"section_close";i:1;a:0:{}i:2;i:2566;}i:116;a:3:{i:0;s:12:"section_edit";i:1;a:4:{i:0;i:2427;i:1;i:2565;i:2;i:2;i:3;s:22:"7. Ar Condicionado LRI";}i:2;i:2566;}i:117;a:3:{i:0;s:6:"header";i:1;a:3:{i:0;s:13:"8. Protoboard";i:1;i:2;i:2;i:2566;}i:2;i:2566;}i:118;a:3:{i:0;s:12:"section_open";i:1;a:1:{i:0;i:2;}i:2;i:2566;}i:119;a:3:{i:0;s:6:"p_open";i:1;a:0:{}i:2;i:2591;}i:120;a:3:{i:0;s:5:"cdata";i:1;a:1:{i:0;s:94:"
Gabriela sugere que seja comprada uma nova protoboard como material de consumo, grupo apóia.";}i:2;i:2592;}i:121;a:3:{i:0;s:7:"p_close";i:1;a:0:{}i:2;i:2686;}i:122;a:3:{i:0;s:13:"section_close";i:1;a:0:{}i:2;i:2688;}i:123;a:3:{i:0;s:12:"section_edit";i:1;a:4:{i:0;i:2566;i:1;i:2687;i:2;i:2;i:3;s:13:"8. Protoboard";}i:2;i:2688;}i:124;a:3:{i:0;s:6:"header";i:1;a:3:{i:0;s:21:"9. Confraternização";i:1;i:2;i:2;i:2688;}i:2;i:2688;}i:125;a:3:{i:0;s:12:"section_open";i:1;a:1:{i:0;i:2;}i:2;i:2688;}i:126;a:3:{i:0;s:6:"p_open";i:1;a:0:{}i:2;i:2721;}i:127;a:3:{i:0;s:5:"cdata";i:1;a:1:{i:0;s:56:"
É acertado os últimos detalhes da confraternização.";}i:2;i:2722;}i:128;a:3:{i:0;s:7:"p_close";i:1;a:0:{}i:2;i:2778;}i:129;a:3:{i:0;s:13:"section_close";i:1;a:0:{}i:2;i:2780;}i:130;a:3:{i:0;s:12:"section_edit";i:1;a:4:{i:0;i:2688;i:1;i:2779;i:2;i:2;i:3;s:21:"9. Confraternização";}i:2;i:2780;}i:131;a:3:{i:0;s:6:"header";i:1;a:3:{i:0;s:25:"10. Intensivão Robótica";i:1;i:2;i:2;i:2780;}i:2;i:2780;}i:132;a:3:{i:0;s:12:"section_open";i:1;a:1:{i:0;i:2;}i:2;i:2780;}i:133;a:3:{i:0;s:6:"p_open";i:1;a:0:{}i:2;i:2817;}i:134;a:3:{i:0;s:5:"cdata";i:1;a:1:{i:0;s:71:"
Caso necessário será levado um PC para LRI na quarta-feira à tarde.";}i:2;i:2818;}i:135;a:3:{i:0;s:7:"p_close";i:1;a:0:{}i:2;i:2889;}i:136;a:3:{i:0;s:13:"section_close";i:1;a:0:{}i:2;i:2891;}i:137;a:3:{i:0;s:12:"section_edit";i:1;a:4:{i:0;i:2780;i:1;i:2890;i:2;i:2;i:3;s:25:"10. Intensivão Robótica";}i:2;i:2891;}i:138;a:3:{i:0;s:6:"header";i:1;a:3:{i:0;s:24:"11. Reunião Comgrad-CIC";i:1;i:2;i:2;i:2891;}i:2;i:2891;}i:139;a:3:{i:0;s:12:"section_open";i:1;a:1:{i:0;i:2;}i:2;i:2891;}i:140;a:3:{i:0;s:6:"p_open";i:1;a:0:{}i:2;i:2927;}i:141;a:3:{i:0;s:5:"cdata";i:1;a:1:{i:0;s:234:"
Marcos comenta que Weber falou que qualquer mudança no currículo só poderá ocorrer para 2007/1, e que terá uma reunião na quarta-feira à tarde com professores que discutirá mudanças no currículo. Marcelo se prontifica a ir.";}i:2;i:2928;}i:142;a:3:{i:0;s:7:"p_close";i:1;a:0:{}i:2;i:3162;}i:143;a:3:{i:0;s:13:"section_close";i:1;a:0:{}i:2;i:3164;}i:144;a:3:{i:0;s:12:"section_edit";i:1;a:4:{i:0;i:2891;i:1;i:3163;i:2;i:2;i:3;s:24:"11. Reunião Comgrad-CIC";}i:2;i:3164;}i:145;a:3:{i:0;s:6:"header";i:1;a:3:{i:0;s:16:"12. Horas Enapet";i:1;i:2;i:2;i:3164;}i:2;i:3164;}i:146;a:3:{i:0;s:12:"section_open";i:1;a:1:{i:0;i:2;}i:2;i:3164;}i:147;a:3:{i:0;s:6:"p_open";i:1;a:0:{}i:2;i:3192;}i:148;a:3:{i:0;s:5:"cdata";i:1;a:1:{i:0;s:119:"
A semana em floripa para o enapet contará como 12h de trabalho no PET e essas horas devem ser pedidas como pendentes.";}i:2;i:3193;}i:149;a:3:{i:0;s:7:"p_close";i:1;a:0:{}i:2;i:3312;}i:150;a:3:{i:0;s:13:"section_close";i:1;a:0:{}i:2;i:3314;}i:151;a:3:{i:0;s:12:"section_edit";i:1;a:4:{i:0;i:3164;i:1;i:3313;i:2;i:2;i:3;s:16:"12. Horas Enapet";}i:2;i:3314;}i:152;a:3:{i:0;s:6:"header";i:1;a:3:{i:0;s:32:"13. Discussão Assembléia Geral";i:1;i:2;i:2;i:3314;}i:2;i:3314;}i:153;a:3:{i:0;s:12:"section_open";i:1;a:1:{i:0;i:2;}i:2;i:3314;}i:154;a:3:{i:0;s:6:"p_open";i:1;a:0:{}i:2;i:3358;}i:155;a:3:{i:0;s:5:"cdata";i:1;a:1:{i:0;s:237:"
Felipe conta como foi a discussão, dizendo que os representes dos Grupos PET-UFRGS gostaram do documento proposto e que Josué (pet-odonto) fará um documento apoiando a proposta, e fazendo uma sugestão de tempo máximo para o debate.";}i:2;i:3359;}i:156;a:3:{i:0;s:7:"p_close";i:1;a:0:{}i:2;i:3596;}i:157;a:3:{i:0;s:13:"section_close";i:1;a:0:{}i:2;i:3598;}i:158;a:3:{i:0;s:12:"section_edit";i:1;a:4:{i:0;i:3314;i:1;i:3597;i:2;i:2;i:3;s:32:"13. Discussão Assembléia Geral";}i:2;i:3598;}i:159;a:3:{i:0;s:6:"header";i:1;a:3:{i:0;s:12:"14. Tecnopuc";i:1;i:2;i:2;i:3598;}i:2;i:3598;}i:160;a:3:{i:0;s:12:"section_open";i:1;a:1:{i:0;i:2;}i:2;i:3598;}i:161;a:3:{i:0;s:6:"p_open";i:1;a:0:{}i:2;i:3622;}i:162;a:3:{i:0;s:5:"cdata";i:1;a:1:{i:0;s:133:"
A visita ao tecnopuc não ocorrerá mais no dia 14/07, ela deverá ocorrer após o enapet, mas ainda não tem nenhuma data definida.";}i:2;i:3623;}i:163;a:3:{i:0;s:7:"p_close";i:1;a:0:{}i:2;i:3756;}i:164;a:3:{i:0;s:13:"section_close";i:1;a:0:{}i:2;i:3758;}i:165;a:3:{i:0;s:12:"section_edit";i:1;a:4:{i:0;i:3598;i:1;i:3757;i:2;i:2;i:3;s:12:"14. Tecnopuc";}i:2;i:3758;}i:166;a:3:{i:0;s:6:"header";i:1;a:3:{i:0;s:18:"15. Férias do PET";i:1;i:2;i:2;i:3758;}i:2;i:3758;}i:167;a:3:{i:0;s:12:"section_open";i:1;a:1:{i:0;i:2;}i:2;i:3758;}i:168;a:3:{i:0;s:6:"p_open";i:1;a:0:{}i:2;i:3788;}i:169;a:3:{i:0;s:5:"cdata";i:1;a:1:{i:0;s:104:"
Ficou acertado que só teremos 1 semana de férias de inverno, que será do dia 31/07 até o dia 06/08.";}i:2;i:3789;}i:170;a:3:{i:0;s:7:"p_close";i:1;a:0:{}i:2;i:3893;}i:171;a:3:{i:0;s:13:"section_close";i:1;a:0:{}i:2;i:3894;}i:172;a:3:{i:0;s:12:"section_edit";i:1;a:4:{i:0;i:3758;i:1;i:0;i:2;i:2;i:3;s:18:"15. Férias do PET";}i:2;i:3894;}i:173;a:3:{i:0;s:12:"document_end";i:1;a:0:{}i:2;i:3894;}}