a:189:{i:0;a:3:{i:0;s:14:"document_start";i:1;a:0:{}i:2;i:0;}i:1;a:3:{i:0;s:6:"p_open";i:1;a:0:{}i:2;i:0;}i:2;a:3:{i:0;s:7:"p_close";i:1;a:0:{}i:2;i:1;}i:3;a:3:{i:0;s:12:"section_edit";i:1;a:4:{i:0;i:-1;i:1;i:0;i:2;i:1;i:3;s:0:"";}i:2;i:1;}i:4;a:3:{i:0;s:6:"header";i:1;a:3:{i:0;s:29:"Ata da reunião de 10/10/2006";i:1;i:1;i:2;i:1;}i:2;i:1;}i:5;a:3:{i:0;s:12:"section_open";i:1;a:1:{i:0;i:1;}i:2;i:1;}i:6;a:3:{i:0;s:6:"p_open";i:1;a:0:{}i:2;i:44;}i:7;a:3:{i:0;s:5:"cdata";i:1;a:1:{i:0;s:1:"
";}i:2;i:45;}i:8;a:3:{i:0;s:11:"strong_open";i:1;a:0:{}i:2;i:46;}i:9;a:3:{i:0;s:5:"cdata";i:1;a:1:{i:0;s:11:"Presentes: ";}i:2;i:48;}i:10;a:3:{i:0;s:12:"strong_close";i:1;a:0:{}i:2;i:59;}i:11;a:3:{i:0;s:5:"cdata";i:1;a:1:{i:0;s:101:"Alexandre, Dante, Fabiano, Felipe, Gabriela, Lucas Mizusaki, Marcelo, Marcos, Pablo, Ricardo, Thiago.";}i:2;i:61;}i:12;a:3:{i:0;s:7:"p_close";i:1;a:0:{}i:2;i:162;}i:13;a:3:{i:0;s:6:"p_open";i:1;a:0:{}i:2;i:162;}i:14;a:3:{i:0;s:11:"strong_open";i:1;a:0:{}i:2;i:164;}i:15;a:3:{i:0;s:5:"cdata";i:1;a:1:{i:0;s:10:"Ausentes: ";}i:2;i:166;}i:16;a:3:{i:0;s:12:"strong_close";i:1;a:0:{}i:2;i:176;}i:17;a:3:{i:0;s:5:"cdata";i:1;a:1:{i:0;s:8:" Nenhum.";}i:2;i:178;}i:18;a:3:{i:0;s:7:"p_close";i:1;a:0:{}i:2;i:186;}i:19;a:3:{i:0;s:6:"p_open";i:1;a:0:{}i:2;i:186;}i:20;a:3:{i:0;s:11:"strong_open";i:1;a:0:{}i:2;i:188;}i:21;a:3:{i:0;s:5:"cdata";i:1;a:1:{i:0;s:10:"Relatora: ";}i:2;i:190;}i:22;a:3:{i:0;s:12:"strong_close";i:1;a:0:{}i:2;i:200;}i:23;a:3:{i:0;s:5:"cdata";i:1;a:1:{i:0;s:9:"Gabriela.";}i:2;i:202;}i:24;a:3:{i:0;s:7:"p_close";i:1;a:0:{}i:2;i:211;}i:25;a:3:{i:0;s:13:"section_close";i:1;a:0:{}i:2;i:213;}i:26;a:3:{i:0;s:12:"section_edit";i:1;a:4:{i:0;i:1;i:1;i:212;i:2;i:1;i:3;s:29:"Ata da reunião de 10/10/2006";}i:2;i:213;}i:27;a:3:{i:0;s:6:"header";i:1;a:3:{i:0;s:38:"1) Dinheiro do projeto RoboEDU - cetec";i:1;i:3;i:2;i:213;}i:2;i:213;}i:28;a:3:{i:0;s:12:"section_open";i:1;a:1:{i:0;i:3;}i:2;i:213;}i:29;a:3:{i:0;s:6:"p_open";i:1;a:0:{}i:2;i:261;}i:30;a:3:{i:0;s:5:"cdata";i:1;a:1:{i:0;s:184:"
O grupo ficou de fazer uma lista de consumo, no valor aproximado de R$30.000 até segunda-feira no máximo e o Alessandro ficará responsável por repassá-la ao órgão responsável.";}i:2;i:262;}i:31;a:3:{i:0;s:7:"p_close";i:1;a:0:{}i:2;i:446;}i:32;a:3:{i:0;s:13:"section_close";i:1;a:0:{}i:2;i:448;}i:33;a:3:{i:0;s:12:"section_edit";i:1;a:4:{i:0;i:213;i:1;i:447;i:2;i:3;i:3;s:38:"1) Dinheiro do projeto RoboEDU - cetec";}i:2;i:448;}i:34;a:3:{i:0;s:6:"header";i:1;a:3:{i:0;s:48:"2) Comissão de Organização dos 18 anos do PET";i:1;i:3;i:2;i:448;}i:2;i:448;}i:35;a:3:{i:0;s:12:"section_open";i:1;a:1:{i:0;i:3;}i:2;i:448;}i:36;a:3:{i:0;s:6:"p_open";i:1;a:0:{}i:2;i:506;}i:37;a:3:{i:0;s:5:"cdata";i:1;a:1:{i:0;s:105:"
Marcos e Flores ficarão responsáveis pela organização, contando com o apoio do Marcelo e do Thiago.
";}i:2;i:507;}i:38;a:3:{i:0;s:7:"p_close";i:1;a:0:{}i:2;i:612;}i:39;a:3:{i:0;s:10:"listu_open";i:1;a:0:{}i:2;i:612;}i:40;a:3:{i:0;s:13:"listitem_open";i:1;a:1:{i:0;i:1;}i:2;i:612;}i:41;a:3:{i:0;s:16:"listcontent_open";i:1;a:0:{}i:2;i:612;}i:42;a:3:{i:0;s:5:"cdata";i:1;a:1:{i:0;s:23:" 06/11 - 10 anos do CEI";}i:2;i:616;}i:43;a:3:{i:0;s:17:"listcontent_close";i:1;a:0:{}i:2;i:639;}i:44;a:3:{i:0;s:14:"listitem_close";i:1;a:0:{}i:2;i:639;}i:45;a:3:{i:0;s:13:"listitem_open";i:1;a:1:{i:0;i:1;}i:2;i:639;}i:46;a:3:{i:0;s:16:"listcontent_open";i:1;a:0:{}i:2;i:639;}i:47;a:3:{i:0;s:5:"cdata";i:1;a:1:{i:0;s:25:" 10/11 - Palestra Palazzo";}i:2;i:643;}i:48;a:3:{i:0;s:17:"listcontent_close";i:1;a:0:{}i:2;i:668;}i:49;a:3:{i:0;s:14:"listitem_close";i:1;a:0:{}i:2;i:668;}i:50;a:3:{i:0;s:13:"listitem_open";i:1;a:1:{i:0;i:1;}i:2;i:668;}i:51;a:3:{i:0;s:16:"listcontent_open";i:1;a:0:{}i:2;i:668;}i:52;a:3:{i:0;s:5:"cdata";i:1;a:1:{i:0;s:20:" 17/11 - Museu ( ? )";}i:2;i:672;}i:53;a:3:{i:0;s:17:"listcontent_close";i:1;a:0:{}i:2;i:692;}i:54;a:3:{i:0;s:14:"listitem_close";i:1;a:0:{}i:2;i:692;}i:55;a:3:{i:0;s:13:"listitem_open";i:1;a:1:{i:0;i:1;}i:2;i:692;}i:56;a:3:{i:0;s:16:"listcontent_open";i:1;a:0:{}i:2;i:692;}i:57;a:3:{i:0;s:5:"cdata";i:1;a:1:{i:0;s:31:" proposta de mini-salão de IC.";}i:2;i:696;}i:58;a:3:{i:0;s:17:"listcontent_close";i:1;a:0:{}i:2;i:727;}i:59;a:3:{i:0;s:14:"listitem_close";i:1;a:0:{}i:2;i:727;}i:60;a:3:{i:0;s:11:"listu_close";i:1;a:0:{}i:2;i:727;}i:61;a:3:{i:0;s:6:"p_open";i:1;a:0:{}i:2;i:727;}i:62;a:3:{i:0;s:5:"cdata";i:1;a:1:{i:0;s:113:"
Todos devem continuar buscando algum tipo de contato com os ex-petianos, para convidá-los para a comemoração.";}i:2;i:728;}i:63;a:3:{i:0;s:7:"p_close";i:1;a:0:{}i:2;i:841;}i:64;a:3:{i:0;s:13:"section_close";i:1;a:0:{}i:2;i:843;}i:65;a:3:{i:0;s:12:"section_edit";i:1;a:4:{i:0;i:448;i:1;i:842;i:2;i:3;i:3;s:48:"2) Comissão de Organização dos 18 anos do PET";}i:2;i:843;}i:66;a:3:{i:0;s:6:"header";i:1;a:3:{i:0;s:10:"3)InterPET";i:1;i:3;i:2;i:843;}i:2;i:843;}i:67;a:3:{i:0;s:12:"section_open";i:1;a:1:{i:0;i:3;}i:2;i:843;}i:68;a:3:{i:0;s:6:"p_open";i:1;a:0:{}i:2;i:863;}i:69;a:3:{i:0;s:5:"cdata";i:1;a:1:{i:0;s:83:"
Felipe e Marcelo comentam a pauta que será discutida hoje no InterPET, às 19h30.";}i:2;i:864;}i:70;a:3:{i:0;s:7:"p_close";i:1;a:0:{}i:2;i:947;}i:71;a:3:{i:0;s:13:"section_close";i:1;a:0:{}i:2;i:949;}i:72;a:3:{i:0;s:12:"section_edit";i:1;a:4:{i:0;i:843;i:1;i:948;i:2;i:3;i:3;s:10:"3)InterPET";}i:2;i:949;}i:73;a:3:{i:0;s:6:"header";i:1;a:3:{i:0;s:23:"4)Comisão de seleção";i:1;i:3;i:2;i:949;}i:2;i:949;}i:74;a:3:{i:0;s:12:"section_open";i:1;a:1:{i:0;i:3;}i:2;i:949;}i:75;a:3:{i:0;s:6:"p_open";i:1;a:0:{}i:2;i:982;}i:76;a:3:{i:0;s:5:"cdata";i:1;a:1:{i:0;s:420:"
Foi comentado que enviaram 17 currículos para a seleção, sendo que 2 desses serão eliminados por conterem mais de 1 reprovação. A pricípio a entrevista do candidatos ocorrerá dia 20, sexta, às 15h30. Felipe ficou de convidar algum representante da direção do II para participar da seleção. Gabriela e Capra ficaram responsáveis por mandar um email para os candidatos avisando o dia e a hora da entrevista.";}i:2;i:983;}i:77;a:3:{i:0;s:7:"p_close";i:1;a:0:{}i:2;i:1403;}i:78;a:3:{i:0;s:13:"section_close";i:1;a:0:{}i:2;i:1405;}i:79;a:3:{i:0;s:12:"section_edit";i:1;a:4:{i:0;i:949;i:1;i:1404;i:2;i:3;i:3;s:23:"4)Comisão de seleção";}i:2;i:1405;}i:80;a:3:{i:0;s:6:"header";i:1;a:3:{i:0;s:22:"5)Devolução da Bolsa";i:1;i:3;i:2;i:1405;}i:2;i:1405;}i:81;a:3:{i:0;s:12:"section_open";i:1;a:1:{i:0;i:3;}i:2;i:1405;}i:82;a:3:{i:0;s:10:"listu_open";i:1;a:0:{}i:2;i:1438;}i:83;a:3:{i:0;s:13:"listitem_open";i:1;a:1:{i:0;i:1;}i:2;i:1438;}i:84;a:3:{i:0;s:16:"listcontent_open";i:1;a:0:{}i:2;i:1438;}i:85;a:3:{i:0;s:5:"cdata";i:1;a:1:{i:0;s:39:" Estevão - 2 bolsas (setembro/outubro)";}i:2;i:1442;}i:86;a:3:{i:0;s:17:"listcontent_close";i:1;a:0:{}i:2;i:1481;}i:87;a:3:{i:0;s:14:"listitem_close";i:1;a:0:{}i:2;i:1481;}i:88;a:3:{i:0;s:13:"listitem_open";i:1;a:1:{i:0;i:1;}i:2;i:1481;}i:89;a:3:{i:0;s:16:"listcontent_open";i:1;a:0:{}i:2;i:1481;}i:90;a:3:{i:0;s:5:"cdata";i:1;a:1:{i:0;s:32:" Cavalheiro - 1 bolsa (outubro).";}i:2;i:1485;}i:91;a:3:{i:0;s:17:"listcontent_close";i:1;a:0:{}i:2;i:1517;}i:92;a:3:{i:0;s:14:"listitem_close";i:1;a:0:{}i:2;i:1517;}i:93;a:3:{i:0;s:11:"listu_close";i:1;a:0:{}i:2;i:1517;}i:94;a:3:{i:0;s:13:"section_close";i:1;a:0:{}i:2;i:1519;}i:95;a:3:{i:0;s:12:"section_edit";i:1;a:4:{i:0;i:1405;i:1;i:1518;i:2;i:3;i:3;s:22:"5)Devolução da Bolsa";}i:2;i:1519;}i:96;a:3:{i:0;s:6:"header";i:1;a:3:{i:0;s:16:"6) Curso de HTML";i:1;i:3;i:2;i:1519;}i:2;i:1519;}i:97;a:3:{i:0;s:12:"section_open";i:1;a:1:{i:0;i:3;}i:2;i:1519;}i:98;a:3:{i:0;s:6:"p_open";i:1;a:0:{}i:2;i:1545;}i:99;a:3:{i:0;s:5:"cdata";i:1;a:1:{i:0;s:189:"
Pablo comenta sobre o curso de html que ele ministrou no salão de extensão. Ele mostrou para o grupo um gráfico mostrando o interesse dos alunos em outros cursos para serem ministrados.";}i:2;i:1546;}i:100;a:3:{i:0;s:7:"p_close";i:1;a:0:{}i:2;i:1735;}i:101;a:3:{i:0;s:13:"section_close";i:1;a:0:{}i:2;i:1737;}i:102;a:3:{i:0;s:12:"section_edit";i:1;a:4:{i:0;i:1519;i:1;i:1736;i:2;i:3;i:3;s:16:"6) Curso de HTML";}i:2;i:1737;}i:103;a:3:{i:0;s:6:"header";i:1;a:3:{i:0;s:30:"7) Planejamento das Atividades";i:1;i:3;i:2;i:1737;}i:2;i:1737;}i:104;a:3:{i:0;s:12:"section_open";i:1;a:1:{i:0;i:3;}i:2;i:1737;}i:105;a:3:{i:0;s:6:"p_open";i:1;a:0:{}i:2;i:1777;}i:106;a:3:{i:0;s:5:"cdata";i:1;a:1:{i:0;s:190:"
Felipe comenta que o planejamento das atividades deverá ser feito, Pablo ficará resposável. Deverá ser incluso: Centro e vivência, escola técnica, cursos, roboEDU e os 18 anos do PET.";}i:2;i:1778;}i:107;a:3:{i:0;s:7:"p_close";i:1;a:0:{}i:2;i:1968;}i:108;a:3:{i:0;s:6:"p_open";i:1;a:0:{}i:2;i:1968;}i:109;a:3:{i:0;s:5:"cdata";i:1;a:1:{i:0;s:167:"=== 8) Site do LRI = Marcos mostra que existe um link para a página do LRI, que está fora do ar. Ele dá a idéia de resgatar o site e ficará responsável por isso.";}i:2;i:1970;}i:110;a:3:{i:0;s:7:"p_close";i:1;a:0:{}i:2;i:2137;}i:111;a:3:{i:0;s:13:"section_close";i:1;a:0:{}i:2;i:2139;}i:112;a:3:{i:0;s:12:"section_edit";i:1;a:4:{i:0;i:1737;i:1;i:2138;i:2;i:3;i:3;s:30:"7) Planejamento das Atividades";}i:2;i:2139;}i:113;a:3:{i:0;s:6:"header";i:1;a:3:{i:0;s:13:"9) Curso de C";i:1;i:3;i:2;i:2139;}i:2;i:2139;}i:114;a:3:{i:0;s:12:"section_open";i:1;a:1:{i:0;i:3;}i:2;i:2139;}i:115;a:3:{i:0;s:6:"p_open";i:1;a:0:{}i:2;i:2162;}i:116;a:3:{i:0;s:5:"cdata";i:1;a:1:{i:0;s:468:"
==== 9.1) Instituto Flores comenta sobre o curso ministrado aqui no II, comentando a experiência positiva de lecionar. Marcos mostra a avaliação do curso feito pelos alunos, mostrando as notas altas que receberão. O curso foi muito bem visto pelos alunos que já estão esperando o próximo. ==== 9.2) Escola Técnica Flores comenta que talvez tenha havido alguma confusão sobre a temática do curso, pois na escola técnica eles acreditam que será um curso de ";}i:2;i:2163;}i:117;a:3:{i:0;s:18:"doublequoteopening";i:1;a:0:{}i:2;i:2631;}i:118;a:3:{i:0;s:5:"cdata";i:1;a:1:{i:0;s:25:"introdução à robótica";}i:2;i:2632;}i:119;a:3:{i:0;s:18:"doublequoteclosing";i:1;a:0:{}i:2;i:2657;}i:120;a:3:{i:0;s:5:"cdata";i:1;a:1:{i:0;s:89:" e a nossa inteção era fazer um curso de C. Flores mandará um email esclarecendo isso.";}i:2;i:2658;}i:121;a:3:{i:0;s:7:"p_close";i:1;a:0:{}i:2;i:2747;}i:122;a:3:{i:0;s:13:"section_close";i:1;a:0:{}i:2;i:2749;}i:123;a:3:{i:0;s:12:"section_edit";i:1;a:4:{i:0;i:2139;i:1;i:2748;i:2;i:3;i:3;s:13:"9) Curso de C";}i:2;i:2749;}i:124;a:3:{i:0;s:6:"header";i:1;a:3:{i:0;s:24:"10) Cumprimento de Horas";i:1;i:3;i:2;i:2749;}i:2;i:2749;}i:125;a:3:{i:0;s:12:"section_open";i:1;a:1:{i:0;i:3;}i:2;i:2749;}i:126;a:3:{i:0;s:6:"p_open";i:1;a:0:{}i:2;i:2783;}i:127;a:3:{i:0;s:5:"cdata";i:1;a:1:{i:0;s:123:"
Marcos ficou devendo 2h12min que deverão ser cumpridas neste mês. Todos os demais petianos cumpriram sua carga horária.";}i:2;i:2784;}i:128;a:3:{i:0;s:7:"p_close";i:1;a:0:{}i:2;i:2907;}i:129;a:3:{i:0;s:13:"section_close";i:1;a:0:{}i:2;i:2909;}i:130;a:3:{i:0;s:12:"section_edit";i:1;a:4:{i:0;i:2749;i:1;i:2908;i:2;i:3;i:3;s:24:"10) Cumprimento de Horas";}i:2;i:2909;}i:131;a:3:{i:0;s:6:"header";i:1;a:3:{i:0;s:23:"11)Relatórios semanais";i:1;i:3;i:2;i:2909;}i:2;i:2909;}i:132;a:3:{i:0;s:12:"section_open";i:1;a:1:{i:0;i:3;}i:2;i:2909;}i:133;a:3:{i:0;s:6:"p_open";i:1;a:0:{}i:2;i:2942;}i:134;a:3:{i:0;s:5:"cdata";i:1;a:1:{i:0;s:138:"
A reunião para a discussão dos relatórios semanais deverá ser realizada semana que vem, dia 17/10, terça, após a reunião do grupo.";}i:2;i:2943;}i:135;a:3:{i:0;s:7:"p_close";i:1;a:0:{}i:2;i:3081;}i:136;a:3:{i:0;s:13:"section_close";i:1;a:0:{}i:2;i:3083;}i:137;a:3:{i:0;s:12:"section_edit";i:1;a:4:{i:0;i:2909;i:1;i:3082;i:2;i:3;i:3;s:23:"11)Relatórios semanais";}i:2;i:3083;}i:138;a:3:{i:0;s:6:"header";i:1;a:3:{i:0;s:22:"12)Material de Consumo";i:1;i:3;i:2;i:3083;}i:2;i:3083;}i:139;a:3:{i:0;s:12:"section_open";i:1;a:1:{i:0;i:3;}i:2;i:3083;}i:140;a:3:{i:0;s:6:"p_open";i:1;a:0:{}i:2;i:3115;}i:141;a:3:{i:0;s:5:"cdata";i:1;a:1:{i:0;s:303:"
Gabriela comenta que foi buscar o material de consumo lá na prograd e tudo que foi pedido eles compraram e o valor excedeu em R$891 que será descontado da verba do ano que vem. Comenta também que está faltando 1 carregador de pilhas. Gabriela e Fabiano ficarão encarregados de comprar os gabintes.";}i:2;i:3116;}i:142;a:3:{i:0;s:7:"p_close";i:1;a:0:{}i:2;i:3419;}i:143;a:3:{i:0;s:13:"section_close";i:1;a:0:{}i:2;i:3421;}i:144;a:3:{i:0;s:12:"section_edit";i:1;a:4:{i:0;i:3083;i:1;i:3420;i:2;i:3;i:3;s:22:"12)Material de Consumo";}i:2;i:3421;}i:145;a:3:{i:0;s:6:"header";i:1;a:3:{i:0;s:16:"13) Salão Jovem";i:1;i:3;i:2;i:3421;}i:2;i:3421;}i:146;a:3:{i:0;s:12:"section_open";i:1;a:1:{i:0;i:3;}i:2;i:3421;}i:147;a:3:{i:0;s:6:"p_open";i:1;a:0:{}i:2;i:3447;}i:148;a:3:{i:0;s:5:"cdata";i:1;a:1:{i:0;s:59:"
Mizu ligará para saber da nossa participação no salão.";}i:2;i:3448;}i:149;a:3:{i:0;s:7:"p_close";i:1;a:0:{}i:2;i:3507;}i:150;a:3:{i:0;s:13:"section_close";i:1;a:0:{}i:2;i:3509;}i:151;a:3:{i:0;s:12:"section_edit";i:1;a:4:{i:0;i:3421;i:1;i:3508;i:2;i:3;i:3;s:16:"13) Salão Jovem";}i:2;i:3509;}i:152;a:3:{i:0;s:6:"header";i:1;a:3:{i:0;s:32:"14) Ações de Inclusão Digital";i:1;i:3;i:2;i:3509;}i:2;i:3509;}i:153;a:3:{i:0;s:12:"section_open";i:1;a:1:{i:0;i:3;}i:2;i:3509;}i:154;a:3:{i:0;s:6:"p_open";i:1;a:0:{}i:2;i:3551;}i:155;a:3:{i:0;s:5:"cdata";i:1;a:1:{i:0;s:95:"
Thiago visitou o CV, onde foi montado um laboratório com alguns computadores para integrar a ";}i:2;i:3552;}i:156;a:3:{i:0;s:18:"doublequoteopening";i:1;a:0:{}i:2;i:3647;}i:157;a:3:{i:0;s:5:"cdata";i:1;a:1:{i:0;s:19:"vila-universitária";}i:2;i:3648;}i:158;a:3:{i:0;s:18:"doublequoteclosing";i:1;a:0:{}i:2;i:3667;}i:159;a:3:{i:0;s:5:"cdata";i:1;a:1:{i:0;s:170:" com a UFRGS . Opfojeto visa fazer uma inclusão social das crianças da vila. Dante faz uma proposta de fazer o lançamento do museu e chamar as crianças para assistir.";}i:2;i:3668;}i:160;a:3:{i:0;s:7:"p_close";i:1;a:0:{}i:2;i:3838;}i:161;a:3:{i:0;s:13:"section_close";i:1;a:0:{}i:2;i:3840;}i:162;a:3:{i:0;s:12:"section_edit";i:1;a:4:{i:0;i:3509;i:1;i:3839;i:2;i:3;i:3;s:32:"14) Ações de Inclusão Digital";}i:2;i:3840;}i:163;a:3:{i:0;s:6:"header";i:1;a:3:{i:0;s:36:"15)Audiência de Robótica no senado";i:1;i:3;i:2;i:3840;}i:2;i:3840;}i:164;a:3:{i:0;s:12:"section_open";i:1;a:1:{i:0;i:3;}i:2;i:3840;}i:165;a:3:{i:0;s:6:"p_open";i:1;a:0:{}i:2;i:3886;}i:166;a:3:{i:0;s:5:"cdata";i:1;a:1:{i:0;s:75:"
Dante comenta que terá uma audiência pública no senado sobre robótica.";}i:2;i:3887;}i:167;a:3:{i:0;s:7:"p_close";i:1;a:0:{}i:2;i:3962;}i:168;a:3:{i:0;s:13:"section_close";i:1;a:0:{}i:2;i:3964;}i:169;a:3:{i:0;s:12:"section_edit";i:1;a:4:{i:0;i:3840;i:1;i:3963;i:2;i:3;i:3;s:36:"15)Audiência de Robótica no senado";}i:2;i:3964;}i:170;a:3:{i:0;s:6:"header";i:1;a:3:{i:0;s:24:"16) Atividades Culturais";i:1;i:3;i:2;i:3964;}i:2;i:3964;}i:171;a:3:{i:0;s:12:"section_open";i:1;a:1:{i:0;i:3;}i:2;i:3964;}i:172;a:3:{i:0;s:6:"p_open";i:1;a:0:{}i:2;i:3998;}i:173;a:3:{i:0;s:5:"cdata";i:1;a:1:{i:0;s:34:"
Dante propõe que todos assistam ";}i:2;i:3999;}i:174;a:3:{i:0;s:18:"doublequoteopening";i:1;a:0:{}i:2;i:4033;}i:175;a:3:{i:0;s:5:"cdata";i:1;a:1:{i:0;s:14:"torres Gêmeas";}i:2;i:4034;}i:176;a:3:{i:0;s:18:"doublequoteclosing";i:1;a:0:{}i:2;i:4048;}i:177;a:3:{i:0;s:5:"cdata";i:1;a:1:{i:0;s:53:" para depois fazermos uma discussão sobre o assunto.";}i:2;i:4049;}i:178;a:3:{i:0;s:7:"p_close";i:1;a:0:{}i:2;i:4102;}i:179;a:3:{i:0;s:13:"section_close";i:1;a:0:{}i:2;i:4104;}i:180;a:3:{i:0;s:12:"section_edit";i:1;a:4:{i:0;i:3964;i:1;i:4103;i:2;i:3;i:3;s:24:"16) Atividades Culturais";}i:2;i:4104;}i:181;a:3:{i:0;s:6:"header";i:1;a:3:{i:0;s:11:"17) Férias";i:1;i:3;i:2;i:4104;}i:2;i:4104;}i:182;a:3:{i:0;s:12:"section_open";i:1;a:1:{i:0;i:3;}i:2;i:4104;}i:183;a:3:{i:0;s:6:"p_open";i:1;a:0:{}i:2;i:4125;}i:184;a:3:{i:0;s:5:"cdata";i:1;a:1:{i:0;s:407:"
Thiago disse que fará uma viagem de 2 meses durante as férias e que pretende cumprir 18h por mês para cobrir as horas do mês que estará ausente. Fabiano comenta que deverá tirar férias no início de janeiro. As férias serão provavelmente em fevereiro. Teremos 1 semana de férias no final de novembro/dezembro ficará a cargo de cada um avisar ao grupo a semana escolhida para tirar essas férias.";}i:2;i:4126;}i:185;a:3:{i:0;s:7:"p_close";i:1;a:0:{}i:2;i:4533;}i:186;a:3:{i:0;s:13:"section_close";i:1;a:0:{}i:2;i:4534;}i:187;a:3:{i:0;s:12:"section_edit";i:1;a:4:{i:0;i:4104;i:1;i:0;i:2;i:3;i:3;s:11:"17) Férias";}i:2;i:4534;}i:188;a:3:{i:0;s:12:"document_end";i:1;a:0:{}i:2;i:4534;}}