a:138:{i:0;a:3:{i:0;s:14:"document_start";i:1;a:0:{}i:2;i:0;}i:1;a:3:{i:0;s:6:"p_open";i:1;a:0:{}i:2;i:0;}i:2;a:3:{i:0;s:7:"p_close";i:1;a:0:{}i:2;i:1;}i:3;a:3:{i:0;s:12:"section_edit";i:1;a:4:{i:0;i:-1;i:1;i:0;i:2;i:1;i:3;s:0:"";}i:2;i:1;}i:4;a:3:{i:0;s:6:"header";i:1;a:3:{i:0;s:40:"Ata da Reunião de 21 de Outubro de 2008";i:1;i:1;i:2;i:1;}i:2;i:1;}i:5;a:3:{i:0;s:12:"section_open";i:1;a:1:{i:0;i:1;}i:2;i:1;}i:6;a:3:{i:0;s:10:"listu_open";i:1;a:0:{}i:2;i:56;}i:7;a:3:{i:0;s:13:"listitem_open";i:1;a:1:{i:0;i:1;}i:2;i:56;}i:8;a:3:{i:0;s:16:"listcontent_open";i:1;a:0:{}i:2;i:56;}i:9;a:3:{i:0;s:5:"cdata";i:1;a:1:{i:0;s:137:" Presentes: Antonio, Bruno G., Bruno J., Cassiana, Fábio, Felipe, Kauê, Leonardo, Lucas F., Marcos, Matheus, Matheus P., Tyron, Portal;";}i:2;i:60;}i:10;a:3:{i:0;s:17:"listcontent_close";i:1;a:0:{}i:2;i:197;}i:11;a:3:{i:0;s:14:"listitem_close";i:1;a:0:{}i:2;i:197;}i:12;a:3:{i:0;s:13:"listitem_open";i:1;a:1:{i:0;i:1;}i:2;i:197;}i:13;a:3:{i:0;s:16:"listcontent_open";i:1;a:0:{}i:2;i:197;}i:14;a:3:{i:0;s:5:"cdata";i:1;a:1:{i:0;s:24:" Ausentes: Bruno, Dante;";}i:2;i:201;}i:15;a:3:{i:0;s:17:"listcontent_close";i:1;a:0:{}i:2;i:225;}i:16;a:3:{i:0;s:14:"listitem_close";i:1;a:0:{}i:2;i:225;}i:17;a:3:{i:0;s:13:"listitem_open";i:1;a:1:{i:0;i:1;}i:2;i:225;}i:18;a:3:{i:0;s:16:"listcontent_open";i:1;a:0:{}i:2;i:225;}i:19;a:3:{i:0;s:5:"cdata";i:1;a:1:{i:0;s:85:" Atrasos: Matheus Proença (chegou durante o ponto da Reunião sobre a Mobilização)";}i:2;i:229;}i:20;a:3:{i:0;s:17:"listcontent_close";i:1;a:0:{}i:2;i:314;}i:21;a:3:{i:0;s:14:"listitem_close";i:1;a:0:{}i:2;i:314;}i:22;a:3:{i:0;s:13:"listitem_open";i:1;a:1:{i:0;i:1;}i:2;i:314;}i:23;a:3:{i:0;s:16:"listcontent_open";i:1;a:0:{}i:2;i:314;}i:24;a:3:{i:0;s:5:"cdata";i:1;a:1:{i:0;s:93:" Saídas Adiantadas: Marcos Cavinato (saiu durante o ponto da Reunião sobre a Mobilização)";}i:2;i:318;}i:25;a:3:{i:0;s:17:"listcontent_close";i:1;a:0:{}i:2;i:411;}i:26;a:3:{i:0;s:14:"listitem_close";i:1;a:0:{}i:2;i:411;}i:27;a:3:{i:0;s:11:"listu_close";i:1;a:0:{}i:2;i:411;}i:28;a:3:{i:0;s:10:"listu_open";i:1;a:0:{}i:2;i:412;}i:29;a:3:{i:0;s:13:"listitem_open";i:1;a:1:{i:0;i:1;}i:2;i:412;}i:30;a:3:{i:0;s:16:"listcontent_open";i:1;a:0:{}i:2;i:412;}i:31;a:3:{i:0;s:5:"cdata";i:1;a:1:{i:0;s:26:" Relator: Matheus Proença";}i:2;i:416;}i:32;a:3:{i:0;s:17:"listcontent_close";i:1;a:0:{}i:2;i:442;}i:33;a:3:{i:0;s:14:"listitem_close";i:1;a:0:{}i:2;i:442;}i:34;a:3:{i:0;s:11:"listu_close";i:1;a:0:{}i:2;i:442;}i:35;a:3:{i:0;s:13:"section_close";i:1;a:0:{}i:2;i:444;}i:36;a:3:{i:0;s:12:"section_edit";i:1;a:4:{i:0;i:1;i:1;i:443;i:2;i:1;i:3;s:40:"Ata da Reunião de 21 de Outubro de 2008";}i:2;i:444;}i:37;a:3:{i:0;s:6:"header";i:1;a:3:{i:0;s:9:"1. Lanche";i:1;i:2;i:2;i:444;}i:2;i:444;}i:38;a:3:{i:0;s:12:"section_open";i:1;a:1:{i:0;i:2;}i:2;i:444;}i:39;a:3:{i:0;s:6:"p_open";i:1;a:0:{}i:2;i:465;}i:40;a:3:{i:0;s:5:"cdata";i:1;a:1:{i:0;s:205:"
Felipe, que apesar de ter errado na voltagem da cafeteria que trocou pelo lanche, trouxe o mesmo, abrindo mão da cafeteira. O próximo a trazer é o Antônio, que deve trazer o que sobrou do Interpetão.";}i:2;i:466;}i:41;a:3:{i:0;s:7:"p_close";i:1;a:0:{}i:2;i:671;}i:42;a:3:{i:0;s:13:"section_close";i:1;a:0:{}i:2;i:673;}i:43;a:3:{i:0;s:12:"section_edit";i:1;a:4:{i:0;i:444;i:1;i:672;i:2;i:2;i:3;s:9:"1. Lanche";}i:2;i:673;}i:44;a:3:{i:0;s:6:"header";i:1;a:3:{i:0;s:10:"2. RoboPET";i:1;i:2;i:2;i:673;}i:2;i:673;}i:45;a:3:{i:0;s:12:"section_open";i:1;a:1:{i:0;i:2;}i:2;i:673;}i:46;a:3:{i:0;s:6:"p_open";i:1;a:0:{}i:2;i:695;}i:47;a:3:{i:0;s:5:"cdata";i:1;a:1:{i:0;s:90:"
Ficou decidido que o Portal e o Matheus farão os slides, tendo o Antônio como auxiliar.";}i:2;i:696;}i:48;a:3:{i:0;s:7:"p_close";i:1;a:0:{}i:2;i:786;}i:49;a:3:{i:0;s:13:"section_close";i:1;a:0:{}i:2;i:788;}i:50;a:3:{i:0;s:12:"section_edit";i:1;a:4:{i:0;i:673;i:1;i:787;i:2;i:2;i:3;s:10:"2. RoboPET";}i:2;i:788;}i:51;a:3:{i:0;s:6:"header";i:1;a:3:{i:0;s:25:"3. Reunião Mobilização";i:1;i:2;i:2;i:788;}i:2;i:788;}i:52;a:3:{i:0;s:12:"section_open";i:1;a:1:{i:0;i:2;}i:2;i:788;}i:53;a:3:{i:0;s:6:"p_open";i:1;a:0:{}i:2;i:825;}i:54;a:3:{i:0;s:5:"cdata";i:1;a:1:{i:0;s:264:"
Marcos Cavinato foi à reunião. Foi feito um poster e um blog sobre a mobilização. Os posters foram distribuídos no curso de Ruby. Houve discussão sobre se o grupo deve ou não participar da mobilização, onde se decidiu que o grupo participará realizando ";}i:2;i:826;}i:55;a:3:{i:0;s:18:"doublequoteopening";i:1;a:0:{}i:2;i:1090;}i:56;a:3:{i:0;s:5:"cdata";i:1;a:1:{i:0;s:16:"trabalho de sala";}i:2;i:1091;}i:57;a:3:{i:0;s:18:"doublequoteclosing";i:1;a:0:{}i:2;i:1107;}i:58;a:3:{i:0;s:5:"cdata";i:1;a:1:{i:0;s:74:" (e-mails, cartas, organização, logística, etc.), sem participarmos de ";}i:2;i:1108;}i:59;a:3:{i:0;s:18:"doublequoteopening";i:1;a:0:{}i:2;i:1182;}i:60;a:3:{i:0;s:5:"cdata";i:1;a:1:{i:0;s:26:"manifestações agressivas";}i:2;i:1183;}i:61;a:3:{i:0;s:18:"doublequoteclosing";i:1;a:0:{}i:2;i:1209;}i:62;a:3:{i:0;s:5:"cdata";i:1;a:1:{i:0;s:2:" (";}i:2;i:1210;}i:63;a:3:{i:0;s:18:"doublequoteopening";i:1;a:0:{}i:2;i:1212;}i:64;a:3:{i:0;s:5:"cdata";i:1;a:1:{i:0;s:12:"bater panela";}i:2;i:1213;}i:65;a:3:{i:0;s:18:"doublequoteclosing";i:1;a:0:{}i:2;i:1225;}i:66;a:3:{i:0;s:5:"cdata";i:1;a:1:{i:0;s:232:", etc.). A ordem dos responsáveis pela presença na reunião sobre a mobilização segue os pontos de falta (primeiro em ordem de número de pontos de falta, após em ordem alfabética), e após seguindo a ordem alfabética normal.";}i:2;i:1226;}i:67;a:3:{i:0;s:7:"p_close";i:1;a:0:{}i:2;i:1458;}i:68;a:3:{i:0;s:13:"section_close";i:1;a:0:{}i:2;i:1460;}i:69;a:3:{i:0;s:12:"section_edit";i:1;a:4:{i:0;i:788;i:1;i:1459;i:2;i:2;i:3;s:25:"3. Reunião Mobilização";}i:2;i:1460;}i:70;a:3:{i:0;s:6:"header";i:1;a:3:{i:0;s:12:"4. Camisetas";i:1;i:2;i:2;i:1460;}i:2;i:1460;}i:71;a:3:{i:0;s:12:"section_open";i:1;a:1:{i:0;i:2;}i:2;i:1460;}i:72;a:3:{i:0;s:6:"p_open";i:1;a:0:{}i:2;i:1484;}i:73;a:3:{i:0;s:5:"cdata";i:1;a:1:{i:0;s:83:"
Não foram providenciadas devido à falta de camisetas femininas cor azul marinho.";}i:2;i:1485;}i:74;a:3:{i:0;s:7:"p_close";i:1;a:0:{}i:2;i:1568;}i:75;a:3:{i:0;s:13:"section_close";i:1;a:0:{}i:2;i:1570;}i:76;a:3:{i:0;s:12:"section_edit";i:1;a:4:{i:0;i:1460;i:1;i:1569;i:2;i:2;i:3;s:12:"4. Camisetas";}i:2;i:1570;}i:77;a:3:{i:0;s:6:"header";i:1;a:3:{i:0;s:49:"5. Reunião com a Psico, Curso de HTML para Psico";i:1;i:2;i:2;i:1570;}i:2;i:1570;}i:78;a:3:{i:0;s:12:"section_open";i:1;a:1:{i:0;i:2;}i:2;i:1570;}i:79;a:3:{i:0;s:6:"p_open";i:1;a:0:{}i:2;i:1631;}i:80;a:3:{i:0;s:5:"cdata";i:1;a:1:{i:0;s:12:"
O curso de ";}i:2;i:1632;}i:81;a:3:{i:0;s:7:"acronym";i:1;a:1:{i:0;s:4:"HTML";}i:2;i:1644;}i:82;a:3:{i:0;s:5:"cdata";i:1;a:1:{i:0;s:23:" será dado em janeiro.";}i:2;i:1648;}i:83;a:3:{i:0;s:7:"p_close";i:1;a:0:{}i:2;i:1671;}i:84;a:3:{i:0;s:13:"section_close";i:1;a:0:{}i:2;i:1673;}i:85;a:3:{i:0;s:12:"section_edit";i:1;a:4:{i:0;i:1570;i:1;i:1672;i:2;i:2;i:3;s:49:"5. Reunião com a Psico, Curso de HTML para Psico";}i:2;i:1673;}i:86;a:3:{i:0;s:6:"header";i:1;a:3:{i:0;s:22:"6. Relógio do Logador";i:1;i:2;i:2;i:1673;}i:2;i:1673;}i:87;a:3:{i:0;s:12:"section_open";i:1;a:1:{i:0;i:2;}i:2;i:1673;}i:88;a:3:{i:0;s:6:"p_open";i:1;a:0:{}i:2;i:1707;}i:89;a:3:{i:0;s:5:"cdata";i:1;a:1:{i:0;s:117:"
Foi verificado que o logador está passando por problemas de temperamento devido ao seu relógio. Será solucionado.";}i:2;i:1708;}i:90;a:3:{i:0;s:7:"p_close";i:1;a:0:{}i:2;i:1825;}i:91;a:3:{i:0;s:13:"section_close";i:1;a:0:{}i:2;i:1827;}i:92;a:3:{i:0;s:12:"section_edit";i:1;a:4:{i:0;i:1673;i:1;i:1826;i:2;i:2;i:3;s:22:"6. Relógio do Logador";}i:2;i:1827;}i:93;a:3:{i:0;s:6:"header";i:1;a:3:{i:0;s:8:"7. SEMAC";i:1;i:2;i:2;i:1827;}i:2;i:1827;}i:94;a:3:{i:0;s:12:"section_open";i:1;a:1:{i:0;i:2;}i:2;i:1827;}i:95;a:3:{i:0;s:6:"p_open";i:1;a:0:{}i:2;i:1847;}i:96;a:3:{i:0;s:5:"cdata";i:1;a:1:{i:0;s:156:"
Foi verificado que o andamento da SEMAC está tranquilo, sem necessidade de preocupações. Cada grupo de atividades explanou sobre o andamento das mesmas.";}i:2;i:1848;}i:97;a:3:{i:0;s:7:"p_close";i:1;a:0:{}i:2;i:2004;}i:98;a:3:{i:0;s:13:"section_close";i:1;a:0:{}i:2;i:2006;}i:99;a:3:{i:0;s:12:"section_edit";i:1;a:4:{i:0;i:1827;i:1;i:2005;i:2;i:2;i:3;s:8:"7. SEMAC";}i:2;i:2006;}i:100;a:3:{i:0;s:6:"header";i:1;a:3:{i:0;s:22:"8.Oficina de Robótica";i:1;i:2;i:2;i:2006;}i:2;i:2006;}i:101;a:3:{i:0;s:12:"section_open";i:1;a:1:{i:0;i:2;}i:2;i:2006;}i:102;a:3:{i:0;s:6:"p_open";i:1;a:0:{}i:2;i:2040;}i:103;a:3:{i:0;s:5:"cdata";i:1;a:1:{i:0;s:180:"
Será verificado com a Administração dos Laboratórios a possibilidade de a Oficina ser realizada no Laboratório 105 do Prédio Novo, devido à falta de ar-condicionado no LRI.";}i:2;i:2041;}i:104;a:3:{i:0;s:7:"p_close";i:1;a:0:{}i:2;i:2221;}i:105;a:3:{i:0;s:13:"section_close";i:1;a:0:{}i:2;i:2223;}i:106;a:3:{i:0;s:12:"section_edit";i:1;a:4:{i:0;i:2006;i:1;i:2222;i:2;i:2;i:3;s:22:"8.Oficina de Robótica";}i:2;i:2223;}i:107;a:3:{i:0;s:6:"header";i:1;a:3:{i:0;s:8:"9. LaTeX";i:1;i:2;i:2;i:2223;}i:2;i:2223;}i:108;a:3:{i:0;s:12:"section_open";i:1;a:1:{i:0;i:2;}i:2;i:2223;}i:109;a:3:{i:0;s:6:"p_open";i:1;a:0:{}i:2;i:2243;}i:110;a:3:{i:0;s:5:"cdata";i:1;a:1:{i:0;s:96:"
Será dado um curso interno de LaTeX, provavelmente nas férias, pelo Matheus Proença e Kauê.";}i:2;i:2244;}i:111;a:3:{i:0;s:7:"p_close";i:1;a:0:{}i:2;i:2340;}i:112;a:3:{i:0;s:13:"section_close";i:1;a:0:{}i:2;i:2342;}i:113;a:3:{i:0;s:12:"section_edit";i:1;a:4:{i:0;i:2223;i:1;i:2341;i:2;i:2;i:3;s:8:"9. LaTeX";}i:2;i:2342;}i:114;a:3:{i:0;s:6:"header";i:1;a:3:{i:0;s:9:"10. Museu";i:1;i:2;i:2;i:2342;}i:2;i:2342;}i:115;a:3:{i:0;s:12:"section_open";i:1;a:1:{i:0;i:2;}i:2;i:2342;}i:116;a:3:{i:0;s:6:"p_open";i:1;a:0:{}i:2;i:2363;}i:117;a:3:{i:0;s:5:"cdata";i:1;a:1:{i:0;s:69:"
Havia um banco de dados, organizado, com as entradas do Museu. Havia";}i:2;i:2364;}i:118;a:3:{i:0;s:6:"entity";i:1;a:1:{i:0;s:3:"...";}i:2;i:2433;}i:119;a:3:{i:0;s:5:"cdata";i:1;a:1:{i:0;s:112:" (o mesmo foi perdido em alguma formatação). Será refeito. Todos acharam o Museu Distribuído uma boa idéia.";}i:2;i:2436;}i:120;a:3:{i:0;s:7:"p_close";i:1;a:0:{}i:2;i:2548;}i:121;a:3:{i:0;s:13:"section_close";i:1;a:0:{}i:2;i:2550;}i:122;a:3:{i:0;s:12:"section_edit";i:1;a:4:{i:0;i:2342;i:1;i:2549;i:2;i:2;i:3;s:9:"10. Museu";}i:2;i:2550;}i:123;a:3:{i:0;s:6:"header";i:1;a:3:{i:0;s:16:"11. Planejamento";i:1;i:2;i:2;i:2550;}i:2;i:2550;}i:124;a:3:{i:0;s:12:"section_open";i:1;a:1:{i:0;i:2;}i:2;i:2550;}i:125;a:3:{i:0;s:6:"p_open";i:1;a:0:{}i:2;i:2578;}i:126;a:3:{i:0;s:5:"cdata";i:1;a:1:{i:0;s:25:"
O Kauê vai levar sexta.";}i:2;i:2579;}i:127;a:3:{i:0;s:7:"p_close";i:1;a:0:{}i:2;i:2604;}i:128;a:3:{i:0;s:13:"section_close";i:1;a:0:{}i:2;i:2606;}i:129;a:3:{i:0;s:12:"section_edit";i:1;a:4:{i:0;i:2550;i:1;i:2605;i:2;i:2;i:3;s:16:"11. Planejamento";}i:2;i:2606;}i:130;a:3:{i:0;s:6:"header";i:1;a:3:{i:0;s:16:"12. Campus Party";i:1;i:2;i:2;i:2606;}i:2;i:2606;}i:131;a:3:{i:0;s:12:"section_open";i:1;a:1:{i:0;i:2;}i:2;i:2606;}i:132;a:3:{i:0;s:6:"p_open";i:1;a:0:{}i:2;i:2634;}i:133;a:3:{i:0;s:5:"cdata";i:1;a:1:{i:0;s:45:"
Alguns membros têm dúvida se vão ou não.";}i:2;i:2635;}i:134;a:3:{i:0;s:7:"p_close";i:1;a:0:{}i:2;i:2680;}i:135;a:3:{i:0;s:13:"section_close";i:1;a:0:{}i:2;i:2681;}i:136;a:3:{i:0;s:12:"section_edit";i:1;a:4:{i:0;i:2606;i:1;i:0;i:2;i:2;i:3;s:16:"12. Campus Party";}i:2;i:2681;}i:137;a:3:{i:0;s:12:"document_end";i:1;a:0:{}i:2;i:2681;}}