a:147:{i:0;a:3:{i:0;s:14:"document_start";i:1;a:0:{}i:2;i:0;}i:1;a:3:{i:0;s:6:"p_open";i:1;a:0:{}i:2;i:0;}i:2;a:3:{i:0;s:7:"p_close";i:1;a:0:{}i:2;i:1;}i:3;a:3:{i:0;s:12:"section_edit";i:1;a:4:{i:0;i:-1;i:1;i:0;i:2;i:1;i:3;s:0:"";}i:2;i:1;}i:4;a:3:{i:0;s:6:"header";i:1;a:3:{i:0;s:29:"Ata da Reunião de 20/03/2009";i:1;i:1;i:2;i:1;}i:2;i:1;}i:5;a:3:{i:0;s:12:"section_open";i:1;a:1:{i:0;i:1;}i:2;i:1;}i:6;a:3:{i:0;s:10:"listu_open";i:1;a:0:{}i:2;i:45;}i:7;a:3:{i:0;s:13:"listitem_open";i:1;a:1:{i:0;i:1;}i:2;i:45;}i:8;a:3:{i:0;s:16:"listcontent_open";i:1;a:0:{}i:2;i:45;}i:9;a:3:{i:0;s:5:"cdata";i:1;a:1:{i:0;s:131:" Presentes: Bruno Guedes, Bruno Jurkovski, Fábio, Felipe, Portal, Kauê, Leonardo, Fialho, Marcos, Matheus Vogel, Matheus Proença";}i:2;i:49;}i:10;a:3:{i:0;s:17:"listcontent_close";i:1;a:0:{}i:2;i:180;}i:11;a:3:{i:0;s:14:"listitem_close";i:1;a:0:{}i:2;i:180;}i:12;a:3:{i:0;s:13:"listitem_open";i:1;a:1:{i:0;i:1;}i:2;i:180;}i:13;a:3:{i:0;s:16:"listcontent_open";i:1;a:0:{}i:2;i:180;}i:14;a:3:{i:0;s:5:"cdata";i:1;a:1:{i:0;s:33:" Ausentes: Bruno Albrecht e Dante";}i:2;i:184;}i:15;a:3:{i:0;s:17:"listcontent_close";i:1;a:0:{}i:2;i:217;}i:16;a:3:{i:0;s:14:"listitem_close";i:1;a:0:{}i:2;i:217;}i:17;a:3:{i:0;s:13:"listitem_open";i:1;a:1:{i:0;i:1;}i:2;i:217;}i:18;a:3:{i:0;s:16:"listcontent_open";i:1;a:0:{}i:2;i:217;}i:19;a:3:{i:0;s:5:"cdata";i:1;a:1:{i:0;s:26:" Relator: Matheus Proença";}i:2;i:221;}i:20;a:3:{i:0;s:17:"listcontent_close";i:1;a:0:{}i:2;i:247;}i:21;a:3:{i:0;s:14:"listitem_close";i:1;a:0:{}i:2;i:247;}i:22;a:3:{i:0;s:11:"listu_close";i:1;a:0:{}i:2;i:247;}i:23;a:3:{i:0;s:13:"section_close";i:1;a:0:{}i:2;i:249;}i:24;a:3:{i:0;s:12:"section_edit";i:1;a:4:{i:0;i:1;i:1;i:248;i:2;i:1;i:3;s:29:"Ata da Reunião de 20/03/2009";}i:2;i:249;}i:25;a:3:{i:0;s:6:"header";i:1;a:3:{i:0;s:31:"1. Ponto do Leonardo (Leonardo)";i:1;i:2;i:2;i:249;}i:2;i:249;}i:26;a:3:{i:0;s:12:"section_open";i:1;a:1:{i:0;i:2;}i:2;i:249;}i:27;a:3:{i:0;s:6:"p_open";i:1;a:0:{}i:2;i:292;}i:28;a:3:{i:0;s:5:"cdata";i:1;a:1:{i:0;s:438:"
Leonardo teve problemas na entrada da bolsa com a Microsoft, informando que só entrará em abril. Então, ele gostaria de utilizar suas 2 semanas de férias pendentes nas próximas semanas, de forma a terminar o mês de Março no PET, efetuando seu desligamento no fim do mesmo. O líder lembrou o petiano que o mesmo tem pontos de falta em haver, ficando alocada a tarefa de confecção da Carta de Apoio do II após o fim da reunião.";}i:2;i:293;}i:29;a:3:{i:0;s:7:"p_close";i:1;a:0:{}i:2;i:731;}i:30;a:3:{i:0;s:13:"section_close";i:1;a:0:{}i:2;i:733;}i:31;a:3:{i:0;s:12:"section_edit";i:1;a:4:{i:0;i:249;i:1;i:732;i:2;i:2;i:3;s:31:"1. Ponto do Leonardo (Leonardo)";}i:2;i:733;}i:32;a:3:{i:0;s:6:"header";i:1;a:3:{i:0;s:56:"2. Sobre ida de PETIANOS!!! à ROBOCUP (Marcos e Felipe)";i:1;i:2;i:2;i:733;}i:2;i:733;}i:33;a:3:{i:0;s:12:"section_open";i:1;a:1:{i:0;i:2;}i:2;i:733;}i:34;a:3:{i:0;s:6:"p_open";i:1;a:0:{}i:2;i:801;}i:35;a:3:{i:0;s:5:"cdata";i:1;a:1:{i:0;s:76:"
Os petianos relatores do ponto levataram a questão se, da época de ida a ";}i:2;i:802;}i:36;a:3:{i:0;s:12:"internallink";i:1;a:2:{i:0;s:18:"/trac/wiki/RoboCup";i:1;s:8:"RoboCup?";}i:2;i:878;}i:37;a:3:{i:0;s:5:"cdata";i:1;a:1:{i:0;s:523:", iriam somente os que fossem petianos em tal época, ou se seria autorizada a ida de não petianos. O grupo decide que o mais correto é manter o mesmo critério para os dois conjuntos, que seria que irão os mais aptos a ajudar no projeto, os que mais o conhecem. Os relatores lembraram também a questão legal da ida de não petianos, visto que o dinheiro é público. O grupo lembrou que, talvez, este dinheiro venha de patrocínio, e decidiu verificar melhor a questão quando tivermos de posse da quantia monetária.";}i:2;i:909;}i:38;a:3:{i:0;s:7:"p_close";i:1;a:0:{}i:2;i:1432;}i:39;a:3:{i:0;s:13:"section_close";i:1;a:0:{}i:2;i:1434;}i:40;a:3:{i:0;s:12:"section_edit";i:1;a:4:{i:0;i:733;i:1;i:1433;i:2;i:2;i:3;s:56:"2. Sobre ida de PETIANOS!!! à ROBOCUP (Marcos e Felipe)";}i:2;i:1434;}i:41;a:3:{i:0;s:6:"header";i:1;a:3:{i:0;s:24:"3. TRAC users (Proença)";i:1;i:2;i:2;i:1434;}i:2;i:1434;}i:42;a:3:{i:0;s:12:"section_open";i:1;a:1:{i:0;i:2;}i:2;i:1434;}i:43;a:3:{i:0;s:6:"p_open";i:1;a:0:{}i:2;i:1470;}i:44;a:3:{i:0;s:5:"cdata";i:1;a:1:{i:0;s:517:"
O líder informou para o grupo que foram criados usuários no TRAC para todos (mesmo username e senha que era utilizado para logar no pet-server). O líder levantou a possibilidade de trocarmos o TRAC por uma ferramenta mais adequada, visto que a parte do trac que utilizamos, a wiki, é pobre em recursos como proteção por senha somente das partes necessárias (como a dos dados pessoais e bancários, visto que o trac é acessível por qualquer computador do II). O grupo preferiu bloquear todo o TRAC com senha.";}i:2;i:1471;}i:45;a:3:{i:0;s:7:"p_close";i:1;a:0:{}i:2;i:1988;}i:46;a:3:{i:0;s:13:"section_close";i:1;a:0:{}i:2;i:1990;}i:47;a:3:{i:0;s:12:"section_edit";i:1;a:4:{i:0;i:1434;i:1;i:1989;i:2;i:2;i:3;s:24:"3. TRAC users (Proença)";}i:2;i:1990;}i:48;a:3:{i:0;s:6:"header";i:1;a:3:{i:0;s:19:"4. Camisas (Felipe)";i:1;i:2;i:2;i:1990;}i:2;i:1990;}i:49;a:3:{i:0;s:12:"section_open";i:1;a:1:{i:0;i:2;}i:2;i:1990;}i:50;a:3:{i:0;s:6:"p_open";i:1;a:0:{}i:2;i:2021;}i:51;a:3:{i:0;s:5:"cdata";i:1;a:1:{i:0;s:46:"
Já havia sido decidido na reunião anterior.";}i:2;i:2022;}i:52;a:3:{i:0;s:7:"p_close";i:1;a:0:{}i:2;i:2068;}i:53;a:3:{i:0;s:13:"section_close";i:1;a:0:{}i:2;i:2070;}i:54;a:3:{i:0;s:12:"section_edit";i:1;a:4:{i:0;i:1990;i:1;i:2069;i:2;i:2;i:3;s:19:"4. Camisas (Felipe)";}i:2;i:2070;}i:55;a:3:{i:0;s:6:"header";i:1;a:3:{i:0;s:31:"5. Reuniões e RoboPET (Felipe)";i:1;i:2;i:2;i:2070;}i:2;i:2070;}i:56;a:3:{i:0;s:12:"section_open";i:1;a:1:{i:0;i:2;}i:2;i:2070;}i:57;a:3:{i:0;s:6:"p_open";i:1;a:0:{}i:2;i:2113;}i:58;a:3:{i:0;s:5:"cdata";i:1;a:1:{i:0;s:180:"
Novamente, foi ratificado que as reuniões ocorrem Quintas e Sextas, revezando-se toda semana, sendo a próxima semana na Quinta. Após todas as reuniões há reunião do RoboPET.";}i:2;i:2114;}i:59;a:3:{i:0;s:7:"p_close";i:1;a:0:{}i:2;i:2294;}i:60;a:3:{i:0;s:13:"section_close";i:1;a:0:{}i:2;i:2296;}i:61;a:3:{i:0;s:12:"section_edit";i:1;a:4:{i:0;i:2070;i:1;i:2295;i:2;i:2;i:3;s:31:"5. Reuniões e RoboPET (Felipe)";}i:2;i:2296;}i:62;a:3:{i:0;s:6:"header";i:1;a:3:{i:0;s:52:"6. Pontos Esquecidos reunião passada - cup (Felipe)";i:1;i:2;i:2;i:2296;}i:2;i:2296;}i:63;a:3:{i:0;s:12:"section_open";i:1;a:1:{i:0;i:2;}i:2;i:2296;}i:64;a:3:{i:0;s:6:"p_open";i:1;a:0:{}i:2;i:2360;}i:65;a:3:{i:0;s:5:"cdata";i:1;a:1:{i:0;s:280:"
O relator do ponto informa que ficou irritado com a brincadeira de esconder sua caneca, e avisou que se o grupo não ficou contente com o tamanho da mesma, deveria informá-lo para que tomasse as providências. Informou que já comprou uma térmica para poder beber café em paz.";}i:2;i:2361;}i:66;a:3:{i:0;s:7:"p_close";i:1;a:0:{}i:2;i:2641;}i:67;a:3:{i:0;s:13:"section_close";i:1;a:0:{}i:2;i:2643;}i:68;a:3:{i:0;s:12:"section_edit";i:1;a:4:{i:0;i:2296;i:1;i:2642;i:2;i:2;i:3;s:52:"6. Pontos Esquecidos reunião passada - cup (Felipe)";}i:2;i:2643;}i:69;a:3:{i:0;s:6:"header";i:1;a:3:{i:0;s:18:"7. Chassi (Felipe)";i:1;i:2;i:2;i:2643;}i:2;i:2643;}i:70;a:3:{i:0;s:12:"section_open";i:1;a:1:{i:0;i:2;}i:2;i:2643;}i:71;a:3:{i:0;s:6:"p_open";i:1;a:0:{}i:2;i:2673;}i:72;a:3:{i:0;s:5:"cdata";i:1;a:1:{i:0;s:35:"
Ponto passado à parte do RoboPET.";}i:2;i:2674;}i:73;a:3:{i:0;s:7:"p_close";i:1;a:0:{}i:2;i:2709;}i:74;a:3:{i:0;s:13:"section_close";i:1;a:0:{}i:2;i:2711;}i:75;a:3:{i:0;s:12:"section_edit";i:1;a:4:{i:0;i:2643;i:1;i:2710;i:2;i:2;i:3;s:18:"7. Chassi (Felipe)";}i:2;i:2711;}i:76;a:3:{i:0;s:6:"header";i:1;a:3:{i:0;s:36:"8. Sobre computador RoboPET (Felipe)";i:1;i:2;i:2;i:2711;}i:2;i:2711;}i:77;a:3:{i:0;s:12:"section_open";i:1;a:1:{i:0;i:2;}i:2;i:2711;}i:78;a:3:{i:0;s:6:"p_open";i:1;a:0:{}i:2;i:2759;}i:79;a:3:{i:0;s:5:"cdata";i:1;a:1:{i:0;s:170:"
O relator do ponto indagou se utilizaremos um dos nossos computadores ou se seria necessário a aquisição de outra unidade. O grupo decidiu que utilizaremos a Manuela.";}i:2;i:2760;}i:80;a:3:{i:0;s:7:"p_close";i:1;a:0:{}i:2;i:2930;}i:81;a:3:{i:0;s:13:"section_close";i:1;a:0:{}i:2;i:2932;}i:82;a:3:{i:0;s:12:"section_edit";i:1;a:4:{i:0;i:2711;i:1;i:2931;i:2;i:2;i:3;s:36:"8. Sobre computador RoboPET (Felipe)";}i:2;i:2932;}i:83;a:3:{i:0;s:6:"header";i:1;a:3:{i:0;s:26:"9. Volta do Itamir (bruno)";i:1;i:2;i:2;i:2932;}i:2;i:2932;}i:84;a:3:{i:0;s:12:"section_open";i:1;a:1:{i:0;i:2;}i:2;i:2932;}i:85;a:3:{i:0;s:6:"p_open";i:1;a:0:{}i:2;i:2970;}i:86;a:3:{i:0;s:5:"cdata";i:1;a:1:{i:0;s:55:"
O relator estava ausente e ninguém soube o que dizer.";}i:2;i:2971;}i:87;a:3:{i:0;s:7:"p_close";i:1;a:0:{}i:2;i:3026;}i:88;a:3:{i:0;s:13:"section_close";i:1;a:0:{}i:2;i:3028;}i:89;a:3:{i:0;s:12:"section_edit";i:1;a:4:{i:0;i:2932;i:1;i:3027;i:2;i:2;i:3;s:26:"9. Volta do Itamir (bruno)";}i:2;i:3028;}i:90;a:3:{i:0;s:6:"header";i:1;a:3:{i:0;s:33:"10. Reuniao com o Flávio (bruno)";i:1;i:2;i:2;i:3028;}i:2;i:3028;}i:91;a:3:{i:0;s:12:"section_open";i:1;a:1:{i:0;i:2;}i:2;i:3028;}i:92;a:3:{i:0;s:6:"p_open";i:1;a:0:{}i:2;i:3073;}i:93;a:3:{i:0;s:5:"cdata";i:1;a:1:{i:0;s:365:"
O relator estava ausente, mas o líder sabia o que dizer. O grupo foi informado dos acontecimentos na reunião com a diretoria, que ficou animada com o RoboPET, oferecendo seu total apoio, exceto na parte financeira. Foi citado, inclusive, a sugestão do vice-diretor do Instituto de Informática de redigirmos um projeto ao CNPQ, para investimentos a longo prazo.";}i:2;i:3074;}i:94;a:3:{i:0;s:7:"p_close";i:1;a:0:{}i:2;i:3439;}i:95;a:3:{i:0;s:13:"section_close";i:1;a:0:{}i:2;i:3441;}i:96;a:3:{i:0;s:12:"section_edit";i:1;a:4:{i:0;i:3028;i:1;i:3440;i:2;i:2;i:3;s:33:"10. Reuniao com o Flávio (bruno)";}i:2;i:3441;}i:97;a:3:{i:0;s:6:"header";i:1;a:3:{i:0;s:39:"11. Interpet (bruno, proença, matheus)";i:1;i:2;i:2;i:3441;}i:2;i:3441;}i:98;a:3:{i:0;s:12:"section_open";i:1;a:1:{i:0;i:2;}i:2;i:3441;}i:99;a:3:{i:0;s:6:"p_open";i:1;a:0:{}i:2;i:3492;}i:100;a:3:{i:0;s:5:"cdata";i:1;a:1:{i:0;s:369:"
Foram ao Interpet o Matheus Vogel, o Bruno Albrecht e o Matheus Proença. Matheus Vogel perdeu um ponto de falta. Também, perdeu um ponto de falta o Felipe por ter feito o trabalho sobre a internet; e o Portal e o Fialho por terem ido a reunião do CLA. O grupo lembrou que Matheus Proença deve fazer 48h no mês corrente, sendo necessário retificar a Ata anterior.";}i:2;i:3493;}i:101;a:3:{i:0;s:7:"p_close";i:1;a:0:{}i:2;i:3862;}i:102;a:3:{i:0;s:13:"section_close";i:1;a:0:{}i:2;i:3864;}i:103;a:3:{i:0;s:12:"section_edit";i:1;a:4:{i:0;i:3441;i:1;i:3863;i:2;i:2;i:3;s:39:"11. Interpet (bruno, proença, matheus)";}i:2;i:3864;}i:104;a:3:{i:0;s:6:"header";i:1;a:3:{i:0;s:11:"11.1 Sulpet";i:1;i:3;i:2;i:3864;}i:2;i:3864;}i:105;a:3:{i:0;s:12:"section_open";i:1;a:1:{i:0;i:3;}i:2;i:3864;}i:106;a:3:{i:0;s:6:"p_open";i:1;a:0:{}i:2;i:3885;}i:107;a:3:{i:0;s:5:"cdata";i:1;a:1:{i:0;s:144:"
O grupo tem aproximadamente 6 interessados. Iremos apresentar um trabalho sobre a Metolodogia de Projeto adotada na implementação do RoboPET.";}i:2;i:3886;}i:108;a:3:{i:0;s:7:"p_close";i:1;a:0:{}i:2;i:4030;}i:109;a:3:{i:0;s:13:"section_close";i:1;a:0:{}i:2;i:4032;}i:110;a:3:{i:0;s:12:"section_edit";i:1;a:4:{i:0;i:3864;i:1;i:4031;i:2;i:3;i:3;s:11:"11.1 Sulpet";}i:2;i:4032;}i:111;a:3:{i:0;s:6:"header";i:1;a:3:{i:0;s:43:"11.2 Salão de graduação e outros salões";i:1;i:3;i:2;i:4032;}i:2;i:4032;}i:112;a:3:{i:0;s:12:"section_open";i:1;a:1:{i:0;i:3;}i:2;i:4032;}i:113;a:3:{i:0;s:6:"p_open";i:1;a:0:{}i:2;i:4085;}i:114;a:3:{i:0;s:5:"cdata";i:1;a:1:{i:0;s:542:"
Acreditamos que será válido apresentar trabalhos nos três salões do Tripé. No de graduação desejamos apresentar o mesmo trabalho a ser apresentado no Sulpet. No SIC pretendemos descrever detalhadamente as decisões adotadas na Visão. No de extensão desejamos apresentar nossa experiência no RoboEDU. Ficam responsáveis pela elaboração do trabalho para o Salão de Graduação e Sulpet, Matheus Proença, Marcos Cavinato e Lucas Fialho. Para a apresentação sobre a visão, ficam Marcos Cavinato, Lucas Fialho e Fábio Beltrão.";}i:2;i:4086;}i:115;a:3:{i:0;s:7:"p_close";i:1;a:0:{}i:2;i:4628;}i:116;a:3:{i:0;s:13:"section_close";i:1;a:0:{}i:2;i:4630;}i:117;a:3:{i:0;s:12:"section_edit";i:1;a:4:{i:0;i:4032;i:1;i:4629;i:2;i:3;i:3;s:43:"11.2 Salão de graduação e outros salões";}i:2;i:4630;}i:118;a:3:{i:0;s:6:"header";i:1;a:3:{i:0;s:31:"12. Planejamento Abril (Guedes)";i:1;i:2;i:2;i:4630;}i:2;i:4630;}i:119;a:3:{i:0;s:12:"section_open";i:1;a:1:{i:0;i:2;}i:2;i:4630;}i:120;a:3:{i:0;s:6:"p_open";i:1;a:0:{}i:2;i:4673;}i:121;a:3:{i:0;s:5:"cdata";i:1;a:1:{i:0;s:130:"
O relator do ponto lembrou que é necessário fazer o planejamento de Abril! Todos devem fazê-lo até segunda-feira ao meio-dia!";}i:2;i:4674;}i:122;a:3:{i:0;s:7:"p_close";i:1;a:0:{}i:2;i:4804;}i:123;a:3:{i:0;s:13:"section_close";i:1;a:0:{}i:2;i:4806;}i:124;a:3:{i:0;s:12:"section_edit";i:1;a:4:{i:0;i:4630;i:1;i:4805;i:2;i:2;i:3;s:31:"12. Planejamento Abril (Guedes)";}i:2;i:4806;}i:125;a:3:{i:0;s:6:"header";i:1;a:3:{i:0;s:24:"13. Seleção (Proença)";i:1;i:2;i:2;i:4806;}i:2;i:4806;}i:126;a:3:{i:0;s:12:"section_open";i:1;a:1:{i:0;i:2;}i:2;i:4806;}i:127;a:3:{i:0;s:6:"p_open";i:1;a:0:{}i:2;i:4842;}i:128;a:3:{i:0;s:5:"cdata";i:1;a:1:{i:0;s:157:"
A seleção começará às 13h30 com a dinâmica de grupo. Às 14h começam as entrevistas, com a presença do Prof. Dante, do Prof. Netto e do Prof. Weber.";}i:2;i:4843;}i:129;a:3:{i:0;s:7:"p_close";i:1;a:0:{}i:2;i:5000;}i:130;a:3:{i:0;s:13:"section_close";i:1;a:0:{}i:2;i:5002;}i:131;a:3:{i:0;s:12:"section_edit";i:1;a:4:{i:0;i:4806;i:1;i:5001;i:2;i:2;i:3;s:24:"13. Seleção (Proença)";}i:2;i:5002;}i:132;a:3:{i:0;s:6:"header";i:1;a:3:{i:0;s:55:"14. Oficina Interna de LaTeX (ponto adicionado na hora)";i:1;i:2;i:2;i:5002;}i:2;i:5002;}i:133;a:3:{i:0;s:12:"section_open";i:1;a:1:{i:0;i:2;}i:2;i:5002;}i:134;a:3:{i:0;s:6:"p_open";i:1;a:0:{}i:2;i:5069;}i:135;a:3:{i:0;s:5:"cdata";i:1;a:1:{i:0;s:51:"
Será realizada na sexta-feira, dia 27, às 16h15.";}i:2;i:5070;}i:136;a:3:{i:0;s:7:"p_close";i:1;a:0:{}i:2;i:5121;}i:137;a:3:{i:0;s:13:"section_close";i:1;a:0:{}i:2;i:5123;}i:138;a:3:{i:0;s:12:"section_edit";i:1;a:4:{i:0;i:5002;i:1;i:5122;i:2;i:2;i:3;s:55:"14. Oficina Interna de LaTeX (ponto adicionado na hora)";}i:2;i:5123;}i:139;a:3:{i:0;s:6:"header";i:1;a:3:{i:0;s:7:"RoboPET";i:1;i:1;i:2;i:5123;}i:2;i:5123;}i:140;a:3:{i:0;s:12:"section_open";i:1;a:1:{i:0;i:1;}i:2;i:5123;}i:141;a:3:{i:0;s:6:"p_open";i:1;a:0:{}i:2;i:5144;}i:142;a:3:{i:0;s:5:"cdata";i:1;a:1:{i:0;s:427:"
O petiano Matheus Proença demonstrou trivialmente que não será possível concluir o robô de quatro rodas até o deadline especificado. Após algumas discussões, o grupo concorda que devemos seguir nosso planejamento, não ocorrendo nos mesmos erros anteriores. Portanto, o foco será dado ao robô de 3 rodas, construindo um driblador para o mesmo, procurando motores melhores, e projetando sua eletrônica adequadamente.";}i:2;i:5145;}i:143;a:3:{i:0;s:7:"p_close";i:1;a:0:{}i:2;i:5572;}i:144;a:3:{i:0;s:13:"section_close";i:1;a:0:{}i:2;i:5573;}i:145;a:3:{i:0;s:12:"section_edit";i:1;a:4:{i:0;i:5123;i:1;i:0;i:2;i:1;i:3;s:7:"RoboPET";}i:2;i:5573;}i:146;a:3:{i:0;s:12:"document_end";i:1;a:0:{}i:2;i:5573;}}