a:440:{i:0;a:3:{i:0;s:14:"document_start";i:1;a:0:{}i:2;i:0;}i:1;a:3:{i:0;s:6:"p_open";i:1;a:0:{}i:2;i:0;}i:2;a:3:{i:0;s:11:"strong_open";i:1;a:0:{}i:2;i:1;}i:3;a:3:{i:0;s:5:"cdata";i:1;a:1:{i:0;s:44:"== Ata da Reunião de 22 de abril de 2008 ==";}i:2;i:3;}i:4;a:3:{i:0;s:12:"strong_close";i:1;a:0:{}i:2;i:47;}i:5;a:3:{i:0;s:7:"p_close";i:1;a:0:{}i:2;i:49;}i:6;a:3:{i:0;s:6:"p_open";i:1;a:0:{}i:2;i:49;}i:7;a:3:{i:0;s:5:"cdata";i:1;a:1:{i:0;s:151:"Presentes: Antônio, Arthur, Bruno, Cassiana, Felipe, Gabriel, Leonardo, Marcela, Marcelo, Matheus, Rosália, Dante. Ausentes: Kauê, Lucas (Interpet).";}i:2;i:51;}i:8;a:3:{i:0;s:7:"p_close";i:1;a:0:{}i:2;i:202;}i:9;a:3:{i:0;s:6:"p_open";i:1;a:0:{}i:2;i:202;}i:10;a:3:{i:0;s:5:"cdata";i:1;a:1:{i:0;s:15:"Relator: Felipe";}i:2;i:204;}i:11;a:3:{i:0;s:7:"p_close";i:1;a:0:{}i:2;i:219;}i:12;a:3:{i:0;s:6:"p_open";i:1;a:0:{}i:2;i:219;}i:13;a:3:{i:0;s:11:"strong_open";i:1;a:0:{}i:2;i:221;}i:14;a:3:{i:0;s:5:"cdata";i:1;a:1:{i:0;s:62:"1) Reunião do Projeto Roboedu com a professora Extráuzaluas:";}i:2;i:223;}i:15;a:3:{i:0;s:12:"strong_close";i:1;a:0:{}i:2;i:285;}i:16;a:3:{i:0;s:5:"cdata";i:1;a:1:{i:0;s:1:"
";}i:2;i:287;}i:17;a:3:{i:0;s:7:"p_close";i:1;a:0:{}i:2;i:288;}i:18;a:3:{i:0;s:10:"listu_open";i:1;a:0:{}i:2;i:288;}i:19;a:3:{i:0;s:13:"listitem_open";i:1;a:1:{i:0;i:1;}i:2;i:288;}i:20;a:3:{i:0;s:16:"listcontent_open";i:1;a:0:{}i:2;i:288;}i:21;a:3:{i:0;s:5:"cdata";i:1;a:1:{i:0;s:35:" Lucas não falou com a professora.";}i:2;i:292;}i:22;a:3:{i:0;s:17:"listcontent_close";i:1;a:0:{}i:2;i:327;}i:23;a:3:{i:0;s:14:"listitem_close";i:1;a:0:{}i:2;i:327;}i:24;a:3:{i:0;s:11:"listu_close";i:1;a:0:{}i:2;i:327;}i:25;a:3:{i:0;s:6:"p_open";i:1;a:0:{}i:2;i:327;}i:26;a:3:{i:0;s:5:"cdata";i:1;a:1:{i:0;s:1:"
";}i:2;i:328;}i:27;a:3:{i:0;s:11:"strong_open";i:1;a:0:{}i:2;i:329;}i:28;a:3:{i:0;s:5:"cdata";i:1;a:1:{i:0;s:23:"2) Arrumação da Sala:";}i:2;i:331;}i:29;a:3:{i:0;s:12:"strong_close";i:1;a:0:{}i:2;i:354;}i:30;a:3:{i:0;s:5:"cdata";i:1;a:1:{i:0;s:1:"
";}i:2;i:356;}i:31;a:3:{i:0;s:7:"p_close";i:1;a:0:{}i:2;i:357;}i:32;a:3:{i:0;s:10:"listu_open";i:1;a:0:{}i:2;i:357;}i:33;a:3:{i:0;s:13:"listitem_open";i:1;a:1:{i:0;i:1;}i:2;i:357;}i:34;a:3:{i:0;s:16:"listcontent_open";i:1;a:0:{}i:2;i:357;}i:35;a:3:{i:0;s:5:"cdata";i:1;a:1:{i:0;s:57:" Gabriel arrumou toda a sala, organizando espaço para o ";}i:2;i:361;}i:36;a:3:{i:0;s:18:"doublequoteopening";i:1;a:0:{}i:2;i:418;}i:37;a:3:{i:0;s:5:"cdata";i:1;a:1:{i:0;s:11:"purgatório";}i:2;i:419;}i:38;a:3:{i:0;s:18:"doublequoteclosing";i:1;a:0:{}i:2;i:430;}i:39;a:3:{i:0;s:5:"cdata";i:1;a:1:{i:0;s:72:" e documentos importantes, espaço para mochilas, entre outros detalhes.";}i:2;i:431;}i:40;a:3:{i:0;s:17:"listcontent_close";i:1;a:0:{}i:2;i:503;}i:41;a:3:{i:0;s:14:"listitem_close";i:1;a:0:{}i:2;i:503;}i:42;a:3:{i:0;s:13:"listitem_open";i:1;a:1:{i:0;i:1;}i:2;i:503;}i:43;a:3:{i:0;s:16:"listcontent_open";i:1;a:0:{}i:2;i:503;}i:44;a:3:{i:0;s:5:"cdata";i:1;a:1:{i:0;s:43:" A partir de suas observações definiu-se:";}i:2;i:507;}i:45;a:3:{i:0;s:17:"listcontent_close";i:1;a:0:{}i:2;i:550;}i:46;a:3:{i:0;s:10:"listu_open";i:1;a:0:{}i:2;i:550;}i:47;a:3:{i:0;s:13:"listitem_open";i:1;a:1:{i:0;i:2;}i:2;i:550;}i:48;a:3:{i:0;s:16:"listcontent_open";i:1;a:0:{}i:2;i:550;}i:49;a:3:{i:0;s:5:"cdata";i:1;a:1:{i:0;s:44:" A doação de folhas antigas para o DACOMP;";}i:2;i:556;}i:50;a:3:{i:0;s:17:"listcontent_close";i:1;a:0:{}i:2;i:600;}i:51;a:3:{i:0;s:14:"listitem_close";i:1;a:0:{}i:2;i:600;}i:52;a:3:{i:0;s:13:"listitem_open";i:1;a:1:{i:0;i:2;}i:2;i:600;}i:53;a:3:{i:0;s:16:"listcontent_open";i:1;a:0:{}i:2;i:600;}i:54;a:3:{i:0;s:5:"cdata";i:1;a:1:{i:0;s:50:" Dante olha-rá em maio alguns documentos antigos;";}i:2;i:606;}i:55;a:3:{i:0;s:17:"listcontent_close";i:1;a:0:{}i:2;i:656;}i:56;a:3:{i:0;s:14:"listitem_close";i:1;a:0:{}i:2;i:656;}i:57;a:3:{i:0;s:13:"listitem_open";i:1;a:1:{i:0;i:2;}i:2;i:656;}i:58;a:3:{i:0;s:16:"listcontent_open";i:1;a:0:{}i:2;i:656;}i:59;a:3:{i:0;s:5:"cdata";i:1;a:1:{i:0;s:51:" Velas serão utilizadas no aniversário do Felipe;";}i:2;i:662;}i:60;a:3:{i:0;s:17:"listcontent_close";i:1;a:0:{}i:2;i:713;}i:61;a:3:{i:0;s:14:"listitem_close";i:1;a:0:{}i:2;i:713;}i:62;a:3:{i:0;s:13:"listitem_open";i:1;a:1:{i:0;i:2;}i:2;i:713;}i:63;a:3:{i:0;s:16:"listcontent_open";i:1;a:0:{}i:2;i:713;}i:64;a:3:{i:0;s:5:"cdata";i:1;a:1:{i:0;s:63:" Disquetes serão preservados metade na sala e metade no museu;";}i:2;i:719;}i:65;a:3:{i:0;s:17:"listcontent_close";i:1;a:0:{}i:2;i:782;}i:66;a:3:{i:0;s:14:"listitem_close";i:1;a:0:{}i:2;i:782;}i:67;a:3:{i:0;s:11:"listu_close";i:1;a:0:{}i:2;i:782;}i:68;a:3:{i:0;s:14:"listitem_close";i:1;a:0:{}i:2;i:782;}i:69;a:3:{i:0;s:13:"listitem_open";i:1;a:1:{i:0;i:1;}i:2;i:782;}i:70;a:3:{i:0;s:16:"listcontent_open";i:1;a:0:{}i:2;i:782;}i:71;a:3:{i:0;s:5:"cdata";i:1;a:1:{i:0;s:38:" A iniciativa do Gabriel foi elogiada.";}i:2;i:786;}i:72;a:3:{i:0;s:17:"listcontent_close";i:1;a:0:{}i:2;i:824;}i:73;a:3:{i:0;s:14:"listitem_close";i:1;a:0:{}i:2;i:824;}i:74;a:3:{i:0;s:11:"listu_close";i:1;a:0:{}i:2;i:824;}i:75;a:3:{i:0;s:6:"p_open";i:1;a:0:{}i:2;i:824;}i:76;a:3:{i:0;s:5:"cdata";i:1;a:1:{i:0;s:1:"
";}i:2;i:825;}i:77;a:3:{i:0;s:11:"strong_open";i:1;a:0:{}i:2;i:826;}i:78;a:3:{i:0;s:5:"cdata";i:1;a:1:{i:0;s:10:"3) SULPET:";}i:2;i:828;}i:79;a:3:{i:0;s:12:"strong_close";i:1;a:0:{}i:2;i:838;}i:80;a:3:{i:0;s:5:"cdata";i:1;a:1:{i:0;s:1:"
";}i:2;i:840;}i:81;a:3:{i:0;s:7:"p_close";i:1;a:0:{}i:2;i:841;}i:82;a:3:{i:0;s:10:"listu_open";i:1;a:0:{}i:2;i:841;}i:83;a:3:{i:0;s:13:"listitem_open";i:1;a:1:{i:0;i:1;}i:2;i:841;}i:84;a:3:{i:0;s:16:"listcontent_open";i:1;a:0:{}i:2;i:841;}i:85;a:3:{i:0;s:5:"cdata";i:1;a:1:{i:0;s:22:" Lucas pagou o onibus;";}i:2;i:845;}i:86;a:3:{i:0;s:17:"listcontent_close";i:1;a:0:{}i:2;i:867;}i:87;a:3:{i:0;s:14:"listitem_close";i:1;a:0:{}i:2;i:867;}i:88;a:3:{i:0;s:13:"listitem_open";i:1;a:1:{i:0;i:1;}i:2;i:867;}i:89;a:3:{i:0;s:16:"listcontent_open";i:1;a:0:{}i:2;i:867;}i:90;a:3:{i:0;s:5:"cdata";i:1;a:1:{i:0;s:49:" Os participantes devem se escrever nas oficinas.";}i:2;i:871;}i:91;a:3:{i:0;s:17:"listcontent_close";i:1;a:0:{}i:2;i:920;}i:92;a:3:{i:0;s:14:"listitem_close";i:1;a:0:{}i:2;i:920;}i:93;a:3:{i:0;s:11:"listu_close";i:1;a:0:{}i:2;i:920;}i:94;a:3:{i:0;s:6:"p_open";i:1;a:0:{}i:2;i:920;}i:95;a:3:{i:0;s:5:"cdata";i:1;a:1:{i:0;s:1:"
";}i:2;i:921;}i:96;a:3:{i:0;s:11:"strong_open";i:1;a:0:{}i:2;i:922;}i:97;a:3:{i:0;s:5:"cdata";i:1;a:1:{i:0;s:20:"4) Semana Academica:";}i:2;i:924;}i:98;a:3:{i:0;s:12:"strong_close";i:1;a:0:{}i:2;i:944;}i:99;a:3:{i:0;s:5:"cdata";i:1;a:1:{i:0;s:1:"
";}i:2;i:946;}i:100;a:3:{i:0;s:7:"p_close";i:1;a:0:{}i:2;i:947;}i:101;a:3:{i:0;s:10:"listu_open";i:1;a:0:{}i:2;i:947;}i:102;a:3:{i:0;s:13:"listitem_open";i:1;a:1:{i:0;i:1;}i:2;i:947;}i:103;a:3:{i:0;s:16:"listcontent_open";i:1;a:0:{}i:2;i:947;}i:104;a:3:{i:0;s:5:"cdata";i:1;a:1:{i:0;s:42:" Oficina de Phyton sera dada em uma manha;";}i:2;i:951;}i:105;a:3:{i:0;s:17:"listcontent_close";i:1;a:0:{}i:2;i:993;}i:106;a:3:{i:0;s:14:"listitem_close";i:1;a:0:{}i:2;i:993;}i:107;a:3:{i:0;s:13:"listitem_open";i:1;a:1:{i:0;i:1;}i:2;i:993;}i:108;a:3:{i:0;s:16:"listcontent_open";i:1;a:0:{}i:2;i:993;}i:109;a:3:{i:0;s:5:"cdata";i:1;a:1:{i:0;s:39:" Ocorrerá a Maratona de Programação;";}i:2;i:997;}i:110;a:3:{i:0;s:17:"listcontent_close";i:1;a:0:{}i:2;i:1036;}i:111;a:3:{i:0;s:14:"listitem_close";i:1;a:0:{}i:2;i:1036;}i:112;a:3:{i:0;s:13:"listitem_open";i:1;a:1:{i:0;i:1;}i:2;i:1036;}i:113;a:3:{i:0;s:16:"listcontent_open";i:1;a:0:{}i:2;i:1036;}i:114;a:3:{i:0;s:5:"cdata";i:1;a:1:{i:0;s:80:" Incorporar trabalho de Felipe para o Salão de Graduação na Semana Academica;";}i:2;i:1040;}i:115;a:3:{i:0;s:17:"listcontent_close";i:1;a:0:{}i:2;i:1120;}i:116;a:3:{i:0;s:14:"listitem_close";i:1;a:0:{}i:2;i:1120;}i:117;a:3:{i:0;s:13:"listitem_open";i:1;a:1:{i:0;i:1;}i:2;i:1120;}i:118;a:3:{i:0;s:16:"listcontent_open";i:1;a:0:{}i:2;i:1120;}i:119;a:3:{i:0;s:5:"cdata";i:1;a:1:{i:0;s:64:" Marcelo perguntará se há interesse a Kaisen em dar palestras;";}i:2;i:1124;}i:120;a:3:{i:0;s:17:"listcontent_close";i:1;a:0:{}i:2;i:1188;}i:121;a:3:{i:0;s:14:"listitem_close";i:1;a:0:{}i:2;i:1188;}i:122;a:3:{i:0;s:13:"listitem_open";i:1;a:1:{i:0;i:1;}i:2;i:1188;}i:123;a:3:{i:0;s:16:"listcontent_open";i:1;a:0:{}i:2;i:1188;}i:124;a:3:{i:0;s:5:"cdata";i:1;a:1:{i:0;s:53:" Reapresentar palestras que atrairam grande público;";}i:2;i:1192;}i:125;a:3:{i:0;s:17:"listcontent_close";i:1;a:0:{}i:2;i:1245;}i:126;a:3:{i:0;s:14:"listitem_close";i:1;a:0:{}i:2;i:1245;}i:127;a:3:{i:0;s:13:"listitem_open";i:1;a:1:{i:0;i:1;}i:2;i:1245;}i:128;a:3:{i:0;s:16:"listcontent_open";i:1;a:0:{}i:2;i:1245;}i:129;a:3:{i:0;s:5:"cdata";i:1;a:1:{i:0;s:38:" Realização da Oficina de Robótica;";}i:2;i:1249;}i:130;a:3:{i:0;s:17:"listcontent_close";i:1;a:0:{}i:2;i:1287;}i:131;a:3:{i:0;s:14:"listitem_close";i:1;a:0:{}i:2;i:1287;}i:132;a:3:{i:0;s:13:"listitem_open";i:1;a:1:{i:0;i:1;}i:2;i:1287;}i:133;a:3:{i:0;s:16:"listcontent_open";i:1;a:0:{}i:2;i:1287;}i:134;a:3:{i:0;s:5:"cdata";i:1;a:1:{i:0;s:59:" Marcelo, Lucas e Felipe serão os representantes do grupo;";}i:2;i:1291;}i:135;a:3:{i:0;s:17:"listcontent_close";i:1;a:0:{}i:2;i:1350;}i:136;a:3:{i:0;s:14:"listitem_close";i:1;a:0:{}i:2;i:1350;}i:137;a:3:{i:0;s:13:"listitem_open";i:1;a:1:{i:0;i:1;}i:2;i:1350;}i:138;a:3:{i:0;s:16:"listcontent_open";i:1;a:0:{}i:2;i:1350;}i:139;a:3:{i:0;s:5:"cdata";i:1;a:1:{i:0;s:48:" Cassiana ajudará na organização da Maratona;";}i:2;i:1354;}i:140;a:3:{i:0;s:17:"listcontent_close";i:1;a:0:{}i:2;i:1402;}i:141;a:3:{i:0;s:14:"listitem_close";i:1;a:0:{}i:2;i:1402;}i:142;a:3:{i:0;s:13:"listitem_open";i:1;a:1:{i:0;i:1;}i:2;i:1402;}i:143;a:3:{i:0;s:16:"listcontent_open";i:1;a:0:{}i:2;i:1402;}i:144;a:3:{i:0;s:5:"cdata";i:1;a:1:{i:0;s:97:" Devemos falar com a CEI, com a Nangate e com a Endeeper para buscar patrocínios na premiação;";}i:2;i:1406;}i:145;a:3:{i:0;s:17:"listcontent_close";i:1;a:0:{}i:2;i:1503;}i:146;a:3:{i:0;s:14:"listitem_close";i:1;a:0:{}i:2;i:1503;}i:147;a:3:{i:0;s:11:"listu_close";i:1;a:0:{}i:2;i:1503;}i:148;a:3:{i:0;s:6:"p_open";i:1;a:0:{}i:2;i:1503;}i:149;a:3:{i:0;s:5:"cdata";i:1;a:1:{i:0;s:1:"
";}i:2;i:1504;}i:150;a:3:{i:0;s:11:"strong_open";i:1;a:0:{}i:2;i:1505;}i:151;a:3:{i:0;s:5:"cdata";i:1;a:1:{i:0;s:24:"5) Planejamento PROGRAD:";}i:2;i:1507;}i:152;a:3:{i:0;s:12:"strong_close";i:1;a:0:{}i:2;i:1531;}i:153;a:3:{i:0;s:5:"cdata";i:1;a:1:{i:0;s:1:"
";}i:2;i:1533;}i:154;a:3:{i:0;s:7:"p_close";i:1;a:0:{}i:2;i:1534;}i:155;a:3:{i:0;s:10:"listu_open";i:1;a:0:{}i:2;i:1534;}i:156;a:3:{i:0;s:13:"listitem_open";i:1;a:1:{i:0;i:1;}i:2;i:1534;}i:157;a:3:{i:0;s:16:"listcontent_open";i:1;a:0:{}i:2;i:1534;}i:158;a:3:{i:0;s:5:"cdata";i:1;a:1:{i:0;s:54:" Deve ser posto no TRAC até quinta-feira ao meio-dia;";}i:2;i:1538;}i:159;a:3:{i:0;s:17:"listcontent_close";i:1;a:0:{}i:2;i:1592;}i:160;a:3:{i:0;s:14:"listitem_close";i:1;a:0:{}i:2;i:1592;}i:161;a:3:{i:0;s:11:"listu_close";i:1;a:0:{}i:2;i:1592;}i:162;a:3:{i:0;s:6:"p_open";i:1;a:0:{}i:2;i:1592;}i:163;a:3:{i:0;s:5:"cdata";i:1;a:1:{i:0;s:1:"
";}i:2;i:1593;}i:164;a:3:{i:0;s:11:"strong_open";i:1;a:0:{}i:2;i:1594;}i:165;a:3:{i:0;s:5:"cdata";i:1;a:1:{i:0;s:25:"6) Salão de Graduação:";}i:2;i:1596;}i:166;a:3:{i:0;s:12:"strong_close";i:1;a:0:{}i:2;i:1621;}i:167;a:3:{i:0;s:5:"cdata";i:1;a:1:{i:0;s:1:"
";}i:2;i:1623;}i:168;a:3:{i:0;s:7:"p_close";i:1;a:0:{}i:2;i:1624;}i:169;a:3:{i:0;s:10:"listu_open";i:1;a:0:{}i:2;i:1624;}i:170;a:3:{i:0;s:13:"listitem_open";i:1;a:1:{i:0;i:1;}i:2;i:1624;}i:171;a:3:{i:0;s:16:"listcontent_open";i:1;a:0:{}i:2;i:1624;}i:172;a:3:{i:0;s:5:"cdata";i:1;a:1:{i:0;s:97:" Felipe ficou encarregado de fazer e pode contar com a ajuda da Marcela, da Cassiana e do Arthur.";}i:2;i:1628;}i:173;a:3:{i:0;s:17:"listcontent_close";i:1;a:0:{}i:2;i:1725;}i:174;a:3:{i:0;s:14:"listitem_close";i:1;a:0:{}i:2;i:1725;}i:175;a:3:{i:0;s:11:"listu_close";i:1;a:0:{}i:2;i:1725;}i:176;a:3:{i:0;s:6:"p_open";i:1;a:0:{}i:2;i:1725;}i:177;a:3:{i:0;s:5:"cdata";i:1;a:1:{i:0;s:1:"
";}i:2;i:1726;}i:178;a:3:{i:0;s:11:"strong_open";i:1;a:0:{}i:2;i:1727;}i:179;a:3:{i:0;s:5:"cdata";i:1;a:1:{i:0;s:18:"7) Conta Cassiana:";}i:2;i:1729;}i:180;a:3:{i:0;s:12:"strong_close";i:1;a:0:{}i:2;i:1747;}i:181;a:3:{i:0;s:5:"cdata";i:1;a:1:{i:0;s:1:"
";}i:2;i:1749;}i:182;a:3:{i:0;s:7:"p_close";i:1;a:0:{}i:2;i:1750;}i:183;a:3:{i:0;s:10:"listu_open";i:1;a:0:{}i:2;i:1750;}i:184;a:3:{i:0;s:13:"listitem_open";i:1;a:1:{i:0;i:1;}i:2;i:1750;}i:185;a:3:{i:0;s:16:"listcontent_open";i:1;a:0:{}i:2;i:1750;}i:186;a:3:{i:0;s:5:"cdata";i:1;a:1:{i:0;s:52:" Marcela instruirá Cassiana a organizar seus dados.";}i:2;i:1754;}i:187;a:3:{i:0;s:17:"listcontent_close";i:1;a:0:{}i:2;i:1806;}i:188;a:3:{i:0;s:14:"listitem_close";i:1;a:0:{}i:2;i:1806;}i:189;a:3:{i:0;s:11:"listu_close";i:1;a:0:{}i:2;i:1806;}i:190;a:3:{i:0;s:6:"p_open";i:1;a:0:{}i:2;i:1806;}i:191;a:3:{i:0;s:5:"cdata";i:1;a:1:{i:0;s:1:"
";}i:2;i:1807;}i:192;a:3:{i:0;s:11:"strong_open";i:1;a:0:{}i:2;i:1808;}i:193;a:3:{i:0;s:5:"cdata";i:1;a:1:{i:0;s:15:"8) Latex e SVN/";}i:2;i:1810;}i:194;a:3:{i:0;s:7:"acronym";i:1;a:1:{i:0;s:3:"CVS";}i:2;i:1825;}i:195;a:3:{i:0;s:5:"cdata";i:1;a:1:{i:0;s:1:":";}i:2;i:1828;}i:196;a:3:{i:0;s:12:"strong_close";i:1;a:0:{}i:2;i:1829;}i:197;a:3:{i:0;s:5:"cdata";i:1;a:1:{i:0;s:1:"
";}i:2;i:1831;}i:198;a:3:{i:0;s:7:"p_close";i:1;a:0:{}i:2;i:1832;}i:199;a:3:{i:0;s:10:"listu_open";i:1;a:0:{}i:2;i:1832;}i:200;a:3:{i:0;s:13:"listitem_open";i:1;a:1:{i:0;i:1;}i:2;i:1832;}i:201;a:3:{i:0;s:16:"listcontent_open";i:1;a:0:{}i:2;i:1832;}i:202;a:3:{i:0;s:5:"cdata";i:1;a:1:{i:0;s:113:" Será dado um curso interno para os petianos pelos petianos que aprenderem a trabalhar com o programa no SULPET.";}i:2;i:1836;}i:203;a:3:{i:0;s:17:"listcontent_close";i:1;a:0:{}i:2;i:1949;}i:204;a:3:{i:0;s:14:"listitem_close";i:1;a:0:{}i:2;i:1949;}i:205;a:3:{i:0;s:11:"listu_close";i:1;a:0:{}i:2;i:1949;}i:206;a:3:{i:0;s:6:"p_open";i:1;a:0:{}i:2;i:1949;}i:207;a:3:{i:0;s:5:"cdata";i:1;a:1:{i:0;s:1:"
";}i:2;i:1950;}i:208;a:3:{i:0;s:11:"strong_open";i:1;a:0:{}i:2;i:1951;}i:209;a:3:{i:0;s:5:"cdata";i:1;a:1:{i:0;s:18:"9) Notebook Dante:";}i:2;i:1953;}i:210;a:3:{i:0;s:12:"strong_close";i:1;a:0:{}i:2;i:1971;}i:211;a:3:{i:0;s:5:"cdata";i:1;a:1:{i:0;s:1:"
";}i:2;i:1973;}i:212;a:3:{i:0;s:7:"p_close";i:1;a:0:{}i:2;i:1974;}i:213;a:3:{i:0;s:10:"listu_open";i:1;a:0:{}i:2;i:1974;}i:214;a:3:{i:0;s:13:"listitem_open";i:1;a:1:{i:0;i:1;}i:2;i:1974;}i:215;a:3:{i:0;s:16:"listcontent_open";i:1;a:0:{}i:2;i:1974;}i:216;a:3:{i:0;s:5:"cdata";i:1;a:1:{i:0;s:14:" Em Andamento.";}i:2;i:1978;}i:217;a:3:{i:0;s:17:"listcontent_close";i:1;a:0:{}i:2;i:1992;}i:218;a:3:{i:0;s:14:"listitem_close";i:1;a:0:{}i:2;i:1992;}i:219;a:3:{i:0;s:11:"listu_close";i:1;a:0:{}i:2;i:1992;}i:220;a:3:{i:0;s:6:"p_open";i:1;a:0:{}i:2;i:1992;}i:221;a:3:{i:0;s:5:"cdata";i:1;a:1:{i:0;s:1:"
";}i:2;i:1993;}i:222;a:3:{i:0;s:11:"strong_open";i:1;a:0:{}i:2;i:1994;}i:223;a:3:{i:0;s:5:"cdata";i:1;a:1:{i:0;s:20:"10) Horas Faltantes:";}i:2;i:1996;}i:224;a:3:{i:0;s:12:"strong_close";i:1;a:0:{}i:2;i:2016;}i:225;a:3:{i:0;s:5:"cdata";i:1;a:1:{i:0;s:1:"
";}i:2;i:2018;}i:226;a:3:{i:0;s:7:"p_close";i:1;a:0:{}i:2;i:2019;}i:227;a:3:{i:0;s:10:"listu_open";i:1;a:0:{}i:2;i:2019;}i:228;a:3:{i:0;s:13:"listitem_open";i:1;a:1:{i:0;i:1;}i:2;i:2019;}i:229;a:3:{i:0;s:16:"listcontent_open";i:1;a:0:{}i:2;i:2019;}i:230;a:3:{i:0;s:5:"cdata";i:1;a:1:{i:0;s:31:" Mathues: 4 horas e 31 minutos;";}i:2;i:2023;}i:231;a:3:{i:0;s:17:"listcontent_close";i:1;a:0:{}i:2;i:2054;}i:232;a:3:{i:0;s:14:"listitem_close";i:1;a:0:{}i:2;i:2054;}i:233;a:3:{i:0;s:13:"listitem_open";i:1;a:1:{i:0;i:1;}i:2;i:2054;}i:234;a:3:{i:0;s:16:"listcontent_open";i:1;a:0:{}i:2;i:2054;}i:235;a:3:{i:0;s:5:"cdata";i:1;a:1:{i:0;s:19:" Cassiana: 4 horas.";}i:2;i:2058;}i:236;a:3:{i:0;s:17:"listcontent_close";i:1;a:0:{}i:2;i:2077;}i:237;a:3:{i:0;s:14:"listitem_close";i:1;a:0:{}i:2;i:2077;}i:238;a:3:{i:0;s:11:"listu_close";i:1;a:0:{}i:2;i:2077;}i:239;a:3:{i:0;s:6:"p_open";i:1;a:0:{}i:2;i:2077;}i:240;a:3:{i:0;s:5:"cdata";i:1;a:1:{i:0;s:1:"
";}i:2;i:2078;}i:241;a:3:{i:0;s:11:"strong_open";i:1;a:0:{}i:2;i:2079;}i:242;a:3:{i:0;s:5:"cdata";i:1;a:1:{i:0;s:9:"11) SESU:";}i:2;i:2081;}i:243;a:3:{i:0;s:12:"strong_close";i:1;a:0:{}i:2;i:2090;}i:244;a:3:{i:0;s:5:"cdata";i:1;a:1:{i:0;s:1:"
";}i:2;i:2092;}i:245;a:3:{i:0;s:7:"p_close";i:1;a:0:{}i:2;i:2093;}i:246;a:3:{i:0;s:10:"listu_open";i:1;a:0:{}i:2;i:2093;}i:247;a:3:{i:0;s:13:"listitem_open";i:1;a:1:{i:0;i:1;}i:2;i:2093;}i:248;a:3:{i:0;s:16:"listcontent_open";i:1;a:0:{}i:2;i:2093;}i:249;a:3:{i:0;s:5:"cdata";i:1;a:1:{i:0;s:58:" Antônio fará xerox dos documentos e irá por no portal.";}i:2;i:2097;}i:250;a:3:{i:0;s:17:"listcontent_close";i:1;a:0:{}i:2;i:2155;}i:251;a:3:{i:0;s:14:"listitem_close";i:1;a:0:{}i:2;i:2155;}i:252;a:3:{i:0;s:11:"listu_close";i:1;a:0:{}i:2;i:2155;}i:253;a:3:{i:0;s:6:"p_open";i:1;a:0:{}i:2;i:2155;}i:254;a:3:{i:0;s:5:"cdata";i:1;a:1:{i:0;s:1:"
";}i:2;i:2156;}i:255;a:3:{i:0;s:11:"strong_open";i:1;a:0:{}i:2;i:2157;}i:256;a:3:{i:0;s:5:"cdata";i:1;a:1:{i:0;s:11:"12) Helena:";}i:2;i:2159;}i:257;a:3:{i:0;s:12:"strong_close";i:1;a:0:{}i:2;i:2170;}i:258;a:3:{i:0;s:5:"cdata";i:1;a:1:{i:0;s:1:"
";}i:2;i:2172;}i:259;a:3:{i:0;s:7:"p_close";i:1;a:0:{}i:2;i:2173;}i:260;a:3:{i:0;s:10:"listu_open";i:1;a:0:{}i:2;i:2173;}i:261;a:3:{i:0;s:13:"listitem_open";i:1;a:1:{i:0;i:1;}i:2;i:2173;}i:262;a:3:{i:0;s:16:"listcontent_open";i:1;a:0:{}i:2;i:2173;}i:263;a:3:{i:0;s:5:"cdata";i:1;a:1:{i:0;s:61:" Kauê deve resolver o problema que ocasionou o quanto antes;";}i:2;i:2177;}i:264;a:3:{i:0;s:17:"listcontent_close";i:1;a:0:{}i:2;i:2238;}i:265;a:3:{i:0;s:14:"listitem_close";i:1;a:0:{}i:2;i:2238;}i:266;a:3:{i:0;s:13:"listitem_open";i:1;a:1:{i:0;i:1;}i:2;i:2238;}i:267;a:3:{i:0;s:16:"listcontent_open";i:1;a:0:{}i:2;i:2238;}i:268;a:3:{i:0;s:5:"cdata";i:1;a:1:{i:0;s:60:" Kauê deverá justificar instalação na próxima reunião.";}i:2;i:2242;}i:269;a:3:{i:0;s:17:"listcontent_close";i:1;a:0:{}i:2;i:2302;}i:270;a:3:{i:0;s:14:"listitem_close";i:1;a:0:{}i:2;i:2302;}i:271;a:3:{i:0;s:11:"listu_close";i:1;a:0:{}i:2;i:2302;}i:272;a:3:{i:0;s:6:"p_open";i:1;a:0:{}i:2;i:2302;}i:273;a:3:{i:0;s:5:"cdata";i:1;a:1:{i:0;s:1:"
";}i:2;i:2303;}i:274;a:3:{i:0;s:11:"strong_open";i:1;a:0:{}i:2;i:2304;}i:275;a:3:{i:0;s:5:"cdata";i:1;a:1:{i:0;s:22:"13) Taxas Acadêmicas:";}i:2;i:2306;}i:276;a:3:{i:0;s:12:"strong_close";i:1;a:0:{}i:2;i:2328;}i:277;a:3:{i:0;s:5:"cdata";i:1;a:1:{i:0;s:1:"
";}i:2;i:2330;}i:278;a:3:{i:0;s:7:"p_close";i:1;a:0:{}i:2;i:2331;}i:279;a:3:{i:0;s:10:"listu_open";i:1;a:0:{}i:2;i:2331;}i:280;a:3:{i:0;s:13:"listitem_open";i:1;a:1:{i:0;i:1;}i:2;i:2331;}i:281;a:3:{i:0;s:16:"listcontent_open";i:1;a:0:{}i:2;i:2331;}i:282;a:3:{i:0;s:5:"cdata";i:1;a:1:{i:0;s:83:" Matheus verá o que deixou de ser comprado para incluir ou não em um novo pedido.";}i:2;i:2335;}i:283;a:3:{i:0;s:17:"listcontent_close";i:1;a:0:{}i:2;i:2418;}i:284;a:3:{i:0;s:14:"listitem_close";i:1;a:0:{}i:2;i:2418;}i:285;a:3:{i:0;s:11:"listu_close";i:1;a:0:{}i:2;i:2418;}i:286;a:3:{i:0;s:6:"p_open";i:1;a:0:{}i:2;i:2418;}i:287;a:3:{i:0;s:5:"cdata";i:1;a:1:{i:0;s:1:"
";}i:2;i:2419;}i:288;a:3:{i:0;s:11:"strong_open";i:1;a:0:{}i:2;i:2420;}i:289;a:3:{i:0;s:5:"cdata";i:1;a:1:{i:0;s:19:"14) Falta Cassiana:";}i:2;i:2422;}i:290;a:3:{i:0;s:12:"strong_close";i:1;a:0:{}i:2;i:2441;}i:291;a:3:{i:0;s:5:"cdata";i:1;a:1:{i:0;s:1:"
";}i:2;i:2443;}i:292;a:3:{i:0;s:7:"p_close";i:1;a:0:{}i:2;i:2444;}i:293;a:3:{i:0;s:10:"listu_open";i:1;a:0:{}i:2;i:2444;}i:294;a:3:{i:0;s:13:"listitem_open";i:1;a:1:{i:0;i:1;}i:2;i:2444;}i:295;a:3:{i:0;s:16:"listcontent_open";i:1;a:0:{}i:2;i:2444;}i:296;a:3:{i:0;s:5:"cdata";i:1;a:1:{i:0;s:137:" Cassiana justificou sua falta. Seu pai esta com doença grave e por isso não pode comparecer muito. O grupo considerou bem justificado.";}i:2;i:2448;}i:297;a:3:{i:0;s:17:"listcontent_close";i:1;a:0:{}i:2;i:2585;}i:298;a:3:{i:0;s:14:"listitem_close";i:1;a:0:{}i:2;i:2585;}i:299;a:3:{i:0;s:11:"listu_close";i:1;a:0:{}i:2;i:2585;}i:300;a:3:{i:0;s:6:"p_open";i:1;a:0:{}i:2;i:2585;}i:301;a:3:{i:0;s:5:"cdata";i:1;a:1:{i:0;s:1:"
";}i:2;i:2586;}i:302;a:3:{i:0;s:11:"strong_open";i:1;a:0:{}i:2;i:2587;}i:303;a:3:{i:0;s:5:"cdata";i:1;a:1:{i:0;s:10:"15) Kauê:";}i:2;i:2589;}i:304;a:3:{i:0;s:12:"strong_close";i:1;a:0:{}i:2;i:2599;}i:305;a:3:{i:0;s:5:"cdata";i:1;a:1:{i:0;s:1:"
";}i:2;i:2601;}i:306;a:3:{i:0;s:7:"p_close";i:1;a:0:{}i:2;i:2602;}i:307;a:3:{i:0;s:10:"listu_open";i:1;a:0:{}i:2;i:2602;}i:308;a:3:{i:0;s:13:"listitem_open";i:1;a:1:{i:0;i:1;}i:2;i:2602;}i:309;a:3:{i:0;s:16:"listcontent_open";i:1;a:0:{}i:2;i:2602;}i:310;a:3:{i:0;s:5:"cdata";i:1;a:1:{i:0;s:152:" Tutor constatou a ausência de Kauê na reunião, o problema por ele ocasionado e a falta da comida que era sua responsabilidade. Isso gerou uma falta.";}i:2;i:2606;}i:311;a:3:{i:0;s:17:"listcontent_close";i:1;a:0:{}i:2;i:2758;}i:312;a:3:{i:0;s:14:"listitem_close";i:1;a:0:{}i:2;i:2758;}i:313;a:3:{i:0;s:11:"listu_close";i:1;a:0:{}i:2;i:2758;}i:314;a:3:{i:0;s:10:"listu_open";i:1;a:0:{}i:2;i:2759;}i:315;a:3:{i:0;s:13:"listitem_open";i:1;a:1:{i:0;i:1;}i:2;i:2759;}i:316;a:3:{i:0;s:16:"listcontent_open";i:1;a:0:{}i:2;i:2759;}i:317;a:3:{i:0;s:5:"cdata";i:1;a:1:{i:0;s:24:"*== Objetivos ROBOPET ==";}i:2;i:2763;}i:318;a:3:{i:0;s:11:"strong_open";i:1;a:0:{}i:2;i:2787;}i:319;a:3:{i:0;s:5:"cdata";i:1;a:1:{i:0;s:104:"

Objetivo Geral: Entregar, até a última reunião de junho, todos os módulos (em separado) prontos e ";}i:2;i:2789;}i:320;a:3:{i:0;s:12:"strong_close";i:1;a:0:{}i:2;i:2893;}i:321;a:3:{i:0;s:5:"cdata";i:1;a:1:{i:0;s:15:"documentados**.";}i:2;i:2895;}i:322;a:3:{i:0;s:17:"listcontent_close";i:1;a:0:{}i:2;i:2910;}i:323;a:3:{i:0;s:14:"listitem_close";i:1;a:0:{}i:2;i:2910;}i:324;a:3:{i:0;s:11:"listu_close";i:1;a:0:{}i:2;i:2910;}i:325;a:3:{i:0;s:6:"p_open";i:1;a:0:{}i:2;i:2910;}i:326;a:3:{i:0;s:5:"cdata";i:1;a:1:{i:0;s:25:"
1) Objetivos Mecânica:
";}i:2;i:2911;}i:327;a:3:{i:0;s:7:"p_close";i:1;a:0:{}i:2;i:2936;}i:328;a:3:{i:0;s:10:"listu_open";i:1;a:0:{}i:2;i:2936;}i:329;a:3:{i:0;s:13:"listitem_open";i:1;a:1:{i:0;i:1;}i:2;i:2936;}i:330;a:3:{i:0;s:16:"listcontent_open";i:1;a:0:{}i:2;i:2936;}i:331;a:3:{i:0;s:5:"cdata";i:1;a:1:{i:0;s:44:" desenvolver chutador para o robô do Itamir";}i:2;i:2940;}i:332;a:3:{i:0;s:17:"listcontent_close";i:1;a:0:{}i:2;i:2984;}i:333;a:3:{i:0;s:14:"listitem_close";i:1;a:0:{}i:2;i:2984;}i:334;a:3:{i:0;s:13:"listitem_open";i:1;a:1:{i:0;i:1;}i:2;i:2984;}i:335;a:3:{i:0;s:16:"listcontent_open";i:1;a:0:{}i:2;i:2984;}i:336;a:3:{i:0;s:5:"cdata";i:1;a:1:{i:0;s:28:" desenhar chassi com 4 rodas";}i:2;i:2988;}i:337;a:3:{i:0;s:17:"listcontent_close";i:1;a:0:{}i:2;i:3016;}i:338;a:3:{i:0;s:14:"listitem_close";i:1;a:0:{}i:2;i:3016;}i:339;a:3:{i:0;s:13:"listitem_open";i:1;a:1:{i:0;i:1;}i:2;i:3016;}i:340;a:3:{i:0;s:16:"listcontent_open";i:1;a:0:{}i:2;i:3016;}i:341;a:3:{i:0;s:5:"cdata";i:1;a:1:{i:0;s:20:" mecanismo de drible";}i:2;i:3020;}i:342;a:3:{i:0;s:17:"listcontent_close";i:1;a:0:{}i:2;i:3040;}i:343;a:3:{i:0;s:14:"listitem_close";i:1;a:0:{}i:2;i:3040;}i:344;a:3:{i:0;s:13:"listitem_open";i:1;a:1:{i:0;i:1;}i:2;i:3040;}i:345;a:3:{i:0;s:16:"listcontent_open";i:1;a:0:{}i:2;i:3040;}i:346;a:3:{i:0;s:5:"cdata";i:1;a:1:{i:0;s:38:" escolher local para encomendar peças";}i:2;i:3044;}i:347;a:3:{i:0;s:17:"listcontent_close";i:1;a:0:{}i:2;i:3082;}i:348;a:3:{i:0;s:14:"listitem_close";i:1;a:0:{}i:2;i:3082;}i:349;a:3:{i:0;s:13:"listitem_open";i:1;a:1:{i:0;i:1;}i:2;i:3082;}i:350;a:3:{i:0;s:16:"listcontent_open";i:1;a:0:{}i:2;i:3082;}i:351;a:3:{i:0;s:5:"cdata";i:1;a:1:{i:0;s:18:" pesquisar motores";}i:2;i:3086;}i:352;a:3:{i:0;s:17:"listcontent_close";i:1;a:0:{}i:2;i:3104;}i:353;a:3:{i:0;s:14:"listitem_close";i:1;a:0:{}i:2;i:3104;}i:354;a:3:{i:0;s:11:"listu_close";i:1;a:0:{}i:2;i:3104;}i:355;a:3:{i:0;s:10:"quote_open";i:1;a:0:{}i:2;i:3105;}i:356;a:3:{i:0;s:5:"cdata";i:1;a:1:{i:0;s:38:" Rascunho do chutador foi apresentado.";}i:2;i:3107;}i:357;a:3:{i:0;s:11:"quote_close";i:1;a:0:{}i:2;i:3145;}i:358;a:3:{i:0;s:10:"quote_open";i:1;a:0:{}i:2;i:3146;}i:359;a:3:{i:0;s:5:"cdata";i:1;a:1:{i:0;s:54:" Apresentar para a proxima reunião rascunho do chasi.";}i:2;i:3148;}i:360;a:3:{i:0;s:11:"quote_close";i:1;a:0:{}i:2;i:3202;}i:361;a:3:{i:0;s:6:"p_open";i:1;a:0:{}i:2;i:3202;}i:362;a:3:{i:0;s:5:"cdata";i:1;a:1:{i:0;s:27:"
2) Objetivos Eletrônica:
";}i:2;i:3203;}i:363;a:3:{i:0;s:7:"p_close";i:1;a:0:{}i:2;i:3230;}i:364;a:3:{i:0;s:10:"listu_open";i:1;a:0:{}i:2;i:3230;}i:365;a:3:{i:0;s:13:"listitem_open";i:1;a:1:{i:0;i:1;}i:2;i:3230;}i:366;a:3:{i:0;s:16:"listcontent_open";i:1;a:0:{}i:2;i:3230;}i:367;a:3:{i:0;s:5:"cdata";i:1;a:1:{i:0;s:27:" fazer mais testes na placa";}i:2;i:3234;}i:368;a:3:{i:0;s:17:"listcontent_close";i:1;a:0:{}i:2;i:3261;}i:369;a:3:{i:0;s:14:"listitem_close";i:1;a:0:{}i:2;i:3261;}i:370;a:3:{i:0;s:13:"listitem_open";i:1;a:1:{i:0;i:1;}i:2;i:3261;}i:371;a:3:{i:0;s:16:"listcontent_open";i:1;a:0:{}i:2;i:3261;}i:372;a:3:{i:0;s:5:"cdata";i:1;a:1:{i:0;s:189:" trabalhar na versão beta: A: programação Circuit B: novo motor C: controle de bateria D: 2 bits para o chutador E: rádio melhorado (controle de rádio) F: comentar/melhorar código PIC";}i:2;i:3265;}i:373;a:3:{i:0;s:17:"listcontent_close";i:1;a:0:{}i:2;i:3454;}i:374;a:3:{i:0;s:14:"listitem_close";i:1;a:0:{}i:2;i:3454;}i:375;a:3:{i:0;s:11:"listu_close";i:1;a:0:{}i:2;i:3454;}i:376;a:3:{i:0;s:10:"quote_open";i:1;a:0:{}i:2;i:3455;}i:377;a:3:{i:0;s:5:"cdata";i:1;a:1:{i:0;s:23:" Feitos tópicos A e B.";}i:2;i:3457;}i:378;a:3:{i:0;s:11:"quote_close";i:1;a:0:{}i:2;i:3480;}i:379;a:3:{i:0;s:10:"quote_open";i:1;a:0:{}i:2;i:3481;}i:380;a:3:{i:0;s:5:"cdata";i:1;a:1:{i:0;s:115:" Apresentar para a proxima reuniao circuíto do encoder, melhorar codigo do PIC e desenvolver layout da nova placa.";}i:2;i:3483;}i:381;a:3:{i:0;s:11:"quote_close";i:1;a:0:{}i:2;i:3598;}i:382;a:3:{i:0;s:6:"p_open";i:1;a:0:{}i:2;i:3598;}i:383;a:3:{i:0;s:5:"cdata";i:1;a:1:{i:0;s:22:"
3) Objetivos Rádio:
";}i:2;i:3599;}i:384;a:3:{i:0;s:7:"p_close";i:1;a:0:{}i:2;i:3621;}i:385;a:3:{i:0;s:10:"listu_open";i:1;a:0:{}i:2;i:3621;}i:386;a:3:{i:0;s:13:"listitem_open";i:1;a:1:{i:0;i:1;}i:2;i:3621;}i:387;a:3:{i:0;s:16:"listcontent_open";i:1;a:0:{}i:2;i:3621;}i:388;a:3:{i:0;s:5:"cdata";i:1;a:1:{i:0;s:25:" pesquisar sinais do juiz";}i:2;i:3625;}i:389;a:3:{i:0;s:17:"listcontent_close";i:1;a:0:{}i:2;i:3650;}i:390;a:3:{i:0;s:14:"listitem_close";i:1;a:0:{}i:2;i:3650;}i:391;a:3:{i:0;s:11:"listu_close";i:1;a:0:{}i:2;i:3650;}i:392;a:3:{i:0;s:10:"quote_open";i:1;a:0:{}i:2;i:3651;}i:393;a:3:{i:0;s:5:"cdata";i:1;a:1:{i:0;s:25:" Pesquiso sinais do juiz.";}i:2;i:3653;}i:394;a:3:{i:0;s:11:"quote_close";i:1;a:0:{}i:2;i:3678;}i:395;a:3:{i:0;s:6:"p_open";i:1;a:0:{}i:2;i:3678;}i:396;a:3:{i:0;s:5:"cdata";i:1;a:1:{i:0;s:18:"
4) Objetivos IA:
";}i:2;i:3679;}i:397;a:3:{i:0;s:7:"p_close";i:1;a:0:{}i:2;i:3697;}i:398;a:3:{i:0;s:10:"listu_open";i:1;a:0:{}i:2;i:3697;}i:399;a:3:{i:0;s:13:"listitem_open";i:1;a:1:{i:0;i:1;}i:2;i:3697;}i:400;a:3:{i:0;s:16:"listcontent_open";i:1;a:0:{}i:2;i:3697;}i:401;a:3:{i:0;s:5:"cdata";i:1;a:1:{i:0;s:36:" formatar entrada conforme protocolo";}i:2;i:3701;}i:402;a:3:{i:0;s:17:"listcontent_close";i:1;a:0:{}i:2;i:3737;}i:403;a:3:{i:0;s:14:"listitem_close";i:1;a:0:{}i:2;i:3737;}i:404;a:3:{i:0;s:13:"listitem_open";i:1;a:1:{i:0;i:1;}i:2;i:3737;}i:405;a:3:{i:0;s:16:"listcontent_open";i:1;a:0:{}i:2;i:3737;}i:406;a:3:{i:0;s:5:"cdata";i:1;a:1:{i:0;s:18:" estudar o código";}i:2;i:3741;}i:407;a:3:{i:0;s:17:"listcontent_close";i:1;a:0:{}i:2;i:3759;}i:408;a:3:{i:0;s:14:"listitem_close";i:1;a:0:{}i:2;i:3759;}i:409;a:3:{i:0;s:13:"listitem_open";i:1;a:1:{i:0;i:1;}i:2;i:3759;}i:410;a:3:{i:0;s:16:"listcontent_open";i:1;a:0:{}i:2;i:3759;}i:411;a:3:{i:0;s:5:"cdata";i:1;a:1:{i:0;s:38:" pesquisar protocolo de sinais do juiz";}i:2;i:3763;}i:412;a:3:{i:0;s:17:"listcontent_close";i:1;a:0:{}i:2;i:3801;}i:413;a:3:{i:0;s:14:"listitem_close";i:1;a:0:{}i:2;i:3801;}i:414;a:3:{i:0;s:11:"listu_close";i:1;a:0:{}i:2;i:3801;}i:415;a:3:{i:0;s:10:"quote_open";i:1;a:0:{}i:2;i:3802;}i:416;a:3:{i:0;s:5:"cdata";i:1;a:1:{i:0;s:98:" Fez os dois primeiros objetivos e marcou uma reunião para quinta-feira às 3 horas e 30 minutos.";}i:2;i:3804;}i:417;a:3:{i:0;s:11:"quote_close";i:1;a:0:{}i:2;i:3902;}i:418;a:3:{i:0;s:6:"p_open";i:1;a:0:{}i:2;i:3902;}i:419;a:3:{i:0;s:5:"cdata";i:1;a:1:{i:0;s:22:"
5) Objetivos Visão:
";}i:2;i:3903;}i:420;a:3:{i:0;s:7:"p_close";i:1;a:0:{}i:2;i:3925;}i:421;a:3:{i:0;s:10:"listu_open";i:1;a:0:{}i:2;i:3925;}i:422;a:3:{i:0;s:13:"listitem_open";i:1;a:1:{i:0;i:1;}i:2;i:3925;}i:423;a:3:{i:0;s:16:"listcontent_open";i:1;a:0:{}i:2;i:3925;}i:424;a:3:{i:0;s:5:"cdata";i:1;a:1:{i:0;s:26:" estruturação de código";}i:2;i:3929;}i:425;a:3:{i:0;s:17:"listcontent_close";i:1;a:0:{}i:2;i:3955;}i:426;a:3:{i:0;s:14:"listitem_close";i:1;a:0:{}i:2;i:3955;}i:427;a:3:{i:0;s:13:"listitem_open";i:1;a:1:{i:0;i:1;}i:2;i:3955;}i:428;a:3:{i:0;s:16:"listcontent_open";i:1;a:0:{}i:2;i:3955;}i:429;a:3:{i:0;s:5:"cdata";i:1;a:1:{i:0;s:26:" passar para Visual Studio";}i:2;i:3959;}i:430;a:3:{i:0;s:17:"listcontent_close";i:1;a:0:{}i:2;i:3985;}i:431;a:3:{i:0;s:14:"listitem_close";i:1;a:0:{}i:2;i:3985;}i:432;a:3:{i:0;s:11:"listu_close";i:1;a:0:{}i:2;i:3985;}i:433;a:3:{i:0;s:10:"quote_open";i:1;a:0:{}i:2;i:3986;}i:434;a:3:{i:0;s:5:"cdata";i:1;a:1:{i:0;s:28:" Cumpriu os objetivos acima.";}i:2;i:3988;}i:435;a:3:{i:0;s:11:"quote_close";i:1;a:0:{}i:2;i:4016;}i:436;a:3:{i:0;s:10:"quote_open";i:1;a:0:{}i:2;i:4017;}i:437;a:3:{i:0;s:5:"cdata";i:1;a:1:{i:0;s:105:" Prometeu explicar o codigo para Cassiana, extruturar o codigo e prever objetivos para juntar os codigos.";}i:2;i:4019;}i:438;a:3:{i:0;s:11:"quote_close";i:1;a:0:{}i:2;i:4124;}i:439;a:3:{i:0;s:12:"document_end";i:1;a:0:{}i:2;i:4124;}}