a:396:{i:0;a:3:{i:0;s:14:"document_start";i:1;a:0:{}i:2;i:0;}i:1;a:3:{i:0;s:6:"p_open";i:1;a:0:{}i:2;i:0;}i:2;a:3:{i:0;s:7:"p_close";i:1;a:0:{}i:2;i:1;}i:3;a:3:{i:0;s:12:"section_edit";i:1;a:4:{i:0;i:-1;i:1;i:0;i:2;i:1;i:3;s:0:"";}i:2;i:1;}i:4;a:3:{i:0;s:6:"header";i:1;a:3:{i:0;s:24:"Aula 4 - Administração";i:1;i:1;i:2;i:1;}i:2;i:1;}i:5;a:3:{i:0;s:12:"section_open";i:1;a:1:{i:0;i:1;}i:2;i:1;}i:6;a:3:{i:0;s:13:"section_close";i:1;a:0:{}i:2;i:41;}i:7;a:3:{i:0;s:12:"section_edit";i:1;a:4:{i:0;i:1;i:1;i:40;i:2;i:1;i:3;s:24:"Aula 4 - Administração";}i:2;i:41;}i:8;a:3:{i:0;s:6:"header";i:1;a:3:{i:0;s:20:"O Editor de Texto VI";i:1;i:2;i:2;i:41;}i:2;i:41;}i:9;a:3:{i:0;s:12:"section_open";i:1;a:1:{i:0;i:2;}i:2;i:41;}i:10;a:3:{i:0;s:13:"section_close";i:1;a:0:{}i:2;i:75;}i:11;a:3:{i:0;s:12:"section_edit";i:1;a:4:{i:0;i:41;i:1;i:74;i:2;i:2;i:3;s:20:"O Editor de Texto VI";}i:2;i:75;}i:12;a:3:{i:0;s:6:"header";i:1;a:3:{i:0;s:43:"Por que aprender a usar um editor de texto?";i:1;i:3;i:2;i:75;}i:2;i:75;}i:13;a:3:{i:0;s:12:"section_open";i:1;a:1:{i:0;i:3;}i:2;i:75;}i:14;a:3:{i:0;s:6:"p_open";i:1;a:0:{}i:2;i:128;}i:15;a:3:{i:0;s:5:"cdata";i:1;a:1:{i:0;s:310:"
A maneira UNIX de configurar o sistema é através de arquivos texto (e não de um painel de controle!). Configurar desta maneira é muito mais confiável, pois se você copiar a configuração de um computador para outro, esta configuração funciona! Pense em como você faria isto com o painel de controle?";}i:2;i:129;}i:16;a:3:{i:0;s:7:"p_close";i:1;a:0:{}i:2;i:439;}i:17;a:3:{i:0;s:6:"p_open";i:1;a:0:{}i:2;i:439;}i:18;a:3:{i:0;s:5:"cdata";i:1;a:1:{i:0;s:123:"Resposta: já tentaram configurar compartilhamento de rede no Windows? Ele oferece gravar um CD/Disquete de configuração.";}i:2;i:441;}i:19;a:3:{i:0;s:7:"p_close";i:1;a:0:{}i:2;i:564;}i:20;a:3:{i:0;s:6:"p_open";i:1;a:0:{}i:2;i:564;}i:21;a:3:{i:0;s:5:"cdata";i:1;a:1:{i:0;s:317:"Para editar estes arquivos, precisamos de um editor de texto. Como nem sempre teremos a interface gráfica a disposição, precisamos aprender um editor de texto em modo texto. Existe uma variedade deles, os dois culturalmente mais significativos (e rivais) são o vi e o emacs. Existem outros, como o pico, joe, etc.";}i:2;i:566;}i:22;a:3:{i:0;s:7:"p_close";i:1;a:0:{}i:2;i:883;}i:23;a:3:{i:0;s:6:"p_open";i:1;a:0:{}i:2;i:883;}i:24;a:3:{i:0;s:5:"cdata";i:1;a:1:{i:0;s:250:"O VI é famoso pelo apito chato que ele emite cada vez que você executa um comando inválido. O emacs é famoso pelo número de teclas que você tem que pressionar simultâneamente (tipo, ctrl + alt + del + f1 + f4). Ensinaremos o vi por tradição.";}i:2;i:885;}i:25;a:3:{i:0;s:7:"p_close";i:1;a:0:{}i:2;i:1135;}i:26;a:3:{i:0;s:13:"section_close";i:1;a:0:{}i:2;i:1137;}i:27;a:3:{i:0;s:12:"section_edit";i:1;a:4:{i:0;i:75;i:1;i:1136;i:2;i:3;i:3;s:43:"Por que aprender a usar um editor de texto?";}i:2;i:1137;}i:28;a:3:{i:0;s:6:"header";i:1;a:3:{i:0;s:18:"Introdução ao VI";i:1;i:3;i:2;i:1137;}i:2;i:1137;}i:29;a:3:{i:0;s:12:"section_open";i:1;a:1:{i:0;i:3;}i:2;i:1137;}i:30;a:3:{i:0;s:6:"p_open";i:1;a:0:{}i:2;i:1165;}i:31;a:3:{i:0;s:5:"cdata";i:1;a:1:{i:0;s:52:"
O VI (VIsual editor) possui 4 modos de operação:
";}i:2;i:1166;}i:32;a:3:{i:0;s:7:"p_close";i:1;a:0:{}i:2;i:1218;}i:33;a:3:{i:0;s:10:"listu_open";i:1;a:0:{}i:2;i:1218;}i:34;a:3:{i:0;s:13:"listitem_open";i:1;a:1:{i:0;i:1;}i:2;i:1218;}i:35;a:3:{i:0;s:16:"listcontent_open";i:1;a:0:{}i:2;i:1218;}i:36;a:3:{i:0;s:5:"cdata";i:1;a:1:{i:0;s:1:" ";}i:2;i:1222;}i:37;a:3:{i:0;s:11:"strong_open";i:1;a:0:{}i:2;i:1223;}i:38;a:3:{i:0;s:5:"cdata";i:1;a:1:{i:0;s:6:"Insert";}i:2;i:1225;}i:39;a:3:{i:0;s:12:"strong_close";i:1;a:0:{}i:2;i:1231;}i:40;a:3:{i:0;s:5:"cdata";i:1;a:1:{i:0;s:21:": Para inserir texto;";}i:2;i:1233;}i:41;a:3:{i:0;s:17:"listcontent_close";i:1;a:0:{}i:2;i:1254;}i:42;a:3:{i:0;s:14:"listitem_close";i:1;a:0:{}i:2;i:1254;}i:43;a:3:{i:0;s:13:"listitem_open";i:1;a:1:{i:0;i:1;}i:2;i:1254;}i:44;a:3:{i:0;s:16:"listcontent_open";i:1;a:0:{}i:2;i:1254;}i:45;a:3:{i:0;s:5:"cdata";i:1;a:1:{i:0;s:1:" ";}i:2;i:1258;}i:46;a:3:{i:0;s:11:"strong_open";i:1;a:0:{}i:2;i:1259;}i:47;a:3:{i:0;s:5:"cdata";i:1;a:1:{i:0;s:7:"Command";}i:2;i:1261;}i:48;a:3:{i:0;s:12:"strong_close";i:1;a:0:{}i:2;i:1268;}i:49;a:3:{i:0;s:5:"cdata";i:1;a:1:{i:0;s:57:": Para executar comandos. Também chamado de modo normal;";}i:2;i:1270;}i:50;a:3:{i:0;s:17:"listcontent_close";i:1;a:0:{}i:2;i:1327;}i:51;a:3:{i:0;s:14:"listitem_close";i:1;a:0:{}i:2;i:1327;}i:52;a:3:{i:0;s:13:"listitem_open";i:1;a:1:{i:0;i:1;}i:2;i:1327;}i:53;a:3:{i:0;s:16:"listcontent_open";i:1;a:0:{}i:2;i:1327;}i:54;a:3:{i:0;s:5:"cdata";i:1;a:1:{i:0;s:1:" ";}i:2;i:1331;}i:55;a:3:{i:0;s:11:"strong_open";i:1;a:0:{}i:2;i:1332;}i:56;a:3:{i:0;s:5:"cdata";i:1;a:1:{i:0;s:2:"Ex";}i:2;i:1334;}i:57;a:3:{i:0;s:12:"strong_close";i:1;a:0:{}i:2;i:1336;}i:58;a:3:{i:0;s:5:"cdata";i:1;a:1:{i:0;s:40:": Para executar comandos de dois pontos;";}i:2;i:1338;}i:59;a:3:{i:0;s:17:"listcontent_close";i:1;a:0:{}i:2;i:1378;}i:60;a:3:{i:0;s:14:"listitem_close";i:1;a:0:{}i:2;i:1378;}i:61;a:3:{i:0;s:13:"listitem_open";i:1;a:1:{i:0;i:1;}i:2;i:1378;}i:62;a:3:{i:0;s:16:"listcontent_open";i:1;a:0:{}i:2;i:1378;}i:63;a:3:{i:0;s:5:"cdata";i:1;a:1:{i:0;s:1:" ";}i:2;i:1382;}i:64;a:3:{i:0;s:11:"strong_open";i:1;a:0:{}i:2;i:1383;}i:65;a:3:{i:0;s:5:"cdata";i:1;a:1:{i:0;s:6:"Visual";}i:2;i:1385;}i:66;a:3:{i:0;s:12:"strong_close";i:1;a:0:{}i:2;i:1391;}i:67;a:3:{i:0;s:5:"cdata";i:1;a:1:{i:0;s:36:": Para selecionar texto visualmente.";}i:2;i:1393;}i:68;a:3:{i:0;s:17:"listcontent_close";i:1;a:0:{}i:2;i:1429;}i:69;a:3:{i:0;s:14:"listitem_close";i:1;a:0:{}i:2;i:1429;}i:70;a:3:{i:0;s:11:"listu_close";i:1;a:0:{}i:2;i:1429;}i:71;a:3:{i:0;s:6:"p_open";i:1;a:0:{}i:2;i:1429;}i:72;a:3:{i:0;s:5:"cdata";i:1;a:1:{i:0;s:86:"
O modo de inserção não é o padrão. Para entrar nele, é preciso apertar a tecla ";}i:2;i:1430;}i:73;a:3:{i:0;s:11:"strong_open";i:1;a:0:{}i:2;i:1516;}i:74;a:3:{i:0;s:5:"cdata";i:1;a:1:{i:0;s:1:"i";}i:2;i:1518;}i:75;a:3:{i:0;s:12:"strong_close";i:1;a:0:{}i:2;i:1519;}i:76;a:3:{i:0;s:5:"cdata";i:1;a:1:{i:0;s:109:", e então digitar o texto a ser inserido. Para passar do modo inserção para o modo de comandos, pressione ";}i:2;i:1521;}i:77;a:3:{i:0;s:11:"strong_open";i:1;a:0:{}i:2;i:1630;}i:78;a:3:{i:0;s:5:"cdata";i:1;a:1:{i:0;s:11:"&lt;ESC&gt;";}i:2;i:1632;}i:79;a:3:{i:0;s:12:"strong_close";i:1;a:0:{}i:2;i:1643;}i:80;a:3:{i:0;s:5:"cdata";i:1;a:1:{i:0;s:73:". O modo visual serve para selecionar texto. Para entrar nele, pressione ";}i:2;i:1645;}i:81;a:3:{i:0;s:11:"strong_open";i:1;a:0:{}i:2;i:1718;}i:82;a:3:{i:0;s:5:"cdata";i:1;a:1:{i:0;s:1:"v";}i:2;i:1720;}i:83;a:3:{i:0;s:12:"strong_close";i:1;a:0:{}i:2;i:1721;}i:84;a:3:{i:0;s:5:"cdata";i:1;a:1:{i:0;s:56:", e então selecione o texto desejado. Após, pressione ";}i:2;i:1723;}i:85;a:3:{i:0;s:11:"strong_open";i:1;a:0:{}i:2;i:1779;}i:86;a:3:{i:0;s:5:"cdata";i:1;a:1:{i:0;s:11:"&lt;ESC&gt;";}i:2;i:1781;}i:87;a:3:{i:0;s:12:"strong_close";i:1;a:0:{}i:2;i:1792;}i:88;a:3:{i:0;s:5:"cdata";i:1;a:1:{i:0;s:177:" para aplicar algum comando apenas no texto selecionado. O modo Ex serve para executar comandos como salvar, configurar o editor, e substituir texto. Do modo de comando, digite ";}i:2;i:1794;}i:89;a:3:{i:0;s:11:"strong_open";i:1;a:0:{}i:2;i:1971;}i:90;a:3:{i:0;s:5:"cdata";i:1;a:1:{i:0;s:24:":w arquivo &lt;ENTER&gt;";}i:2;i:1973;}i:91;a:3:{i:0;s:12:"strong_close";i:1;a:0:{}i:2;i:1997;}i:92;a:3:{i:0;s:5:"cdata";i:1;a:1:{i:0;s:31:" para salvar o arquivo. Digite ";}i:2;i:1999;}i:93;a:3:{i:0;s:11:"strong_open";i:1;a:0:{}i:2;i:2030;}i:94;a:3:{i:0;s:5:"cdata";i:1;a:1:{i:0;s:2:":q";}i:2;i:2032;}i:95;a:3:{i:0;s:12:"strong_close";i:1;a:0:{}i:2;i:2034;}i:96;a:3:{i:0;s:5:"cdata";i:1;a:1:{i:0;s:47:" para sair do VI. Para sair sem salvar, digite ";}i:2;i:2036;}i:97;a:3:{i:0;s:11:"strong_open";i:1;a:0:{}i:2;i:2083;}i:98;a:3:{i:0;s:5:"cdata";i:1;a:1:{i:0;s:6:":q''' ";}i:2;i:2085;}i:99;a:3:{i:0;s:12:"strong_close";i:1;a:0:{}i:2;i:2091;}i:100;a:3:{i:0;s:7:"p_close";i:1;a:0:{}i:2;i:2093;}i:101;a:3:{i:0;s:6:"p_open";i:1;a:0:{}i:2;i:2093;}i:102;a:3:{i:0;s:11:"strong_open";i:1;a:0:{}i:2;i:2095;}i:103;a:3:{i:0;s:5:"cdata";i:1;a:1:{i:0;s:12:"Exercício 1";}i:2;i:2097;}i:104;a:3:{i:0;s:12:"strong_close";i:1;a:0:{}i:2;i:2109;}i:105;a:3:{i:0;s:5:"cdata";i:1;a:1:{i:0;s:103:": Instale o pacote build-essential e escreva o Hello World em C nesta máquina. Para compilar, digite:
";}i:2;i:2111;}i:106;a:3:{i:0;s:7:"p_close";i:1;a:0:{}i:2;i:2214;}i:107;a:3:{i:0;s:12:"preformatted";i:1;a:1:{i:0;s:20:"gcc -o hello hello.c";}i:2;i:2214;}i:108;a:3:{i:0;s:13:"section_close";i:1;a:0:{}i:2;i:2239;}i:109;a:3:{i:0;s:12:"section_edit";i:1;a:4:{i:0;i:1137;i:1;i:2238;i:2;i:3;i:3;s:18:"Introdução ao VI";}i:2;i:2239;}i:110;a:3:{i:0;s:6:"header";i:1;a:3:{i:0;s:21:"Introdução do Shell";i:1;i:2;i:2;i:2239;}i:2;i:2239;}i:111;a:3:{i:0;s:12:"section_open";i:1;a:1:{i:0;i:2;}i:2;i:2239;}i:112;a:3:{i:0;s:13:"section_close";i:1;a:0:{}i:2;i:2274;}i:113;a:3:{i:0;s:12:"section_edit";i:1;a:4:{i:0;i:2239;i:1;i:2273;i:2;i:2;i:3;s:21:"Introdução do Shell";}i:2;i:2274;}i:114;a:3:{i:0;s:6:"header";i:1;a:3:{i:0;s:9:"Conceitos";i:1;i:3;i:2;i:2274;}i:2;i:2274;}i:115;a:3:{i:0;s:12:"section_open";i:1;a:1:{i:0;i:3;}i:2;i:2274;}i:116;a:3:{i:0;s:6:"p_open";i:1;a:0:{}i:2;i:2293;}i:117;a:3:{i:0;s:5:"cdata";i:1;a:1:{i:0;s:274:"
O Shell é um programa de Interface de Linha de Comando entre o usuário e o Sistema Operacional. A entrada para este programa é um comando, e a saída é a saída do comando executado. Já vimos vários comandos nas aulas anteriores, hoje estudaremos mais a fundo a Shell";}i:2;i:2294;}i:118;a:3:{i:0;s:7:"p_close";i:1;a:0:{}i:2;i:2568;}i:119;a:3:{i:0;s:13:"section_close";i:1;a:0:{}i:2;i:2570;}i:120;a:3:{i:0;s:12:"section_edit";i:1;a:4:{i:0;i:2274;i:1;i:2569;i:2;i:3;i:3;s:9:"Conceitos";}i:2;i:2570;}i:121;a:3:{i:0;s:6:"header";i:1;a:3:{i:0;s:22:"Variáveis de Ambiente";i:1;i:3;i:2;i:2570;}i:2;i:2570;}i:122;a:3:{i:0;s:12:"section_open";i:1;a:1:{i:0;i:3;}i:2;i:2570;}i:123;a:3:{i:0;s:6:"p_open";i:1;a:0:{}i:2;i:2602;}i:124;a:3:{i:0;s:5:"cdata";i:1;a:1:{i:0;s:176:"
São variáveis como de uma linguagem de programação, mas armazenam informações que são importantes para o uso do shell. Para atribuir um valor a elas, devemos executar:
";}i:2;i:2603;}i:125;a:3:{i:0;s:7:"p_close";i:1;a:0:{}i:2;i:2779;}i:126;a:3:{i:0;s:12:"preformatted";i:1;a:1:{i:0;s:18:"export PS1="teste"";}i:2;i:2779;}i:127;a:3:{i:0;s:6:"p_open";i:1;a:0:{}i:2;i:2779;}i:128;a:3:{i:0;s:5:"cdata";i:1;a:1:{i:0;s:54:"
E para ler o valor delas, utilizamos o operador '$':
";}i:2;i:2801;}i:129;a:3:{i:0;s:7:"p_close";i:1;a:0:{}i:2;i:2855;}i:130;a:3:{i:0;s:12:"preformatted";i:1;a:1:{i:0;s:10:"echo $PATH";}i:2;i:2855;}i:131;a:3:{i:0;s:6:"p_open";i:1;a:0:{}i:2;i:2855;}i:132;a:3:{i:0;s:5:"cdata";i:1;a:1:{i:0;s:68:"
Podemos combinar atribuições e o valor das variáveis livremente!";}i:2;i:2869;}i:133;a:3:{i:0;s:7:"p_close";i:1;a:0:{}i:2;i:2937;}i:134;a:3:{i:0;s:6:"p_open";i:1;a:0:{}i:2;i:2937;}i:135;a:3:{i:0;s:5:"cdata";i:1;a:1:{i:0;s:66:"Estudaremos algumas variáveis importantes para o bom uso do shell";}i:2;i:2939;}i:136;a:3:{i:0;s:7:"p_close";i:1;a:0:{}i:2;i:3005;}i:137;a:3:{i:0;s:13:"section_close";i:1;a:0:{}i:2;i:3007;}i:138;a:3:{i:0;s:6:"header";i:1;a:3:{i:0;s:4:"PATH";i:1;i:4;i:2;i:3007;}i:2;i:3007;}i:139;a:3:{i:0;s:12:"section_open";i:1;a:1:{i:0;i:4;}i:2;i:3007;}i:140;a:3:{i:0;s:6:"p_open";i:1;a:0:{}i:2;i:3019;}i:141;a:3:{i:0;s:5:"cdata";i:1;a:1:{i:0;s:137:"
O PATH contém o local do sistema de arquivos onde o shell irá procurar pelos arquivos executáveis. Por exemplo, quando você digita:
";}i:2;i:3020;}i:142;a:3:{i:0;s:7:"p_close";i:1;a:0:{}i:2;i:3157;}i:143;a:3:{i:0;s:12:"preformatted";i:1;a:1:{i:0;s:20:"$ cat foo | grep bar";}i:2;i:3157;}i:144;a:3:{i:0;s:6:"p_open";i:1;a:0:{}i:2;i:3157;}i:145;a:3:{i:0;s:5:"cdata";i:1;a:1:{i:0;s:83:"
O shell procura pelo programa cat nos diretórios especificados na variável PATH.";}i:2;i:3181;}i:146;a:3:{i:0;s:7:"p_close";i:1;a:0:{}i:2;i:3264;}i:147;a:3:{i:0;s:6:"p_open";i:1;a:0:{}i:2;i:3264;}i:148;a:3:{i:0;s:11:"strong_open";i:1;a:0:{}i:2;i:3266;}i:149;a:3:{i:0;s:5:"cdata";i:1;a:1:{i:0;s:12:"Exercício 2";}i:2;i:3268;}i:150;a:3:{i:0;s:12:"strong_close";i:1;a:0:{}i:2;i:3280;}i:151;a:3:{i:0;s:5:"cdata";i:1;a:1:{i:0;s:86:": procure nos diretórios especificados pela variável PATH pelos programas cat e grep";}i:2;i:3282;}i:152;a:3:{i:0;s:7:"p_close";i:1;a:0:{}i:2;i:3368;}i:153;a:3:{i:0;s:13:"section_close";i:1;a:0:{}i:2;i:3370;}i:154;a:3:{i:0;s:6:"header";i:1;a:3:{i:0;s:5:"SHELL";i:1;i:4;i:2;i:3370;}i:2;i:3370;}i:155;a:3:{i:0;s:12:"section_open";i:1;a:1:{i:0;i:4;}i:2;i:3370;}i:156;a:3:{i:0;s:6:"p_open";i:1;a:0:{}i:2;i:3383;}i:157;a:3:{i:0;s:5:"cdata";i:1;a:1:{i:0;s:59:"
Esta variável contém a shell que você está executando.";}i:2;i:3384;}i:158;a:3:{i:0;s:7:"p_close";i:1;a:0:{}i:2;i:3443;}i:159;a:3:{i:0;s:13:"section_close";i:1;a:0:{}i:2;i:3445;}i:160;a:3:{i:0;s:6:"header";i:1;a:3:{i:0;s:4:"USER";i:1;i:4;i:2;i:3445;}i:2;i:3445;}i:161;a:3:{i:0;s:12:"section_open";i:1;a:1:{i:0;i:4;}i:2;i:3445;}i:162;a:3:{i:0;s:6:"p_open";i:1;a:0:{}i:2;i:3457;}i:163;a:3:{i:0;s:5:"cdata";i:1;a:1:{i:0;s:46:"
Esta variável contém o seu nome de usuário";}i:2;i:3458;}i:164;a:3:{i:0;s:7:"p_close";i:1;a:0:{}i:2;i:3504;}i:165;a:3:{i:0;s:6:"p_open";i:1;a:0:{}i:2;i:3504;}i:166;a:3:{i:0;s:11:"strong_open";i:1;a:0:{}i:2;i:3506;}i:167;a:3:{i:0;s:5:"cdata";i:1;a:1:{i:0;s:12:"Exercício 3";}i:2;i:3508;}i:168;a:3:{i:0;s:12:"strong_close";i:1;a:0:{}i:2;i:3520;}i:169;a:3:{i:0;s:5:"cdata";i:1;a:1:{i:0;s:68:": Por que definir esta variável, se já sabemos quem é o usuário?";}i:2;i:3522;}i:170;a:3:{i:0;s:7:"p_close";i:1;a:0:{}i:2;i:3590;}i:171;a:3:{i:0;s:13:"section_close";i:1;a:0:{}i:2;i:3592;}i:172;a:3:{i:0;s:6:"header";i:1;a:3:{i:0;s:3:"PS1";i:1;i:4;i:2;i:3592;}i:2;i:3592;}i:173;a:3:{i:0;s:12:"section_open";i:1;a:1:{i:0;i:4;}i:2;i:3592;}i:174;a:3:{i:0;s:6:"p_open";i:1;a:0:{}i:2;i:3603;}i:175;a:3:{i:0;s:5:"cdata";i:1;a:1:{i:0;s:119:"
Esta variável contém o que é exibido na tela toda vez que o shell aguarda por um comando. Por exemplo, executando:
";}i:2;i:3604;}i:176;a:3:{i:0;s:7:"p_close";i:1;a:0:{}i:2;i:3723;}i:177;a:3:{i:0;s:12:"preformatted";i:1;a:1:{i:0;s:22:"$ export PS1="pet"
pet";}i:2;i:3723;}i:178;a:3:{i:0;s:13:"section_close";i:1;a:0:{}i:2;i:3752;}i:179;a:3:{i:0;s:6:"header";i:1;a:3:{i:0;s:4:"HOME";i:1;i:4;i:2;i:3752;}i:2;i:3752;}i:180;a:3:{i:0;s:12:"section_open";i:1;a:1:{i:0;i:4;}i:2;i:3752;}i:181;a:3:{i:0;s:6:"p_open";i:1;a:0:{}i:2;i:3764;}i:182;a:3:{i:0;s:5:"cdata";i:1;a:1:{i:0;s:92:"
Esta variável contém a localização do seu diretório pessoal. Ela é equivalente ao '~'";}i:2;i:3765;}i:183;a:3:{i:0;s:7:"p_close";i:1;a:0:{}i:2;i:3857;}i:184;a:3:{i:0;s:13:"section_close";i:1;a:0:{}i:2;i:3859;}i:185;a:3:{i:0;s:6:"header";i:1;a:3:{i:0;s:3:"UID";i:1;i:4;i:2;i:3859;}i:2;i:3859;}i:186;a:3:{i:0;s:12:"section_open";i:1;a:1:{i:0;i:4;}i:2;i:3859;}i:187;a:3:{i:0;s:6:"p_open";i:1;a:0:{}i:2;i:3870;}i:188;a:3:{i:0;s:5:"cdata";i:1;a:1:{i:0;s:71:"
Estas variáveis contêm o ID do usuário indicado pela variável USER";}i:2;i:3871;}i:189;a:3:{i:0;s:7:"p_close";i:1;a:0:{}i:2;i:3942;}i:190;a:3:{i:0;s:13:"section_close";i:1;a:0:{}i:2;i:3944;}i:191;a:3:{i:0;s:12:"section_edit";i:1;a:4:{i:0;i:2570;i:1;i:3943;i:2;i:3;i:3;s:22:"Variáveis de Ambiente";}i:2;i:3944;}i:192;a:3:{i:0;s:6:"header";i:1;a:3:{i:0;s:9:"Wildcards";i:1;i:3;i:2;i:3944;}i:2;i:3944;}i:193;a:3:{i:0;s:12:"section_open";i:1;a:1:{i:0;i:3;}i:2;i:3944;}i:194;a:3:{i:0;s:6:"p_open";i:1;a:0:{}i:2;i:3963;}i:195;a:3:{i:0;s:5:"cdata";i:1;a:1:{i:0;s:110:"
Wildcards são uma maneira de executar vários comandos sem precisar digitar. Os wildcards mais comuns são:
";}i:2;i:3964;}i:196;a:3:{i:0;s:7:"p_close";i:1;a:0:{}i:2;i:4074;}i:197;a:3:{i:0;s:10:"table_open";i:1;a:2:{i:0;i:2;i:1;i:8;}i:2;i:4074;}i:198;a:3:{i:0;s:13:"tablerow_open";i:1;a:0:{}i:2;i:4074;}i:199;a:3:{i:0;s:14:"tablecell_open";i:1;a:2:{i:0;i:1;i:1;N;}i:2;i:4074;}i:200;a:3:{i:0;s:5:"cdata";i:1;a:1:{i:0;s:1:" ";}i:2;i:4076;}i:201;a:3:{i:0;s:11:"strong_open";i:1;a:0:{}i:2;i:4077;}i:202;a:3:{i:0;s:5:"cdata";i:1;a:1:{i:0;s:8:"Wildcard";}i:2;i:4079;}i:203;a:3:{i:0;s:12:"strong_close";i:1;a:0:{}i:2;i:4087;}i:204;a:3:{i:0;s:5:"cdata";i:1;a:1:{i:0;s:1:" ";}i:2;i:4089;}i:205;a:3:{i:0;s:15:"tablecell_close";i:1;a:0:{}i:2;i:4090;}i:206;a:3:{i:0;s:14:"tablecell_open";i:1;a:2:{i:0;i:1;i:1;N;}i:2;i:4090;}i:207;a:3:{i:0;s:5:"cdata";i:1;a:1:{i:0;s:1:" ";}i:2;i:4091;}i:208;a:3:{i:0;s:11:"strong_open";i:1;a:0:{}i:2;i:4092;}i:209;a:3:{i:0;s:5:"cdata";i:1;a:1:{i:0;s:7:"Matches";}i:2;i:4094;}i:210;a:3:{i:0;s:12:"strong_close";i:1;a:0:{}i:2;i:4101;}i:211;a:3:{i:0;s:5:"cdata";i:1;a:1:{i:0;s:1:" ";}i:2;i:4103;}i:212;a:3:{i:0;s:15:"tablecell_close";i:1;a:0:{}i:2;i:4104;}i:213;a:3:{i:0;s:14:"tablerow_close";i:1;a:0:{}i:2;i:4105;}i:214;a:3:{i:0;s:13:"tablerow_open";i:1;a:0:{}i:2;i:4105;}i:215;a:3:{i:0;s:14:"tablecell_open";i:1;a:2:{i:0;i:1;i:1;N;}i:2;i:4105;}i:216;a:3:{i:0;s:5:"cdata";i:1;a:1:{i:0;s:3:" * ";}i:2;i:4107;}i:217;a:3:{i:0;s:15:"tablecell_close";i:1;a:0:{}i:2;i:4110;}i:218;a:3:{i:0;s:14:"tablecell_open";i:1;a:2:{i:0;i:1;i:1;N;}i:2;i:4110;}i:219;a:3:{i:0;s:5:"cdata";i:1;a:1:{i:0;s:25:" zero ou mais caracteres ";}i:2;i:4111;}i:220;a:3:{i:0;s:15:"tablecell_close";i:1;a:0:{}i:2;i:4136;}i:221;a:3:{i:0;s:14:"tablerow_close";i:1;a:0:{}i:2;i:4137;}i:222;a:3:{i:0;s:13:"tablerow_open";i:1;a:0:{}i:2;i:4137;}i:223;a:3:{i:0;s:14:"tablecell_open";i:1;a:2:{i:0;i:1;i:1;N;}i:2;i:4137;}i:224;a:3:{i:0;s:5:"cdata";i:1;a:1:{i:0;s:3:" ? ";}i:2;i:4139;}i:225;a:3:{i:0;s:15:"tablecell_close";i:1;a:0:{}i:2;i:4142;}i:226;a:3:{i:0;s:14:"tablecell_open";i:1;a:2:{i:0;i:1;i:1;N;}i:2;i:4142;}i:227;a:3:{i:0;s:5:"cdata";i:1;a:1:{i:0;s:25:" exatamente um carácter ";}i:2;i:4143;}i:228;a:3:{i:0;s:15:"tablecell_close";i:1;a:0:{}i:2;i:4168;}i:229;a:3:{i:0;s:14:"tablerow_close";i:1;a:0:{}i:2;i:4169;}i:230;a:3:{i:0;s:13:"tablerow_open";i:1;a:0:{}i:2;i:4169;}i:231;a:3:{i:0;s:14:"tablecell_open";i:1;a:2:{i:0;i:1;i:1;N;}i:2;i:4169;}i:232;a:3:{i:0;s:5:"cdata";i:1;a:1:{i:0;s:9:" [abcde] ";}i:2;i:4171;}i:233;a:3:{i:0;s:15:"tablecell_close";i:1;a:0:{}i:2;i:4180;}i:234;a:3:{i:0;s:14:"tablecell_open";i:1;a:2:{i:0;i:1;i:1;N;}i:2;i:4180;}i:235;a:3:{i:0;s:5:"cdata";i:1;a:1:{i:0;s:33:" exatamente um carácter listado ";}i:2;i:4181;}i:236;a:3:{i:0;s:15:"tablecell_close";i:1;a:0:{}i:2;i:4214;}i:237;a:3:{i:0;s:14:"tablerow_close";i:1;a:0:{}i:2;i:4215;}i:238;a:3:{i:0;s:13:"tablerow_open";i:1;a:0:{}i:2;i:4215;}i:239;a:3:{i:0;s:14:"tablecell_open";i:1;a:2:{i:0;i:1;i:1;N;}i:2;i:4215;}i:240;a:3:{i:0;s:5:"cdata";i:1;a:1:{i:0;s:7:" [a-e] ";}i:2;i:4217;}i:241;a:3:{i:0;s:15:"tablecell_close";i:1;a:0:{}i:2;i:4224;}i:242;a:3:{i:0;s:14:"tablecell_open";i:1;a:2:{i:0;i:1;i:1;N;}i:2;i:4224;}i:243;a:3:{i:0;s:5:"cdata";i:1;a:1:{i:0;s:46:" exatamente um carácter listado no invervalo ";}i:2;i:4225;}i:244;a:3:{i:0;s:15:"tablecell_close";i:1;a:0:{}i:2;i:4271;}i:245;a:3:{i:0;s:14:"tablerow_close";i:1;a:0:{}i:2;i:4272;}i:246;a:3:{i:0;s:13:"tablerow_open";i:1;a:0:{}i:2;i:4272;}i:247;a:3:{i:0;s:14:"tablecell_open";i:1;a:2:{i:0;i:1;i:1;N;}i:2;i:4272;}i:248;a:3:{i:0;s:5:"cdata";i:1;a:1:{i:0;s:10:" [!abcde] ";}i:2;i:4274;}i:249;a:3:{i:0;s:15:"tablecell_close";i:1;a:0:{}i:2;i:4284;}i:250;a:3:{i:0;s:14:"tablecell_open";i:1;a:2:{i:0;i:1;i:1;N;}i:2;i:4284;}i:251;a:3:{i:0;s:5:"cdata";i:1;a:1:{i:0;s:33:" qualquer carácter não listado ";}i:2;i:4285;}i:252;a:3:{i:0;s:15:"tablecell_close";i:1;a:0:{}i:2;i:4318;}i:253;a:3:{i:0;s:14:"tablerow_close";i:1;a:0:{}i:2;i:4319;}i:254;a:3:{i:0;s:13:"tablerow_open";i:1;a:0:{}i:2;i:4319;}i:255;a:3:{i:0;s:14:"tablecell_open";i:1;a:2:{i:0;i:1;i:1;N;}i:2;i:4319;}i:256;a:3:{i:0;s:5:"cdata";i:1;a:1:{i:0;s:8:" [!a-e] ";}i:2;i:4321;}i:257;a:3:{i:0;s:15:"tablecell_close";i:1;a:0:{}i:2;i:4329;}i:258;a:3:{i:0;s:14:"tablecell_open";i:1;a:2:{i:0;i:1;i:1;N;}i:2;i:4329;}i:259;a:3:{i:0;s:5:"cdata";i:1;a:1:{i:0;s:56:" qualquer carácter que não está listado no intervalo ";}i:2;i:4330;}i:260;a:3:{i:0;s:15:"tablecell_close";i:1;a:0:{}i:2;i:4386;}i:261;a:3:{i:0;s:14:"tablerow_close";i:1;a:0:{}i:2;i:4387;}i:262;a:3:{i:0;s:13:"tablerow_open";i:1;a:0:{}i:2;i:4387;}i:263;a:3:{i:0;s:14:"tablecell_open";i:1;a:2:{i:0;i:1;i:1;N;}i:2;i:4387;}i:264;a:3:{i:0;s:5:"cdata";i:1;a:1:{i:0;s:16:" {debian,linux} ";}i:2;i:4389;}i:265;a:3:{i:0;s:15:"tablecell_close";i:1;a:0:{}i:2;i:4405;}i:266;a:3:{i:0;s:14:"tablecell_open";i:1;a:2:{i:0;i:1;i:1;N;}i:2;i:4405;}i:267;a:3:{i:0;s:5:"cdata";i:1;a:1:{i:0;s:56:" exatamente uma palavra inteira entre as opções dadas ";}i:2;i:4406;}i:268;a:3:{i:0;s:15:"tablecell_close";i:1;a:0:{}i:2;i:4462;}i:269;a:3:{i:0;s:14:"tablerow_close";i:1;a:0:{}i:2;i:4463;}i:270;a:3:{i:0;s:11:"table_close";i:1;a:0:{}i:2;i:4463;}i:271;a:3:{i:0;s:6:"p_open";i:1;a:0:{}i:2;i:4463;}i:272;a:3:{i:0;s:5:"cdata";i:1;a:1:{i:0;s:10:"
Exemplos:";}i:2;i:4464;}i:273;a:3:{i:0;s:7:"p_close";i:1;a:0:{}i:2;i:4474;}i:274;a:3:{i:0;s:6:"p_open";i:1;a:0:{}i:2;i:4474;}i:275;a:3:{i:0;s:5:"cdata";i:1;a:1:{i:0;s:197:"Provavelmente o carácter * é familiar para você, porque é amplamente utilizado em muitos outros lugares além do Linux. Por exemplo, o seguinte comando remove todo arquivo do diretório atual:
";}i:2;i:4476;}i:276;a:3:{i:0;s:7:"p_close";i:1;a:0:{}i:2;i:4673;}i:277;a:3:{i:0;s:12:"preformatted";i:1;a:1:{i:0;s:6:"$ rm *";}i:2;i:4673;}i:278;a:3:{i:0;s:6:"p_open";i:1;a:0:{}i:2;i:4673;}i:279;a:3:{i:0;s:5:"cdata";i:1;a:1:{i:0;s:43:"
O seguinte comando move todos os arquivos ";}i:2;i:4683;}i:280;a:3:{i:0;s:7:"acronym";i:1;a:1:{i:0;s:4:"HTML";}i:2;i:4726;}i:281;a:3:{i:0;s:5:"cdata";i:1;a:1:{i:0;s:20:" que têm a palavra ";}i:2;i:4730;}i:282;a:3:{i:0;s:18:"doublequoteopening";i:1;a:0:{}i:2;i:4750;}i:283;a:3:{i:0;s:5:"cdata";i:1;a:1:{i:0;s:5:"linux";}i:2;i:4751;}i:284;a:3:{i:0;s:18:"doublequoteclosing";i:1;a:0:{}i:2;i:4756;}i:285;a:3:{i:0;s:5:"cdata";i:1;a:1:{i:0;s:70:" nos seus nomes, do diretório atual para um diretório chamado dir1:
";}i:2;i:4757;}i:286;a:3:{i:0;s:7:"p_close";i:1;a:0:{}i:2;i:4827;}i:287;a:3:{i:0;s:12:"preformatted";i:1;a:1:{i:0;s:22:"$ mv *linux*.html dir1";}i:2;i:4827;}i:288;a:3:{i:0;s:6:"p_open";i:1;a:0:{}i:2;i:4827;}i:289;a:3:{i:0;s:5:"cdata";i:1;a:1:{i:0;s:76:"
O seguinte mostra todos os arquivos que começam com um 'd' e terminam com ";}i:2;i:4853;}i:290;a:3:{i:0;s:18:"doublequoteclosing";i:1;a:0:{}i:2;i:4929;}i:291;a:3:{i:0;s:5:"cdata";i:1;a:1:{i:0;s:4:".txt";}i:2;i:4930;}i:292;a:3:{i:0;s:18:"doublequoteclosing";i:1;a:0:{}i:2;i:4934;}i:293;a:3:{i:0;s:5:"cdata";i:1;a:1:{i:0;s:1:"
";}i:2;i:4935;}i:294;a:3:{i:0;s:7:"p_close";i:1;a:0:{}i:2;i:4936;}i:295;a:3:{i:0;s:12:"preformatted";i:1;a:1:{i:0;s:13:"$ less d*.txt";}i:2;i:4936;}i:296;a:3:{i:0;s:6:"p_open";i:1;a:0:{}i:2;i:4936;}i:297;a:3:{i:0;s:5:"cdata";i:1;a:1:{i:0;s:64:"
O seguinte comando remove todos arquivos cujo nome começa com ";}i:2;i:4953;}i:298;a:3:{i:0;s:18:"doublequoteopening";i:1;a:0:{}i:2;i:5017;}i:299;a:3:{i:0;s:5:"cdata";i:1;a:1:{i:0;s:5:"junk.";}i:2;i:5018;}i:300;a:3:{i:0;s:18:"doublequoteclosing";i:1;a:0:{}i:2;i:5023;}i:301;a:3:{i:0;s:5:"cdata";i:1;a:1:{i:0;s:44:", seguindo por exatamente três caracteres:
";}i:2;i:5024;}i:302;a:3:{i:0;s:7:"p_close";i:1;a:0:{}i:2;i:5068;}i:303;a:3:{i:0;s:12:"preformatted";i:1;a:1:{i:0;s:13:"$ rm junk.???";}i:2;i:5068;}i:304;a:3:{i:0;s:6:"p_open";i:1;a:0:{}i:2;i:5068;}i:305;a:3:{i:0;s:5:"cdata";i:1;a:1:{i:0;s:82:"
Com este comando você lista todos arquivos ou diretórios cujo nome começa com ";}i:2;i:5085;}i:306;a:3:{i:0;s:18:"doublequoteopening";i:1;a:0:{}i:2;i:5167;}i:307;a:3:{i:0;s:5:"cdata";i:1;a:1:{i:0;s:3:"hda";}i:2;i:5168;}i:308;a:3:{i:0;s:18:"doublequoteclosing";i:1;a:0:{}i:2;i:5171;}i:309;a:3:{i:0;s:5:"cdata";i:1;a:1:{i:0;s:37:". seguido por exatamente um numeral:
";}i:2;i:5172;}i:310;a:3:{i:0;s:7:"p_close";i:1;a:0:{}i:2;i:5209;}i:311;a:3:{i:0;s:12:"preformatted";i:1;a:1:{i:0;s:13:"$ ls hda[0-9]";}i:2;i:5209;}i:312;a:3:{i:0;s:6:"p_open";i:1;a:0:{}i:2;i:5209;}i:313;a:3:{i:0;s:5:"cdata";i:1;a:1:{i:0;s:99:"
Este lista todos arquivos ou diretórios começando com hda, seguido de exatamente dois numerais:
";}i:2;i:5226;}i:314;a:3:{i:0;s:7:"p_close";i:1;a:0:{}i:2;i:5325;}i:315;a:3:{i:0;s:12:"preformatted";i:1;a:1:{i:0;s:18:"$ ls hda[0-9][0-9]";}i:2;i:5325;}i:316;a:3:{i:0;s:6:"p_open";i:1;a:0:{}i:2;i:5325;}i:317;a:3:{i:0;s:5:"cdata";i:1;a:1:{i:0;s:70:"
O seguinte lista todos arquivos ou diretórios cujo nome começa com ";}i:2;i:5347;}i:318;a:3:{i:0;s:18:"doublequoteopening";i:1;a:0:{}i:2;i:5417;}i:319;a:3:{i:0;s:5:"cdata";i:1;a:1:{i:0;s:2:"hd";}i:2;i:5418;}i:320;a:3:{i:0;s:18:"doublequoteclosing";i:1;a:0:{}i:2;i:5420;}i:321;a:3:{i:0;s:5:"cdata";i:1;a:1:{i:0;s:8:" ou com ";}i:2;i:5421;}i:322;a:3:{i:0;s:18:"doublequoteopening";i:1;a:0:{}i:2;i:5429;}i:323;a:3:{i:0;s:5:"cdata";i:1;a:1:{i:0;s:2:"sd";}i:2;i:5430;}i:324;a:3:{i:0;s:18:"doublequoteclosing";i:1;a:0:{}i:2;i:5432;}i:325;a:3:{i:0;s:5:"cdata";i:1;a:1:{i:0;s:50:", seguido por qualquer carácter entre 'a' e 'c':
";}i:2;i:5433;}i:326;a:3:{i:0;s:7:"p_close";i:1;a:0:{}i:2;i:5483;}i:327;a:3:{i:0;s:12:"preformatted";i:1;a:1:{i:0;s:17:"$ ls {hd,sd}[a-c]";}i:2;i:5483;}i:328;a:3:{i:0;s:6:"p_open";i:1;a:0:{}i:2;i:5483;}i:329;a:3:{i:0;s:5:"cdata";i:1;a:1:{i:0;s:87:"
Este comando copia todos arquivos que começam com letra maiúscula para o diretório ";}i:2;i:5504;}i:330;a:3:{i:0;s:18:"doublequoteopening";i:1;a:0:{}i:2;i:5591;}i:331;a:3:{i:0;s:5:"cdata";i:1;a:1:{i:0;s:4:"dir2";}i:2;i:5592;}i:332;a:3:{i:0;s:18:"doublequoteclosing";i:1;a:0:{}i:2;i:5596;}i:333;a:3:{i:0;s:5:"cdata";i:1;a:1:{i:0;s:1:"
";}i:2;i:5597;}i:334;a:3:{i:0;s:7:"p_close";i:1;a:0:{}i:2;i:5598;}i:335;a:3:{i:0;s:12:"preformatted";i:1;a:1:{i:0;s:16:"$ cp [A-Z]* dir2";}i:2;i:5598;}i:336;a:3:{i:0;s:6:"p_open";i:1;a:0:{}i:2;i:5598;}i:337;a:3:{i:0;s:5:"cdata";i:1;a:1:{i:0;s:72:"
Este deleta todos arquivos que não terminam com 'c', 'e', 'h' ou 'g':
";}i:2;i:5618;}i:338;a:3:{i:0;s:7:"p_close";i:1;a:0:{}i:2;i:5690;}i:339;a:3:{i:0;s:12:"preformatted";i:1;a:1:{i:0;s:13:"$ rm *[!cehg]";}i:2;i:5690;}i:340;a:3:{i:0;s:13:"section_close";i:1;a:0:{}i:2;i:5708;}i:341;a:3:{i:0;s:12:"section_edit";i:1;a:4:{i:0;i:3944;i:1;i:5707;i:2;i:3;i:3;s:9:"Wildcards";}i:2;i:5708;}i:342;a:3:{i:0;s:6:"header";i:1;a:3:{i:0;s:26:"Arquivos de configuração";i:1;i:3;i:2;i:5708;}i:2;i:5708;}i:343;a:3:{i:0;s:12:"section_open";i:1;a:1:{i:0;i:3;}i:2;i:5708;}i:344;a:3:{i:0;s:6:"p_open";i:1;a:0:{}i:2;i:5744;}i:345;a:3:{i:0;s:5:"cdata";i:1;a:1:{i:0;s:146:"
Como dito anteriormente, toda configuração dos sistemas *NIX é feita através de arquivos texto. Trataremos dos mais comuns e básicos abaixo:";}i:2;i:5745;}i:346;a:3:{i:0;s:7:"p_close";i:1;a:0:{}i:2;i:5891;}i:347;a:3:{i:0;s:13:"section_close";i:1;a:0:{}i:2;i:5893;}i:348;a:3:{i:0;s:6:"header";i:1;a:3:{i:0;s:5:"fstab";i:1;i:4;i:2;i:5893;}i:2;i:5893;}i:349;a:3:{i:0;s:12:"section_open";i:1;a:1:{i:0;i:4;}i:2;i:5893;}i:350;a:3:{i:0;s:6:"p_open";i:1;a:0:{}i:2;i:5906;}i:351;a:3:{i:0;s:5:"cdata";i:1;a:1:{i:0;s:125:"
O fstab é onde reside as informações das partições que serão montadas automaticamente com a inicialização do sistema";}i:2;i:5907;}i:352;a:3:{i:0;s:7:"p_close";i:1;a:0:{}i:2;i:6032;}i:353;a:3:{i:0;s:13:"section_close";i:1;a:0:{}i:2;i:6034;}i:354;a:3:{i:0;s:6:"header";i:1;a:3:{i:0;s:4:"mtab";i:1;i:4;i:2;i:6034;}i:2;i:6034;}i:355;a:3:{i:0;s:12:"section_open";i:1;a:1:{i:0;i:4;}i:2;i:6034;}i:356;a:3:{i:0;s:6:"p_open";i:1;a:0:{}i:2;i:6046;}i:357;a:3:{i:0;s:5:"cdata";i:1;a:1:{i:0;s:66:"
O mtab contém as informações sobre as partições já montadas";}i:2;i:6047;}i:358;a:3:{i:0;s:7:"p_close";i:1;a:0:{}i:2;i:6113;}i:359;a:3:{i:0;s:13:"section_close";i:1;a:0:{}i:2;i:6115;}i:360;a:3:{i:0;s:6:"header";i:1;a:3:{i:0;s:6:"passwd";i:1;i:4;i:2;i:6115;}i:2;i:6115;}i:361;a:3:{i:0;s:12:"section_open";i:1;a:1:{i:0;i:4;}i:2;i:6115;}i:362;a:3:{i:0;s:6:"p_open";i:1;a:0:{}i:2;i:6129;}i:363;a:3:{i:0;s:5:"cdata";i:1;a:1:{i:0;s:136:"
O passwd é onde reside as informações sobre um usuário, como nome de usuário, dados pessoais, senha e shell que o usuário utiliza";}i:2;i:6130;}i:364;a:3:{i:0;s:7:"p_close";i:1;a:0:{}i:2;i:6266;}i:365;a:3:{i:0;s:13:"section_close";i:1;a:0:{}i:2;i:6268;}i:366;a:3:{i:0;s:6:"header";i:1;a:3:{i:0;s:6:"shadow";i:1;i:4;i:2;i:6268;}i:2;i:6268;}i:367;a:3:{i:0;s:12:"section_open";i:1;a:1:{i:0;i:4;}i:2;i:6268;}i:368;a:3:{i:0;s:6:"p_open";i:1;a:0:{}i:2;i:6282;}i:369;a:3:{i:0;s:5:"cdata";i:1;a:1:{i:0;s:48:"
O shadow é onde reside as senhas dos usuários";}i:2;i:6283;}i:370;a:3:{i:0;s:7:"p_close";i:1;a:0:{}i:2;i:6331;}i:371;a:3:{i:0;s:13:"section_close";i:1;a:0:{}i:2;i:6333;}i:372;a:3:{i:0;s:6:"header";i:1;a:3:{i:0;s:5:"group";i:1;i:4;i:2;i:6333;}i:2;i:6333;}i:373;a:3:{i:0;s:12:"section_open";i:1;a:1:{i:0;i:4;}i:2;i:6333;}i:374;a:3:{i:0;s:6:"p_open";i:1;a:0:{}i:2;i:6346;}i:375;a:3:{i:0;s:5:"cdata";i:1;a:1:{i:0;s:94:"
O group é onde reside as informações sobre os grupos e os usuários que fazem parte deles.";}i:2;i:6347;}i:376;a:3:{i:0;s:7:"p_close";i:1;a:0:{}i:2;i:6441;}i:377;a:3:{i:0;s:13:"section_close";i:1;a:0:{}i:2;i:6443;}i:378;a:3:{i:0;s:6:"header";i:1;a:3:{i:0;s:9:"grub.conf";i:1;i:4;i:2;i:6443;}i:2;i:6443;}i:379;a:3:{i:0;s:12:"section_open";i:1;a:1:{i:0;i:4;}i:2;i:6443;}i:380;a:3:{i:0;s:6:"p_open";i:1;a:0:{}i:2;i:6460;}i:381;a:3:{i:0;s:5:"cdata";i:1;a:1:{i:0;s:86:"
O grub.conf contém as informações das partições de boot e dos kernels incluídos";}i:2;i:6461;}i:382;a:3:{i:0;s:7:"p_close";i:1;a:0:{}i:2;i:6547;}i:383;a:3:{i:0;s:13:"section_close";i:1;a:0:{}i:2;i:6549;}i:384;a:3:{i:0;s:6:"header";i:1;a:3:{i:0;s:12:"sources.list";i:1;i:4;i:2;i:6549;}i:2;i:6549;}i:385;a:3:{i:0;s:12:"section_open";i:1;a:1:{i:0;i:4;}i:2;i:6549;}i:386;a:3:{i:0;s:13:"section_close";i:1;a:0:{}i:2;i:6571;}i:387;a:3:{i:0;s:12:"section_edit";i:1;a:4:{i:0;i:5708;i:1;i:6570;i:2;i:3;i:3;s:26:"Arquivos de configuração";}i:2;i:6571;}i:388;a:3:{i:0;s:6:"header";i:1;a:3:{i:0;s:22:"Gerência de Usuários";i:1;i:3;i:2;i:6571;}i:2;i:6571;}i:389;a:3:{i:0;s:12:"section_open";i:1;a:1:{i:0;i:3;}i:2;i:6571;}i:390;a:3:{i:0;s:6:"p_open";i:1;a:0:{}i:2;i:6603;}i:391;a:3:{i:0;s:5:"cdata";i:1;a:1:{i:0;s:96:"
adduser, addgroup, passwd, newgrp, userdel, groupdel, lastlog, last, id, logname, users, groups";}i:2;i:6604;}i:392;a:3:{i:0;s:7:"p_close";i:1;a:0:{}i:2;i:6700;}i:393;a:3:{i:0;s:13:"section_close";i:1;a:0:{}i:2;i:6701;}i:394;a:3:{i:0;s:12:"section_edit";i:1;a:4:{i:0;i:6571;i:1;i:0;i:2;i:3;i:3;s:22:"Gerência de Usuários";}i:2;i:6701;}i:395;a:3:{i:0;s:12:"document_end";i:1;a:0:{}i:2;i:6701;}}