a:277:{i:0;a:3:{i:0;s:14:"document_start";i:1;a:0:{}i:2;i:0;}i:1;a:3:{i:0;s:6:"p_open";i:1;a:0:{}i:2;i:0;}i:2;a:3:{i:0;s:7:"p_close";i:1;a:0:{}i:2;i:1;}i:3;a:3:{i:0;s:12:"section_edit";i:1;a:4:{i:0;i:-1;i:1;i:0;i:2;i:1;i:3;s:0:"";}i:2;i:1;}i:4;a:3:{i:0;s:6:"header";i:1;a:3:{i:0;s:8:"Servidor";i:1;i:1;i:2;i:1;}i:2;i:1;}i:5;a:3:{i:0;s:12:"section_open";i:1;a:1:{i:0;i:1;}i:2;i:1;}i:6;a:3:{i:0;s:6:"p_open";i:1;a:0:{}i:2;i:23;}i:7;a:3:{i:0;s:5:"cdata";i:1;a:1:{i:0;s:175:"
O servidor atualmente está rodando o Ubuntu Linux Server 8.04 LTS, com a instalação LAMP. Para aprender como instalar a versão servidor, eis uma referência interessante:";}i:2;i:24;}i:8;a:3:{i:0;s:7:"p_close";i:1;a:0:{}i:2;i:199;}i:9;a:3:{i:0;s:6:"p_open";i:1;a:0:{}i:2;i:199;}i:10;a:3:{i:0;s:12:"externallink";i:1;a:2:{i:0;s:80:"http://www.debianadmin.com/ubuntu-lamp-server-installation-with-screenshots.html";i:1;s:48:"Ubuntu LAMP Server Installation With Screenshots";}i:2;i:201;}i:11;a:3:{i:0;s:5:"cdata";i:1;a:1:{i:0;s:29:" OBS.: A parte final sobre o ";}i:2;i:334;}i:12;a:3:{i:0;s:7:"acronym";i:1;a:1:{i:0;s:3:"DNS";}i:2;i:363;}i:13;a:3:{i:0;s:5:"cdata";i:1;a:1:{i:0;s:57:" deve ser ignorada, uma vez que utilizaremos os servidor ";}i:2;i:366;}i:14;a:3:{i:0;s:7:"acronym";i:1;a:1:{i:0;s:3:"DNS";}i:2;i:423;}i:15;a:3:{i:0;s:5:"cdata";i:1;a:1:{i:0;s:94:" do instituto. Para tanto, devemos inserir a linha abaixo no arquivo /etc/dhcp3/dhclient.conf
";}i:2;i:426;}i:16;a:3:{i:0;s:7:"p_close";i:1;a:0:{}i:2;i:520;}i:17;a:3:{i:0;s:12:"preformatted";i:1;a:1:{i:0;s:21:"send host-name "pet";";}i:2;i:520;}i:18;a:3:{i:0;s:6:"p_open";i:1;a:0:{}i:2;i:520;}i:19;a:3:{i:0;s:5:"cdata";i:1;a:1:{i:0;s:46:"
Escolhemos o Ubuntu pelas seguintes razões:
";}i:2;i:545;}i:20;a:3:{i:0;s:7:"p_close";i:1;a:0:{}i:2;i:591;}i:21;a:3:{i:0;s:10:"listo_open";i:1;a:0:{}i:2;i:591;}i:22;a:3:{i:0;s:13:"listitem_open";i:1;a:1:{i:0;i:1;}i:2;i:591;}i:23;a:3:{i:0;s:16:"listcontent_open";i:1;a:0:{}i:2;i:591;}i:24;a:3:{i:0;s:5:"cdata";i:1;a:1:{i:0;s:19:" Facilidade de uso;";}i:2;i:595;}i:25;a:3:{i:0;s:17:"listcontent_close";i:1;a:0:{}i:2;i:614;}i:26;a:3:{i:0;s:14:"listitem_close";i:1;a:0:{}i:2;i:614;}i:27;a:3:{i:0;s:13:"listitem_open";i:1;a:1:{i:0;i:1;}i:2;i:614;}i:28;a:3:{i:0;s:16:"listcontent_open";i:1;a:0:{}i:2;i:614;}i:29;a:3:{i:0;s:5:"cdata";i:1;a:1:{i:0;s:57:" Gerenciamento de pacotes (em contraste com o Slackware);";}i:2;i:618;}i:30;a:3:{i:0;s:17:"listcontent_close";i:1;a:0:{}i:2;i:675;}i:31;a:3:{i:0;s:14:"listitem_close";i:1;a:0:{}i:2;i:675;}i:32;a:3:{i:0;s:13:"listitem_open";i:1;a:1:{i:0;i:1;}i:2;i:675;}i:33;a:3:{i:0;s:16:"listcontent_open";i:1;a:0:{}i:2;i:675;}i:34;a:3:{i:0;s:5:"cdata";i:1;a:1:{i:0;s:19:" Suporte até 2011;";}i:2;i:679;}i:35;a:3:{i:0;s:17:"listcontent_close";i:1;a:0:{}i:2;i:698;}i:36;a:3:{i:0;s:14:"listitem_close";i:1;a:0:{}i:2;i:698;}i:37;a:3:{i:0;s:13:"listitem_open";i:1;a:1:{i:0;i:1;}i:2;i:698;}i:38;a:3:{i:0;s:16:"listcontent_open";i:1;a:0:{}i:2;i:698;}i:39;a:3:{i:0;s:5:"cdata";i:1;a:1:{i:0;s:69:" Não é necessário compilar os pacotes (em contraste com o Gentoo);";}i:2;i:702;}i:40;a:3:{i:0;s:17:"listcontent_close";i:1;a:0:{}i:2;i:771;}i:41;a:3:{i:0;s:14:"listitem_close";i:1;a:0:{}i:2;i:771;}i:42;a:3:{i:0;s:13:"listitem_open";i:1;a:1:{i:0;i:1;}i:2;i:771;}i:43;a:3:{i:0;s:16:"listcontent_open";i:1;a:0:{}i:2;i:771;}i:44;a:3:{i:0;s:5:"cdata";i:1;a:1:{i:0;s:25:" Ampla documentação no ";}i:2;i:775;}i:45;a:3:{i:0;s:12:"externallink";i:1;a:2:{i:0;s:53:"https://help.ubuntu.com/8.04/serverguide/C/index.html";i:1;s:12:"site oficial";}i:2;i:800;}i:46;a:3:{i:0;s:5:"cdata";i:1;a:1:{i:0;s:5:", no ";}i:2;i:870;}i:47;a:3:{i:0;s:12:"externallink";i:1;a:2:{i:0;s:23:"https://wiki.ubuntu.com";i:1;s:4:"Wiki";}i:2;i:875;}i:48;a:3:{i:0;s:5:"cdata";i:1;a:1:{i:0;s:7:", e no ";}i:2;i:907;}i:49;a:3:{i:0;s:12:"externallink";i:1;a:2:{i:0;s:24:"http://ubuntuforums.org/";i:1;s:6:"fórum";}i:2;i:914;}i:50;a:3:{i:0;s:5:"cdata";i:1;a:1:{i:0;s:1:";";}i:2;i:949;}i:51;a:3:{i:0;s:17:"listcontent_close";i:1;a:0:{}i:2;i:950;}i:52;a:3:{i:0;s:14:"listitem_close";i:1;a:0:{}i:2;i:950;}i:53;a:3:{i:0;s:13:"listitem_open";i:1;a:1:{i:0;i:1;}i:2;i:950;}i:54;a:3:{i:0;s:16:"listcontent_open";i:1;a:0:{}i:2;i:950;}i:55;a:3:{i:0;s:5:"cdata";i:1;a:1:{i:0;s:32:" Disponibilidade de suporte pago";}i:2;i:954;}i:56;a:3:{i:0;s:17:"listcontent_close";i:1;a:0:{}i:2;i:986;}i:57;a:3:{i:0;s:14:"listitem_close";i:1;a:0:{}i:2;i:986;}i:58;a:3:{i:0;s:11:"listo_close";i:1;a:0:{}i:2;i:986;}i:59;a:3:{i:0;s:6:"p_open";i:1;a:0:{}i:2;i:986;}i:60;a:3:{i:0;s:5:"cdata";i:1;a:1:{i:0;s:50:"
O servidor precisa rodar os seguintes programas:
";}i:2;i:987;}i:61;a:3:{i:0;s:7:"p_close";i:1;a:0:{}i:2;i:1037;}i:62;a:3:{i:0;s:10:"listu_open";i:1;a:0:{}i:2;i:1037;}i:63;a:3:{i:0;s:13:"listitem_open";i:1;a:1:{i:0;i:1;}i:2;i:1037;}i:64;a:3:{i:0;s:16:"listcontent_open";i:1;a:0:{}i:2;i:1037;}i:65;a:3:{i:0;s:5:"cdata";i:1;a:1:{i:0;s:9:" Apache 2";}i:2;i:1041;}i:66;a:3:{i:0;s:17:"listcontent_close";i:1;a:0:{}i:2;i:1050;}i:67;a:3:{i:0;s:14:"listitem_close";i:1;a:0:{}i:2;i:1050;}i:68;a:3:{i:0;s:13:"listitem_open";i:1;a:1:{i:0;i:1;}i:2;i:1050;}i:69;a:3:{i:0;s:16:"listcontent_open";i:1;a:0:{}i:2;i:1050;}i:70;a:3:{i:0;s:5:"cdata";i:1;a:1:{i:0;s:6:" MySQL";}i:2;i:1054;}i:71;a:3:{i:0;s:17:"listcontent_close";i:1;a:0:{}i:2;i:1060;}i:72;a:3:{i:0;s:14:"listitem_close";i:1;a:0:{}i:2;i:1060;}i:73;a:3:{i:0;s:13:"listitem_open";i:1;a:1:{i:0;i:1;}i:2;i:1060;}i:74;a:3:{i:0;s:16:"listcontent_open";i:1;a:0:{}i:2;i:1060;}i:75;a:3:{i:0;s:5:"cdata";i:1;a:1:{i:0;s:1:" ";}i:2;i:1064;}i:76;a:3:{i:0;s:7:"acronym";i:1;a:1:{i:0;s:3:"PHP";}i:2;i:1065;}i:77;a:3:{i:0;s:17:"listcontent_close";i:1;a:0:{}i:2;i:1068;}i:78;a:3:{i:0;s:14:"listitem_close";i:1;a:0:{}i:2;i:1068;}i:79;a:3:{i:0;s:13:"listitem_open";i:1;a:1:{i:0;i:1;}i:2;i:1068;}i:80;a:3:{i:0;s:16:"listcontent_open";i:1;a:0:{}i:2;i:1068;}i:81;a:3:{i:0;s:5:"cdata";i:1;a:1:{i:0;s:9:" OpenLDAP";}i:2;i:1072;}i:82;a:3:{i:0;s:17:"listcontent_close";i:1;a:0:{}i:2;i:1081;}i:83;a:3:{i:0;s:14:"listitem_close";i:1;a:0:{}i:2;i:1081;}i:84;a:3:{i:0;s:13:"listitem_open";i:1;a:1:{i:0;i:1;}i:2;i:1081;}i:85;a:3:{i:0;s:16:"listcontent_open";i:1;a:0:{}i:2;i:1081;}i:86;a:3:{i:0;s:5:"cdata";i:1;a:1:{i:0;s:4:" NFS";}i:2;i:1085;}i:87;a:3:{i:0;s:17:"listcontent_close";i:1;a:0:{}i:2;i:1089;}i:88;a:3:{i:0;s:14:"listitem_close";i:1;a:0:{}i:2;i:1089;}i:89;a:3:{i:0;s:13:"listitem_open";i:1;a:1:{i:0;i:1;}i:2;i:1089;}i:90;a:3:{i:0;s:16:"listcontent_open";i:1;a:0:{}i:2;i:1089;}i:91;a:3:{i:0;s:5:"cdata";i:1;a:1:{i:0;s:6:" Samba";}i:2;i:1093;}i:92;a:3:{i:0;s:17:"listcontent_close";i:1;a:0:{}i:2;i:1099;}i:93;a:3:{i:0;s:14:"listitem_close";i:1;a:0:{}i:2;i:1099;}i:94;a:3:{i:0;s:13:"listitem_open";i:1;a:1:{i:0;i:1;}i:2;i:1099;}i:95;a:3:{i:0;s:16:"listcontent_open";i:1;a:0:{}i:2;i:1099;}i:96;a:3:{i:0;s:5:"cdata";i:1;a:1:{i:0;s:11:" Subversion";}i:2;i:1103;}i:97;a:3:{i:0;s:17:"listcontent_close";i:1;a:0:{}i:2;i:1114;}i:98;a:3:{i:0;s:14:"listitem_close";i:1;a:0:{}i:2;i:1114;}i:99;a:3:{i:0;s:13:"listitem_open";i:1;a:1:{i:0;i:1;}i:2;i:1114;}i:100;a:3:{i:0;s:16:"listcontent_open";i:1;a:0:{}i:2;i:1114;}i:101;a:3:{i:0;s:5:"cdata";i:1;a:1:{i:0;s:5:" Trac";}i:2;i:1118;}i:102;a:3:{i:0;s:17:"listcontent_close";i:1;a:0:{}i:2;i:1123;}i:103;a:3:{i:0;s:14:"listitem_close";i:1;a:0:{}i:2;i:1123;}i:104;a:3:{i:0;s:11:"listu_close";i:1;a:0:{}i:2;i:1123;}i:105;a:3:{i:0;s:13:"section_close";i:1;a:0:{}i:2;i:1125;}i:106;a:3:{i:0;s:12:"section_edit";i:1;a:4:{i:0;i:1;i:1;i:1124;i:2;i:1;i:3;s:8:"Servidor";}i:2;i:1125;}i:107;a:3:{i:0;s:6:"header";i:1;a:3:{i:0;s:11:"Sobre o DNS";i:1;i:3;i:2;i:1125;}i:2;i:1125;}i:108;a:3:{i:0;s:12:"section_open";i:1;a:1:{i:0;i:3;}i:2;i:1125;}i:109;a:3:{i:0;s:6:"p_open";i:1;a:0:{}i:2;i:1146;}i:110;a:3:{i:0;s:5:"cdata";i:1;a:1:{i:0;s:1:"
";}i:2;i:1147;}i:111;a:3:{i:0;s:7:"acronym";i:1;a:1:{i:0;s:3:"DNS";}i:2;i:1148;}i:112;a:3:{i:0;s:5:"cdata";i:1;a:1:{i:0;s:83:" significa Domain Name Server. Basicamente é uma associação entre um nome (como ";}i:2;i:1151;}i:113;a:3:{i:0;s:18:"doublequoteopening";i:1;a:0:{}i:2;i:1234;}i:114;a:3:{i:0;s:5:"cdata";i:1;a:1:{i:0;s:3:"pet";}i:2;i:1235;}i:115;a:3:{i:0;s:18:"doublequoteclosing";i:1;a:0:{}i:2;i:1238;}i:116;a:3:{i:0;s:5:"cdata";i:1;a:1:{i:0;s:57:") e um endereço IP (como 143.54.12.114). Um servidor de ";}i:2;i:1239;}i:117;a:3:{i:0;s:7:"acronym";i:1;a:1:{i:0;s:3:"DNS";}i:2;i:1296;}i:118;a:3:{i:0;s:5:"cdata";i:1;a:1:{i:0;s:141:" é um computador que será consultado para descobrir os IPs associados com os nomes. Portanto, quando você digita no navegador o endereço ";}i:2;i:1299;}i:119;a:3:{i:0;s:18:"doublequoteopening";i:1;a:0:{}i:2;i:1440;}i:120;a:3:{i:0;s:5:"cdata";i:1;a:1:{i:0;s:3:"pet";}i:2;i:1441;}i:121;a:3:{i:0;s:18:"doublequoteclosing";i:1;a:0:{}i:2;i:1444;}i:122;a:3:{i:0;s:5:"cdata";i:1;a:1:{i:0;s:32:", ele irá consultar o servidor ";}i:2;i:1445;}i:123;a:3:{i:0;s:7:"acronym";i:1;a:1:{i:0;s:3:"DNS";}i:2;i:1477;}i:124;a:3:{i:0;s:5:"cdata";i:1;a:1:{i:0;s:44:" para descobrir qual o IP associado ao nome ";}i:2;i:1480;}i:125;a:3:{i:0;s:18:"doublequoteopening";i:1;a:0:{}i:2;i:1524;}i:126;a:3:{i:0;s:5:"cdata";i:1;a:1:{i:0;s:3:"pet";}i:2;i:1525;}i:127;a:3:{i:0;s:18:"doublequoteclosing";i:1;a:0:{}i:2;i:1528;}i:128;a:3:{i:0;s:5:"cdata";i:1;a:1:{i:0;s:161:", e então iniciará uma conexão com este IP. O serviço é feito automaticamente se foi configurado o arquivo /etc/dhcp3/dhclient.conf como especificado acima.";}i:2;i:1529;}i:129;a:3:{i:0;s:7:"p_close";i:1;a:0:{}i:2;i:1690;}i:130;a:3:{i:0;s:13:"section_close";i:1;a:0:{}i:2;i:1692;}i:131;a:3:{i:0;s:12:"section_edit";i:1;a:4:{i:0;i:1125;i:1;i:1691;i:2;i:3;i:3;s:11:"Sobre o DNS";}i:2;i:1692;}i:132;a:3:{i:0;s:6:"header";i:1;a:3:{i:0;s:33:"Habilitando repositótio Universe";i:1;i:3;i:2;i:1692;}i:2;i:1692;}i:133;a:3:{i:0;s:12:"section_open";i:1;a:1:{i:0;i:3;}i:2;i:1692;}i:134;a:3:{i:0;s:6:"p_open";i:1;a:0:{}i:2;i:1735;}i:135;a:3:{i:0;s:5:"cdata";i:1;a:1:{i:0;s:188:"
Para podermos instalar o trac utilizando o apt-get, é necessário habilitarmos os repositórios do Universe. Para tanto, editamos o arquivo /etc/apt/sources.list com o seguinte comando:
";}i:2;i:1736;}i:136;a:3:{i:0;s:7:"p_close";i:1;a:0:{}i:2;i:1924;}i:137;a:3:{i:0;s:12:"preformatted";i:1;a:1:{i:0;s:30:"sudo vim /etc/apt/sources.list";}i:2;i:1924;}i:138;a:3:{i:0;s:6:"p_open";i:1;a:0:{}i:2;i:1924;}i:139;a:3:{i:0;s:5:"cdata";i:1;a:1:{i:0;s:45:"
Precisamos descomentar as seguintes linhas:
";}i:2;i:1958;}i:140;a:3:{i:0;s:7:"p_close";i:1;a:0:{}i:2;i:2003;}i:141;a:3:{i:0;s:12:"preformatted";i:1;a:1:{i:0;s:114:"deb http://br.archive.ubuntu.com/ubuntu/ hardy universe
deb-src http://br.archive.ubuntu.com/ubuntu hardy universe";}i:2;i:2003;}i:142;a:3:{i:0;s:6:"p_open";i:1;a:0:{}i:2;i:2003;}i:143;a:3:{i:0;s:5:"cdata";i:1;a:1:{i:0;s:63:"
Se desejar, os demais repositorórios podem ser descomentados.";}i:2;i:2123;}i:144;a:3:{i:0;s:7:"p_close";i:1;a:0:{}i:2;i:2186;}i:145;a:3:{i:0;s:13:"section_close";i:1;a:0:{}i:2;i:2188;}i:146;a:3:{i:0;s:12:"section_edit";i:1;a:4:{i:0;i:1692;i:1;i:2187;i:2;i:3;i:3;s:33:"Habilitando repositótio Universe";}i:2;i:2188;}i:147;a:3:{i:0;s:6:"header";i:1;a:3:{i:0;s:23:"Instalação Subversion";i:1;i:3;i:2;i:2188;}i:2;i:2188;}i:148;a:3:{i:0;s:12:"section_open";i:1;a:1:{i:0;i:3;}i:2;i:2188;}i:149;a:3:{i:0;s:10:"listu_open";i:1;a:0:{}i:2;i:2222;}i:150;a:3:{i:0;s:13:"listitem_open";i:1;a:1:{i:0;i:1;}i:2;i:2222;}i:151;a:3:{i:0;s:16:"listcontent_open";i:1;a:0:{}i:2;i:2222;}i:152;a:3:{i:0;s:5:"cdata";i:1;a:1:{i:0;s:1:" ";}i:2;i:2226;}i:153;a:3:{i:0;s:12:"internallink";i:1;a:2:{i:0;s:22:"/trac/wiki/install_svn";i:1;s:12:"Instalação";}i:2;i:2227;}i:154;a:3:{i:0;s:5:"cdata";i:1;a:1:{i:0;s:30:" - Há tempo não é utilizado";}i:2;i:2266;}i:155;a:3:{i:0;s:17:"listcontent_close";i:1;a:0:{}i:2;i:2296;}i:156;a:3:{i:0;s:14:"listitem_close";i:1;a:0:{}i:2;i:2296;}i:157;a:3:{i:0;s:11:"listu_close";i:1;a:0:{}i:2;i:2296;}i:158;a:3:{i:0;s:13:"section_close";i:1;a:0:{}i:2;i:2298;}i:159;a:3:{i:0;s:12:"section_edit";i:1;a:4:{i:0;i:2188;i:1;i:2297;i:2;i:3;i:3;s:23:"Instalação Subversion";}i:2;i:2298;}i:160;a:3:{i:0;s:6:"header";i:1;a:3:{i:0;s:17:"Instalação LDAP";i:1;i:3;i:2;i:2298;}i:2;i:2298;}i:161;a:3:{i:0;s:12:"section_open";i:1;a:1:{i:0;i:3;}i:2;i:2298;}i:162;a:3:{i:0;s:10:"listu_open";i:1;a:0:{}i:2;i:2326;}i:163;a:3:{i:0;s:13:"listitem_open";i:1;a:1:{i:0;i:1;}i:2;i:2326;}i:164;a:3:{i:0;s:16:"listcontent_open";i:1;a:0:{}i:2;i:2326;}i:165;a:3:{i:0;s:5:"cdata";i:1;a:1:{i:0;s:1:" ";}i:2;i:2330;}i:166;a:3:{i:0;s:12:"internallink";i:1;a:2:{i:0;s:23:"/trac/wiki/install_ldap";i:1;s:12:"Instalação";}i:2;i:2331;}i:167;a:3:{i:0;s:5:"cdata";i:1;a:1:{i:0;s:31:" - Há tempos não é utilizado";}i:2;i:2371;}i:168;a:3:{i:0;s:17:"listcontent_close";i:1;a:0:{}i:2;i:2402;}i:169;a:3:{i:0;s:14:"listitem_close";i:1;a:0:{}i:2;i:2402;}i:170;a:3:{i:0;s:11:"listu_close";i:1;a:0:{}i:2;i:2402;}i:171;a:3:{i:0;s:13:"section_close";i:1;a:0:{}i:2;i:2404;}i:172;a:3:{i:0;s:12:"section_edit";i:1;a:4:{i:0;i:2298;i:1;i:2403;i:2;i:3;i:3;s:17:"Instalação LDAP";}i:2;i:2404;}i:173;a:3:{i:0;s:6:"header";i:1;a:3:{i:0;s:25:"Instalação Servidor NFS";i:1;i:3;i:2;i:2404;}i:2;i:2404;}i:174;a:3:{i:0;s:12:"section_open";i:1;a:1:{i:0;i:3;}i:2;i:2404;}i:175;a:3:{i:0;s:6:"p_open";i:1;a:0:{}i:2;i:2439;}i:176;a:3:{i:0;s:5:"cdata";i:1;a:1:{i:0;s:44:"
Para instalar o NFS, executamos o comando:
";}i:2;i:2440;}i:177;a:3:{i:0;s:7:"p_close";i:1;a:0:{}i:2;i:2484;}i:178;a:3:{i:0;s:12:"preformatted";i:1;a:1:{i:0;s:68:"sudo apt-get install portmap nfs-kernel-server nfs-common nfs-server";}i:2;i:2484;}i:179;a:3:{i:0;s:6:"p_open";i:1;a:0:{}i:2;i:2484;}i:180;a:3:{i:0;s:5:"cdata";i:1;a:1:{i:0;s:87:"
Ele é configurado através do arquivo /etc/exports. Adicionamos as seguintes linhas:
";}i:2;i:2556;}i:181;a:3:{i:0;s:7:"p_close";i:1;a:0:{}i:2;i:2643;}i:182;a:3:{i:0;s:12:"preformatted";i:1;a:1:{i:0;s:102:"/pet-docs *(rw,sync,no_root_squash)
/users *(rw,sync,no_root_squash)
/grupos *(rw,sync,no_root_squash)";}i:2;i:2643;}i:183;a:3:{i:0;s:6:"p_open";i:1;a:0:{}i:2;i:2643;}i:184;a:3:{i:0;s:5:"cdata";i:1;a:1:{i:0;s:44:"
Como montar um diretório através do NFS:
";}i:2;i:2753;}i:185;a:3:{i:0;s:7:"p_close";i:1;a:0:{}i:2;i:2797;}i:186;a:3:{i:0;s:12:"preformatted";i:1;a:1:{i:0;s:54:"sudo mount -t nfs IP(ou DNS):/pet-docs /media/pet-docs";}i:2;i:2797;}i:187;a:3:{i:0;s:13:"section_close";i:1;a:0:{}i:2;i:2856;}i:188;a:3:{i:0;s:12:"section_edit";i:1;a:4:{i:0;i:2404;i:1;i:2855;i:2;i:3;i:3;s:25:"Instalação Servidor NFS";}i:2;i:2856;}i:189;a:3:{i:0;s:6:"header";i:1;a:3:{i:0;s:18:"Instalação Samba";i:1;i:3;i:2;i:2856;}i:2;i:2856;}i:190;a:3:{i:0;s:12:"section_open";i:1;a:1:{i:0;i:3;}i:2;i:2856;}i:191;a:3:{i:0;s:10:"listu_open";i:1;a:0:{}i:2;i:2885;}i:192;a:3:{i:0;s:13:"listitem_open";i:1;a:1:{i:0;i:1;}i:2;i:2885;}i:193;a:3:{i:0;s:16:"listcontent_open";i:1;a:0:{}i:2;i:2885;}i:194;a:3:{i:0;s:5:"cdata";i:1;a:1:{i:0;s:99:" O Samba é necessário para o compartilhamento de arquivos entre o servidor e os clientes Windows.";}i:2;i:2889;}i:195;a:3:{i:0;s:17:"listcontent_close";i:1;a:0:{}i:2;i:2988;}i:196;a:3:{i:0;s:14:"listitem_close";i:1;a:0:{}i:2;i:2988;}i:197;a:3:{i:0;s:13:"listitem_open";i:1;a:1:{i:0;i:1;}i:2;i:2988;}i:198;a:3:{i:0;s:16:"listcontent_open";i:1;a:0:{}i:2;i:2988;}i:199;a:3:{i:0;s:5:"cdata";i:1;a:1:{i:0;s:1:" ";}i:2;i:2992;}i:200;a:3:{i:0;s:12:"internallink";i:1;a:2:{i:0;s:19:"/trac/wiki/smb_conf";i:1;s:27:"Arquivo /etc/samba/smb.conf";}i:2;i:2993;}i:201;a:3:{i:0;s:17:"listcontent_close";i:1;a:0:{}i:2;i:3044;}i:202;a:3:{i:0;s:14:"listitem_close";i:1;a:0:{}i:2;i:3044;}i:203;a:3:{i:0;s:13:"listitem_open";i:1;a:1:{i:0;i:1;}i:2;i:3044;}i:204;a:3:{i:0;s:16:"listcontent_open";i:1;a:0:{}i:2;i:3044;}i:205;a:3:{i:0;s:5:"cdata";i:1;a:1:{i:0;s:27:" To Do: um tutorial decente";}i:2;i:3048;}i:206;a:3:{i:0;s:17:"listcontent_close";i:1;a:0:{}i:2;i:3075;}i:207;a:3:{i:0;s:14:"listitem_close";i:1;a:0:{}i:2;i:3075;}i:208;a:3:{i:0;s:11:"listu_close";i:1;a:0:{}i:2;i:3075;}i:209;a:3:{i:0;s:13:"section_close";i:1;a:0:{}i:2;i:3077;}i:210;a:3:{i:0;s:12:"section_edit";i:1;a:4:{i:0;i:2856;i:1;i:3076;i:2;i:3;i:3;s:18:"Instalação Samba";}i:2;i:3077;}i:211;a:3:{i:0;s:6:"header";i:1;a:3:{i:0;s:16:"Instalação SSH";i:1;i:3;i:2;i:3077;}i:2;i:3077;}i:212;a:3:{i:0;s:12:"section_open";i:1;a:1:{i:0;i:3;}i:2;i:3077;}i:213;a:3:{i:0;s:6:"p_open";i:1;a:0:{}i:2;i:3103;}i:214;a:3:{i:0;s:5:"cdata";i:1;a:1:{i:0;s:141:"
Para instalarmos o ssh no servidor, ou seja permitir que cliente o acessem usando este protocolo, devemos instalar o pacote openssh-server:
";}i:2;i:3104;}i:215;a:3:{i:0;s:7:"p_close";i:1;a:0:{}i:2;i:3245;}i:216;a:3:{i:0;s:12:"preformatted";i:1;a:1:{i:0;s:37:"# sudo apt-get install openssh-server";}i:2;i:3245;}i:217;a:3:{i:0;s:13:"section_close";i:1;a:0:{}i:2;i:3287;}i:218;a:3:{i:0;s:12:"section_edit";i:1;a:4:{i:0;i:3077;i:1;i:3286;i:2;i:3;i:3;s:16:"Instalação SSH";}i:2;i:3287;}i:219;a:3:{i:0;s:6:"header";i:1;a:3:{i:0;s:20:"Instalação do Trac";i:1;i:3;i:2;i:3287;}i:2;i:3287;}i:220;a:3:{i:0;s:12:"section_open";i:1;a:1:{i:0;i:3;}i:2;i:3287;}i:221;a:3:{i:0;s:10:"listu_open";i:1;a:0:{}i:2;i:3318;}i:222;a:3:{i:0;s:13:"listitem_open";i:1;a:1:{i:0;i:1;}i:2;i:3318;}i:223;a:3:{i:0;s:16:"listcontent_open";i:1;a:0:{}i:2;i:3318;}i:224;a:3:{i:0;s:5:"cdata";i:1;a:1:{i:0;s:1:" ";}i:2;i:3322;}i:225;a:3:{i:0;s:12:"internallink";i:1;a:2:{i:0;s:27:"/trac/wiki/trac_instalacao2";i:1;s:23:"Instalação (by Bruno)";}i:2;i:3323;}i:226;a:3:{i:0;s:17:"listcontent_close";i:1;a:0:{}i:2;i:3378;}i:227;a:3:{i:0;s:14:"listitem_close";i:1;a:0:{}i:2;i:3378;}i:228;a:3:{i:0;s:13:"listitem_open";i:1;a:1:{i:0;i:1;}i:2;i:3378;}i:229;a:3:{i:0;s:16:"listcontent_open";i:1;a:0:{}i:2;i:3378;}i:230;a:3:{i:0;s:5:"cdata";i:1;a:1:{i:0;s:15:" Mais infos em ";}i:2;i:3382;}i:231;a:3:{i:0;s:12:"internallink";i:1;a:2:{i:0;s:20:"/trac/wiki/rede_trac";i:1;s:23:"Administração do Trac";}i:2;i:3397;}i:232;a:3:{i:0;s:17:"listcontent_close";i:1;a:0:{}i:2;i:3445;}i:233;a:3:{i:0;s:14:"listitem_close";i:1;a:0:{}i:2;i:3445;}i:234;a:3:{i:0;s:11:"listu_close";i:1;a:0:{}i:2;i:3445;}i:235;a:3:{i:0;s:13:"section_close";i:1;a:0:{}i:2;i:3447;}i:236;a:3:{i:0;s:12:"section_edit";i:1;a:4:{i:0;i:3287;i:1;i:3446;i:2;i:3;i:3;s:20:"Instalação do Trac";}i:2;i:3447;}i:237;a:3:{i:0;s:6:"header";i:1;a:3:{i:0;s:12:"Referências";i:1;i:2;i:2;i:3447;}i:2;i:3447;}i:238;a:3:{i:0;s:12:"section_open";i:1;a:1:{i:0;i:2;}i:2;i:3447;}i:239;a:3:{i:0;s:13:"section_close";i:1;a:0:{}i:2;i:3473;}i:240;a:3:{i:0;s:12:"section_edit";i:1;a:4:{i:0;i:3447;i:1;i:3472;i:2;i:2;i:3;s:12:"Referências";}i:2;i:3473;}i:241;a:3:{i:0;s:6:"header";i:1;a:3:{i:0;s:4:"LDAP";i:1;i:3;i:2;i:3473;}i:2;i:3473;}i:242;a:3:{i:0;s:12:"section_open";i:1;a:1:{i:0;i:3;}i:2;i:3473;}i:243;a:3:{i:0;s:6:"p_open";i:1;a:0:{}i:2;i:3487;}i:244;a:3:{i:0;s:5:"cdata";i:1;a:1:{i:0;s:1:"
";}i:2;i:3488;}i:245;a:3:{i:0;s:12:"externallink";i:1;a:2:{i:0;s:48:"https://help.ubuntu.com/community/OpenLDAPServer";i:1;N;}i:2;i:3489;}i:246;a:3:{i:0;s:9:"linebreak";i:1;a:0:{}i:2;i:3537;}i:247;a:3:{i:0;s:5:"cdata";i:1;a:1:{i:0;s:1:" ";}i:2;i:3539;}i:248;a:3:{i:0;s:12:"externallink";i:1;a:2:{i:0;s:31:"http://wiki.splitbrain.org/ldap";i:1;N;}i:2;i:3540;}i:249;a:3:{i:0;s:7:"p_close";i:1;a:0:{}i:2;i:3571;}i:250;a:3:{i:0;s:13:"section_close";i:1;a:0:{}i:2;i:3573;}i:251;a:3:{i:0;s:12:"section_edit";i:1;a:4:{i:0;i:3473;i:1;i:3572;i:2;i:3;i:3;s:4:"LDAP";}i:2;i:3573;}i:252;a:3:{i:0;s:6:"header";i:1;a:3:{i:0;s:4:"Trac";i:1;i:3;i:2;i:3573;}i:2;i:3573;}i:253;a:3:{i:0;s:12:"section_open";i:1;a:1:{i:0;i:3;}i:2;i:3573;}i:254;a:3:{i:0;s:6:"p_open";i:1;a:0:{}i:2;i:3587;}i:255;a:3:{i:0;s:5:"cdata";i:1;a:1:{i:0;s:1:"
";}i:2;i:3588;}i:256;a:3:{i:0;s:12:"externallink";i:1;a:2:{i:0;s:42:"http://trac.edgewall.org/wiki/TracOnUbuntu";i:1;N;}i:2;i:3589;}i:257;a:3:{i:0;s:7:"p_close";i:1;a:0:{}i:2;i:3631;}i:258;a:3:{i:0;s:13:"section_close";i:1;a:0:{}i:2;i:3633;}i:259;a:3:{i:0;s:12:"section_edit";i:1;a:4:{i:0;i:3573;i:1;i:3632;i:2;i:3;i:3;s:4:"Trac";}i:2;i:3633;}i:260;a:3:{i:0;s:6:"header";i:1;a:3:{i:0;s:6:"Apache";i:1;i:3;i:2;i:3633;}i:2;i:3633;}i:261;a:3:{i:0;s:12:"section_open";i:1;a:1:{i:0;i:3;}i:2;i:3633;}i:262;a:3:{i:0;s:6:"p_open";i:1;a:0:{}i:2;i:3649;}i:263;a:3:{i:0;s:5:"cdata";i:1;a:1:{i:0;s:1:"
";}i:2;i:3650;}i:264;a:3:{i:0;s:12:"externallink";i:1;a:2:{i:0;s:64:"https://help.ubuntu.com/community/HelpOnInstalling/ApacheOnLinux";i:1;s:13:"ApacheOnLinux";}i:2;i:3651;}i:265;a:3:{i:0;s:7:"p_close";i:1;a:0:{}i:2;i:3733;}i:266;a:3:{i:0;s:13:"section_close";i:1;a:0:{}i:2;i:3735;}i:267;a:3:{i:0;s:12:"section_edit";i:1;a:4:{i:0;i:3633;i:1;i:3734;i:2;i:3;i:3;s:6:"Apache";}i:2;i:3735;}i:268;a:3:{i:0;s:6:"header";i:1;a:3:{i:0;s:3:"SSH";i:1;i:3;i:2;i:3735;}i:2;i:3735;}i:269;a:3:{i:0;s:12:"section_open";i:1;a:1:{i:0;i:3;}i:2;i:3735;}i:270;a:3:{i:0;s:6:"p_open";i:1;a:0:{}i:2;i:3748;}i:271;a:3:{i:0;s:5:"cdata";i:1;a:1:{i:0;s:1:"
";}i:2;i:3749;}i:272;a:3:{i:0;s:12:"externallink";i:1;a:2:{i:0;s:65:"https://help.ubuntu.com/ubuntu/serverguide/pt/openssh-server.html";i:1;s:13:"OpensshServer";}i:2;i:3750;}i:273;a:3:{i:0;s:7:"p_close";i:1;a:0:{}i:2;i:3833;}i:274;a:3:{i:0;s:13:"section_close";i:1;a:0:{}i:2;i:3834;}i:275;a:3:{i:0;s:12:"section_edit";i:1;a:4:{i:0;i:3735;i:1;i:0;i:2;i:3;i:3;s:3:"SSH";}i:2;i:3834;}i:276;a:3:{i:0;s:12:"document_end";i:1;a:0:{}i:2;i:3834;}}