a:142:{i:0;a:3:{i:0;s:14:"document_start";i:1;a:0:{}i:2;i:0;}i:1;a:3:{i:0;s:6:"p_open";i:1;a:0:{}i:2;i:0;}i:2;a:3:{i:0;s:7:"p_close";i:1;a:0:{}i:2;i:1;}i:3;a:3:{i:0;s:12:"section_edit";i:1;a:4:{i:0;i:-1;i:1;i:0;i:2;i:1;i:3;s:0:"";}i:2;i:1;}i:4;a:3:{i:0;s:6:"header";i:1;a:3:{i:0;s:21:"Ata Reunião 26/11/04";i:1;i:1;i:2;i:1;}i:2;i:1;}i:5;a:3:{i:0;s:12:"section_open";i:1;a:1:{i:0;i:1;}i:2;i:1;}i:6;a:3:{i:0;s:6:"p_open";i:1;a:0:{}i:2;i:36;}i:7;a:3:{i:0;s:5:"cdata";i:1;a:1:{i:0;s:97:"
Presentes: Diego, Paulo, Nondillo, Vinícius, João, Robert, Wagner, Hartmann, Lilian, Gustavo. ";}i:2;i:37;}i:8;a:3:{i:0;s:11:"strong_open";i:1;a:0:{}i:2;i:134;}i:9;a:3:{i:0;s:5:"cdata";i:1;a:1:{i:0;s:7:"Relator";}i:2;i:136;}i:10;a:3:{i:0;s:12:"strong_close";i:1;a:0:{}i:2;i:143;}i:11;a:3:{i:0;s:5:"cdata";i:1;a:1:{i:0;s:12:" - Vinícius";}i:2;i:145;}i:12;a:3:{i:0;s:7:"p_close";i:1;a:0:{}i:2;i:157;}i:13;a:3:{i:0;s:6:"p_open";i:1;a:0:{}i:2;i:157;}i:14;a:3:{i:0;s:5:"cdata";i:1;a:1:{i:0;s:3:"1. ";}i:2;i:159;}i:15;a:3:{i:0;s:11:"strong_open";i:1;a:0:{}i:2;i:162;}i:16;a:3:{i:0;s:5:"cdata";i:1;a:1:{i:0;s:8:"Interpet";}i:2;i:164;}i:17;a:3:{i:0;s:12:"strong_close";i:1;a:0:{}i:2;i:172;}i:18;a:3:{i:0;s:5:"cdata";i:1;a:1:{i:0;s:1:"
";}i:2;i:174;}i:19;a:3:{i:0;s:7:"p_close";i:1;a:0:{}i:2;i:175;}i:20;a:3:{i:0;s:10:"listu_open";i:1;a:0:{}i:2;i:175;}i:21;a:3:{i:0;s:13:"listitem_open";i:1;a:1:{i:0;i:1;}i:2;i:175;}i:22;a:3:{i:0;s:16:"listcontent_open";i:1;a:0:{}i:2;i:175;}i:23;a:3:{i:0;s:5:"cdata";i:1;a:1:{i:0;s:53:" Pet computação foi representado pelo diego e joao.";}i:2;i:179;}i:24;a:3:{i:0;s:17:"listcontent_close";i:1;a:0:{}i:2;i:232;}i:25;a:3:{i:0;s:14:"listitem_close";i:1;a:0:{}i:2;i:232;}i:26;a:3:{i:0;s:13:"listitem_open";i:1;a:1:{i:0;i:1;}i:2;i:232;}i:27;a:3:{i:0;s:16:"listcontent_open";i:1;a:0:{}i:2;i:232;}i:28;a:3:{i:0;s:5:"cdata";i:1;a:1:{i:0;s:56:" Foi discutido o Projeto coletivo, Forum social Mundial.";}i:2;i:236;}i:29;a:3:{i:0;s:17:"listcontent_close";i:1;a:0:{}i:2;i:292;}i:30;a:3:{i:0;s:14:"listitem_close";i:1;a:0:{}i:2;i:292;}i:31;a:3:{i:0;s:13:"listitem_open";i:1;a:1:{i:0;i:1;}i:2;i:292;}i:32;a:3:{i:0;s:16:"listcontent_open";i:1;a:0:{}i:2;i:292;}i:33;a:3:{i:0;s:5:"cdata";i:1;a:1:{i:0;s:21:" Proximos interpet's:";}i:2;i:296;}i:34;a:3:{i:0;s:17:"listcontent_close";i:1;a:0:{}i:2;i:317;}i:35;a:3:{i:0;s:10:"listu_open";i:1;a:0:{}i:2;i:317;}i:36;a:3:{i:0;s:13:"listitem_open";i:1;a:1:{i:0;i:2;}i:2;i:317;}i:37;a:3:{i:0;s:16:"listcontent_open";i:1;a:0:{}i:2;i:317;}i:38;a:3:{i:0;s:5:"cdata";i:1;a:1:{i:0;s:39:" 9/12 - 19h30 (festa após a reunião) ";}i:2;i:323;}i:39;a:3:{i:0;s:6:"entity";i:1;a:1:{i:0;s:3:"---";}i:2;i:362;}i:40;a:3:{i:0;s:5:"cdata";i:1;a:1:{i:0;s:52:"&gt; Lilian e Robert e mais quem quiser ir na festa.";}i:2;i:365;}i:41;a:3:{i:0;s:17:"listcontent_close";i:1;a:0:{}i:2;i:417;}i:42;a:3:{i:0;s:14:"listitem_close";i:1;a:0:{}i:2;i:417;}i:43;a:3:{i:0;s:13:"listitem_open";i:1;a:1:{i:0;i:2;}i:2;i:417;}i:44;a:3:{i:0;s:16:"listcontent_open";i:1;a:0:{}i:2;i:417;}i:45;a:3:{i:0;s:5:"cdata";i:1;a:1:{i:0;s:15:" 12/01 - 19h00 ";}i:2;i:423;}i:46;a:3:{i:0;s:6:"entity";i:1;a:1:{i:0;s:3:"---";}i:2;i:438;}i:47;a:3:{i:0;s:5:"cdata";i:1;a:1:{i:0;s:25:"-&gt; Gustavo e Vinicius.";}i:2;i:441;}i:48;a:3:{i:0;s:17:"listcontent_close";i:1;a:0:{}i:2;i:466;}i:49;a:3:{i:0;s:14:"listitem_close";i:1;a:0:{}i:2;i:466;}i:50;a:3:{i:0;s:13:"listitem_open";i:1;a:1:{i:0;i:2;}i:2;i:466;}i:51;a:3:{i:0;s:16:"listcontent_open";i:1;a:0:{}i:2;i:466;}i:52;a:3:{i:0;s:5:"cdata";i:1;a:1:{i:0;s:15:" 30/03 - 19h00 ";}i:2;i:472;}i:53;a:3:{i:0;s:6:"entity";i:1;a:1:{i:0;s:3:"---";}i:2;i:487;}i:54;a:3:{i:0;s:5:"cdata";i:1;a:1:{i:0;s:28:"-&gt; por enquanto ninguém.";}i:2;i:490;}i:55;a:3:{i:0;s:17:"listcontent_close";i:1;a:0:{}i:2;i:518;}i:56;a:3:{i:0;s:14:"listitem_close";i:1;a:0:{}i:2;i:518;}i:57;a:3:{i:0;s:11:"listu_close";i:1;a:0:{}i:2;i:518;}i:58;a:3:{i:0;s:14:"listitem_close";i:1;a:0:{}i:2;i:518;}i:59;a:3:{i:0;s:13:"listitem_open";i:1;a:1:{i:0;i:1;}i:2;i:518;}i:60;a:3:{i:0;s:16:"listcontent_open";i:1;a:0:{}i:2;i:518;}i:61;a:3:{i:0;s:5:"cdata";i:1;a:1:{i:0;s:92:" Lilian fica encarregada de mandar email paras os outros pet's sobre o projeto de inclusão.";}i:2;i:522;}i:62;a:3:{i:0;s:17:"listcontent_close";i:1;a:0:{}i:2;i:614;}i:63;a:3:{i:0;s:14:"listitem_close";i:1;a:0:{}i:2;i:614;}i:64;a:3:{i:0;s:11:"listu_close";i:1;a:0:{}i:2;i:614;}i:65;a:3:{i:0;s:6:"p_open";i:1;a:0:{}i:2;i:614;}i:66;a:3:{i:0;s:5:"cdata";i:1;a:1:{i:0;s:4:"
2. ";}i:2;i:615;}i:67;a:3:{i:0;s:11:"strong_open";i:1;a:0:{}i:2;i:619;}i:68;a:3:{i:0;s:5:"cdata";i:1;a:1:{i:0;s:31:"Competição do ROBOPET em 2005";}i:2;i:621;}i:69;a:3:{i:0;s:12:"strong_close";i:1;a:0:{}i:2;i:652;}i:70;a:3:{i:0;s:5:"cdata";i:1;a:1:{i:0;s:1:"
";}i:2;i:654;}i:71;a:3:{i:0;s:7:"p_close";i:1;a:0:{}i:2;i:655;}i:72;a:3:{i:0;s:10:"listu_open";i:1;a:0:{}i:2;i:655;}i:73;a:3:{i:0;s:13:"listitem_open";i:1;a:1:{i:0;i:1;}i:2;i:655;}i:74;a:3:{i:0;s:16:"listcontent_open";i:1;a:0:{}i:2;i:655;}i:75;a:3:{i:0;s:5:"cdata";i:1;a:1:{i:0;s:101:" Foi discutido as questão de estar tudo pronto para tal data. Outras questão é do tamanho do robo.";}i:2;i:659;}i:76;a:3:{i:0;s:17:"listcontent_close";i:1;a:0:{}i:2;i:760;}i:77;a:3:{i:0;s:14:"listitem_close";i:1;a:0:{}i:2;i:760;}i:78;a:3:{i:0;s:13:"listitem_open";i:1;a:1:{i:0;i:1;}i:2;i:760;}i:79;a:3:{i:0;s:16:"listcontent_open";i:1;a:0:{}i:2;i:760;}i:80;a:3:{i:0;s:5:"cdata";i:1;a:1:{i:0;s:44:" Resposta deve ser dada até inicio de 2005.";}i:2;i:764;}i:81;a:3:{i:0;s:17:"listcontent_close";i:1;a:0:{}i:2;i:808;}i:82;a:3:{i:0;s:14:"listitem_close";i:1;a:0:{}i:2;i:808;}i:83;a:3:{i:0;s:13:"listitem_open";i:1;a:1:{i:0;i:1;}i:2;i:808;}i:84;a:3:{i:0;s:16:"listcontent_open";i:1;a:0:{}i:2;i:808;}i:85;a:3:{i:0;s:5:"cdata";i:1;a:1:{i:0;s:91:" Paulo fica encarregado de fazer contatos sobre a especificações técnicas do campeonato.";}i:2;i:812;}i:86;a:3:{i:0;s:17:"listcontent_close";i:1;a:0:{}i:2;i:903;}i:87;a:3:{i:0;s:14:"listitem_close";i:1;a:0:{}i:2;i:903;}i:88;a:3:{i:0;s:11:"listu_close";i:1;a:0:{}i:2;i:903;}i:89;a:3:{i:0;s:6:"p_open";i:1;a:0:{}i:2;i:903;}i:90;a:3:{i:0;s:5:"cdata";i:1;a:1:{i:0;s:4:"
3. ";}i:2;i:904;}i:91;a:3:{i:0;s:11:"strong_open";i:1;a:0:{}i:2;i:908;}i:92;a:3:{i:0;s:5:"cdata";i:1;a:1:{i:0;s:28:"Sobre o programa do horário";}i:2;i:910;}i:93;a:3:{i:0;s:12:"strong_close";i:1;a:0:{}i:2;i:938;}i:94;a:3:{i:0;s:5:"cdata";i:1;a:1:{i:0;s:1:"
";}i:2;i:940;}i:95;a:3:{i:0;s:7:"p_close";i:1;a:0:{}i:2;i:941;}i:96;a:3:{i:0;s:10:"listu_open";i:1;a:0:{}i:2;i:941;}i:97;a:3:{i:0;s:13:"listitem_open";i:1;a:1:{i:0;i:1;}i:2;i:941;}i:98;a:3:{i:0;s:16:"listcontent_open";i:1;a:0:{}i:2;i:941;}i:99;a:3:{i:0;s:5:"cdata";i:1;a:1:{i:0;s:79:" Quem não completou as 48 horas obrigatórias tem que comprir até 27/11/2004.";}i:2;i:945;}i:100;a:3:{i:0;s:17:"listcontent_close";i:1;a:0:{}i:2;i:1024;}i:101;a:3:{i:0;s:14:"listitem_close";i:1;a:0:{}i:2;i:1024;}i:102;a:3:{i:0;s:11:"listu_close";i:1;a:0:{}i:2;i:1024;}i:103;a:3:{i:0;s:6:"p_open";i:1;a:0:{}i:2;i:1024;}i:104;a:3:{i:0;s:5:"cdata";i:1;a:1:{i:0;s:4:"
4. ";}i:2;i:1025;}i:105;a:3:{i:0;s:11:"strong_open";i:1;a:0:{}i:2;i:1029;}i:106;a:3:{i:0;s:5:"cdata";i:1;a:1:{i:0;s:5:"Filme";}i:2;i:1031;}i:107;a:3:{i:0;s:12:"strong_close";i:1;a:0:{}i:2;i:1036;}i:108;a:3:{i:0;s:5:"cdata";i:1;a:1:{i:0;s:1:"
";}i:2;i:1038;}i:109;a:3:{i:0;s:7:"p_close";i:1;a:0:{}i:2;i:1039;}i:110;a:3:{i:0;s:10:"listu_open";i:1;a:0:{}i:2;i:1039;}i:111;a:3:{i:0;s:13:"listitem_open";i:1;a:1:{i:0;i:1;}i:2;i:1039;}i:112;a:3:{i:0;s:16:"listcontent_open";i:1;a:0:{}i:2;i:1039;}i:113;a:3:{i:0;s:5:"cdata";i:1;a:1:{i:0;s:27:" discussão do filme/livro ";}i:2;i:1043;}i:114;a:3:{i:0;s:18:"doublequoteopening";i:1;a:0:{}i:2;i:1070;}i:115;a:3:{i:0;s:5:"cdata";i:1;a:1:{i:0;s:9:"Eu, Robô";}i:2;i:1071;}i:116;a:3:{i:0;s:18:"doublequoteclosing";i:1;a:0:{}i:2;i:1080;}i:117;a:3:{i:0;s:5:"cdata";i:1;a:1:{i:0;s:1:".";}i:2;i:1081;}i:118;a:3:{i:0;s:17:"listcontent_close";i:1;a:0:{}i:2;i:1082;}i:119;a:3:{i:0;s:14:"listitem_close";i:1;a:0:{}i:2;i:1082;}i:120;a:3:{i:0;s:13:"listitem_open";i:1;a:1:{i:0;i:1;}i:2;i:1082;}i:121;a:3:{i:0;s:16:"listcontent_open";i:1;a:0:{}i:2;i:1082;}i:122;a:3:{i:0;s:5:"cdata";i:1;a:1:{i:0;s:55:" Tema para próxima discussão: relações de trabalho.";}i:2;i:1086;}i:123;a:3:{i:0;s:17:"listcontent_close";i:1;a:0:{}i:2;i:1141;}i:124;a:3:{i:0;s:14:"listitem_close";i:1;a:0:{}i:2;i:1141;}i:125;a:3:{i:0;s:11:"listu_close";i:1;a:0:{}i:2;i:1141;}i:126;a:3:{i:0;s:6:"p_open";i:1;a:0:{}i:2;i:1141;}i:127;a:3:{i:0;s:5:"cdata";i:1;a:1:{i:0;s:4:"
5. ";}i:2;i:1142;}i:128;a:3:{i:0;s:11:"strong_open";i:1;a:0:{}i:2;i:1146;}i:129;a:3:{i:0;s:5:"cdata";i:1;a:1:{i:0;s:13:"Produtividade";}i:2;i:1148;}i:130;a:3:{i:0;s:12:"strong_close";i:1;a:0:{}i:2;i:1161;}i:131;a:3:{i:0;s:5:"cdata";i:1;a:1:{i:0;s:1:"
";}i:2;i:1163;}i:132;a:3:{i:0;s:7:"p_close";i:1;a:0:{}i:2;i:1164;}i:133;a:3:{i:0;s:10:"listu_open";i:1;a:0:{}i:2;i:1164;}i:134;a:3:{i:0;s:13:"listitem_open";i:1;a:1:{i:0;i:1;}i:2;i:1164;}i:135;a:3:{i:0;s:16:"listcontent_open";i:1;a:0:{}i:2;i:1164;}i:136;a:3:{i:0;s:5:"cdata";i:1;a:1:{i:0;s:34:" Verificação do que cada um fez.";}i:2;i:1168;}i:137;a:3:{i:0;s:17:"listcontent_close";i:1;a:0:{}i:2;i:1202;}i:138;a:3:{i:0;s:14:"listitem_close";i:1;a:0:{}i:2;i:1202;}i:139;a:3:{i:0;s:11:"listu_close";i:1;a:0:{}i:2;i:1202;}i:140;a:3:{i:0;s:13:"section_close";i:1;a:0:{}i:2;i:1203;}i:141;a:3:{i:0;s:12:"document_end";i:1;a:0:{}i:2;i:1203;}}