a:121:{i:0;a:3:{i:0;s:14:"document_start";i:1;a:0:{}i:2;i:0;}i:1;a:3:{i:0;s:6:"p_open";i:1;a:0:{}i:2;i:0;}i:2;a:3:{i:0;s:7:"p_close";i:1;a:0:{}i:2;i:1;}i:3;a:3:{i:0;s:12:"section_edit";i:1;a:4:{i:0;i:-1;i:1;i:0;i:2;i:1;i:3;s:0:"";}i:2;i:1;}i:4;a:3:{i:0;s:6:"header";i:1;a:3:{i:0;s:29:"Ata da reunião de 24/05/2006";i:1;i:2;i:2;i:1;}i:2;i:1;}i:5;a:3:{i:0;s:12:"section_open";i:1;a:1:{i:0;i:2;}i:2;i:1;}i:6;a:3:{i:0;s:6:"p_open";i:1;a:0:{}i:2;i:42;}i:7;a:3:{i:0;s:5:"cdata";i:1;a:1:{i:0;s:144:"
Presentes: Alexandre, Estevão, Fabiano, Felipe, Gabriela, Lucas Cavalheiro, Lucas Mizusaki, Marcelo, Marcos, Nondillo, Pablo, Ricardo e Thiago";}i:2;i:43;}i:8;a:3:{i:0;s:7:"p_close";i:1;a:0:{}i:2;i:187;}i:9;a:3:{i:0;s:6:"p_open";i:1;a:0:{}i:2;i:187;}i:10;a:3:{i:0;s:5:"cdata";i:1;a:1:{i:0;s:25:"Ausentes: Professor Dante";}i:2;i:189;}i:11;a:3:{i:0;s:7:"p_close";i:1;a:0:{}i:2;i:214;}i:12;a:3:{i:0;s:6:"p_open";i:1;a:0:{}i:2;i:214;}i:13;a:3:{i:0;s:5:"cdata";i:1;a:1:{i:0;s:21:"Relator: Pablo Dapont";}i:2;i:216;}i:14;a:3:{i:0;s:7:"p_close";i:1;a:0:{}i:2;i:237;}i:15;a:3:{i:0;s:13:"section_close";i:1;a:0:{}i:2;i:239;}i:16;a:3:{i:0;s:12:"section_edit";i:1;a:4:{i:0;i:1;i:1;i:238;i:2;i:2;i:3;s:29:"Ata da reunião de 24/05/2006";}i:2;i:239;}i:17;a:3:{i:0;s:6:"header";i:1;a:3:{i:0;s:15:"1)Curso de HTML";i:1;i:2;i:2;i:239;}i:2;i:239;}i:18;a:3:{i:0;s:12:"section_open";i:1;a:1:{i:0;i:2;}i:2;i:239;}i:19;a:3:{i:0;s:6:"p_open";i:1;a:0:{}i:2;i:266;}i:20;a:3:{i:0;s:5:"cdata";i:1;a:1:{i:0;s:58:"
Era esperado a resposta de Pablo e Tiago para o curso de ";}i:2;i:267;}i:21;a:3:{i:0;s:7:"acronym";i:1;a:1:{i:0;s:4:"HTML";}i:2;i:325;}i:22;a:3:{i:0;s:5:"cdata";i:1;a:1:{i:0;s:137:", a resposta foi positiva, ou seja, o curso será dado provavelmente no início do próximo semestre. A proposta do curso é iniciar com ";}i:2;i:329;}i:23;a:3:{i:0;s:7:"acronym";i:1;a:1:{i:0;s:4:"HTML";}i:2;i:466;}i:24;a:3:{i:0;s:5:"cdata";i:1;a:1:{i:0;s:38:", após será introduzida a linguagem ";}i:2;i:470;}i:25;a:3:{i:0;s:7:"acronym";i:1;a:1:{i:0;s:3:"PHP";}i:2;i:508;}i:26;a:3:{i:0;s:5:"cdata";i:1;a:1:{i:0;s:109:", configuração do Apache inclusive. Ainda, se possível, uma breve introdução de fireworks e dreamweaver.";}i:2;i:511;}i:27;a:3:{i:0;s:7:"p_close";i:1;a:0:{}i:2;i:620;}i:28;a:3:{i:0;s:13:"section_close";i:1;a:0:{}i:2;i:622;}i:29;a:3:{i:0;s:12:"section_edit";i:1;a:4:{i:0;i:239;i:1;i:621;i:2;i:2;i:3;s:15:"1)Curso de HTML";}i:2;i:622;}i:30;a:3:{i:0;s:6:"header";i:1;a:3:{i:0;s:31:"2)Modelo Inicial do site do PET";i:1;i:2;i:2;i:622;}i:2;i:622;}i:31;a:3:{i:0;s:12:"section_open";i:1;a:1:{i:0;i:2;}i:2;i:622;}i:32;a:3:{i:0;s:6:"p_open";i:1;a:0:{}i:2;i:665;}i:33;a:3:{i:0;s:5:"cdata";i:1;a:1:{i:0;s:464:"
Pablo apresentou um modelo do site do pet para sugestões dos membros do grupo. Primeiramente, foi proposto por Nondilho um tom de azul mais fraco para o banner do site. Também foi proposto por Lucas Cavalheiro uma modificação do menu à esquerda, deixando com uma aparência 3D. Pablo ressaltou que sejam enviadas a ele sugestões, tanto para design do site como conteúdo para o site, assim como sugestões de links ou quaisquer idéias para o site em geral.";}i:2;i:666;}i:34;a:3:{i:0;s:7:"p_close";i:1;a:0:{}i:2;i:1130;}i:35;a:3:{i:0;s:13:"section_close";i:1;a:0:{}i:2;i:1132;}i:36;a:3:{i:0;s:12:"section_edit";i:1;a:4:{i:0;i:622;i:1;i:1131;i:2;i:2;i:3;s:31:"2)Modelo Inicial do site do PET";}i:2;i:1132;}i:37;a:3:{i:0;s:6:"header";i:1;a:3:{i:0;s:13:"3)Pendências";i:1;i:2;i:2;i:1132;}i:2;i:1132;}i:38;a:3:{i:0;s:12:"section_open";i:1;a:1:{i:0;i:2;}i:2;i:1132;}i:39;a:3:{i:0;s:6:"p_open";i:1;a:0:{}i:2;i:1157;}i:40;a:3:{i:0;s:5:"cdata";i:1;a:1:{i:0;s:262:"
a) Chave dos Armários: Lucas comentou que fez as chaves e teve um custo de 39 reais, ou seja, cada petiano deve pagar 3 reais e pegar a chave com ele. A idéia inicial foi preservada, apenas uma chave para o primeiro armário que conterá as chaves dos demais.";}i:2;i:1158;}i:41;a:3:{i:0;s:7:"p_close";i:1;a:0:{}i:2;i:1420;}i:42;a:3:{i:0;s:6:"p_open";i:1;a:0:{}i:2;i:1420;}i:43;a:3:{i:0;s:5:"cdata";i:1;a:1:{i:0;s:153:"b) Material para o café: Lucas comprou, porém não trouxe porque teve que passar em casa antes de vir pro PET, mas ele ficou de trazer no dia seguinte.";}i:2;i:1422;}i:44;a:3:{i:0;s:7:"p_close";i:1;a:0:{}i:2;i:1575;}i:45;a:3:{i:0;s:6:"p_open";i:1;a:0:{}i:2;i:1575;}i:46;a:3:{i:0;s:5:"cdata";i:1;a:1:{i:0;s:144:"c) Fuzível para Charlize: Estevão ressaltou que até foi no centro, mas esqueceu. Porém falou que iria providenciar o mais rápido possível.";}i:2;i:1577;}i:47;a:3:{i:0;s:7:"p_close";i:1;a:0:{}i:2;i:1721;}i:48;a:3:{i:0;s:13:"section_close";i:1;a:0:{}i:2;i:1723;}i:49;a:3:{i:0;s:12:"section_edit";i:1;a:4:{i:0;i:1132;i:1;i:1722;i:2;i:2;i:3;s:13:"3)Pendências";}i:2;i:1723;}i:50;a:3:{i:0;s:6:"header";i:1;a:3:{i:0;s:29:"4)Avaliação dos relatórios";i:1;i:2;i:2;i:1723;}i:2;i:1723;}i:51;a:3:{i:0;s:12:"section_open";i:1;a:1:{i:0;i:2;}i:2;i:1723;}i:52;a:3:{i:0;s:6:"p_open";i:1;a:0:{}i:2;i:1764;}i:53;a:3:{i:0;s:5:"cdata";i:1;a:1:{i:0;s:145:"
Fabiano apenas lembrou a todos que no dia seguinte, quinta-feira as 18:00 horas, seria o dia da reunião de avaliação dos relatórios mensais.";}i:2;i:1765;}i:54;a:3:{i:0;s:7:"p_close";i:1;a:0:{}i:2;i:1910;}i:55;a:3:{i:0;s:13:"section_close";i:1;a:0:{}i:2;i:1912;}i:56;a:3:{i:0;s:12:"section_edit";i:1;a:4:{i:0;i:1723;i:1;i:1911;i:2;i:2;i:3;s:29:"4)Avaliação dos relatórios";}i:2;i:1912;}i:57;a:3:{i:0;s:6:"header";i:1;a:3:{i:0;s:25:"5)Planejamento da PROGRAD";i:1;i:2;i:2;i:1912;}i:2;i:1912;}i:58;a:3:{i:0;s:12:"section_open";i:1;a:1:{i:0;i:2;}i:2;i:1912;}i:59;a:3:{i:0;s:6:"p_open";i:1;a:0:{}i:2;i:1949;}i:60;a:3:{i:0;s:5:"cdata";i:1;a:1:{i:0;s:350:"
Fabiano ressaltou que Felipe havia ficado responsável de entregar os planejamentos mensais à PROGRAD até o dia 25 de cada mês. Assim, todos os petianos deveria providenciar o seu até o dia 25 do mês. Fabiano ainda ressaltou quanto a folha de efetividade, que também seria Felipe o responsável, mas esta, apenas quando Dante chegar de viagem.";}i:2;i:1950;}i:61;a:3:{i:0;s:7:"p_close";i:1;a:0:{}i:2;i:2300;}i:62;a:3:{i:0;s:13:"section_close";i:1;a:0:{}i:2;i:2302;}i:63;a:3:{i:0;s:12:"section_edit";i:1;a:4:{i:0;i:1912;i:1;i:2301;i:2;i:2;i:3;s:25:"5)Planejamento da PROGRAD";}i:2;i:2302;}i:64;a:3:{i:0;s:6:"header";i:1;a:3:{i:0;s:10:"6)Interpet";i:1;i:2;i:2;i:2302;}i:2;i:2302;}i:65;a:3:{i:0;s:12:"section_open";i:1;a:1:{i:0;i:2;}i:2;i:2302;}i:66;a:3:{i:0;s:6:"p_open";i:1;a:0:{}i:2;i:2324;}i:67;a:3:{i:0;s:5:"cdata";i:1;a:1:{i:0;s:489:"
Marcos e Tiago seriam os responsáveis para representar o PET computação no Interpet, mas Marcos ressalta ter que concluir o trabalho de Técnicas Digitais. Tiago fica encarregado de ir sozinho. É comentado que no Interpet será discutido sobre Mudanças e Propostas do CENAPET. Fabiano comenta que era bom falar sobre o site do pet. Ainda, é ressaltado que perto da data do ENAPET far-se-á um ou dois interpets para organização de ônibus entre outras coisas a respeito do Enapet.";}i:2;i:2325;}i:68;a:3:{i:0;s:7:"p_close";i:1;a:0:{}i:2;i:2814;}i:69;a:3:{i:0;s:13:"section_close";i:1;a:0:{}i:2;i:2816;}i:70;a:3:{i:0;s:12:"section_edit";i:1;a:4:{i:0;i:2302;i:1;i:2815;i:2;i:2;i:3;s:10:"6)Interpet";}i:2;i:2816;}i:71;a:3:{i:0;s:6:"header";i:1;a:3:{i:0;s:28:"7)Rede: Relatos e Sugestões";i:1;i:2;i:2;i:2816;}i:2;i:2816;}i:72;a:3:{i:0;s:12:"section_open";i:1;a:1:{i:0;i:2;}i:2;i:2816;}i:73;a:3:{i:0;s:6:"p_open";i:1;a:0:{}i:2;i:2856;}i:74;a:3:{i:0;s:5:"cdata";i:1;a:1:{i:0;s:696:"
Tiago fala que passou os últimos dias trabalhando em cima da rede. Ainda, comenta que todos os computadores terão o UBUNTU, assim como será instalado o Open Office 2.0 em todas as máquinas. Ele ressalta que ainda não é possível por um problema que está havendo em logar a Gabi no computador Grabiela, todos os outros já estão cadastrados. Porém isso será solucionado em breve. Tiago ressalta que precisando de algum software livre ou gratuito é só falar com ele. Após isso, Fabiano destaca e elogia o trabalho de Tiago em trocar o Gentoo pelo Ubuntu para facilitar seu trabalho. Tiago ainda fala que não há previsão para o windows, mas na próxima reunião terá uma previsão.";}i:2;i:2857;}i:75;a:3:{i:0;s:7:"p_close";i:1;a:0:{}i:2;i:3553;}i:76;a:3:{i:0;s:13:"section_close";i:1;a:0:{}i:2;i:3555;}i:77;a:3:{i:0;s:12:"section_edit";i:1;a:4:{i:0;i:2816;i:1;i:3554;i:2;i:2;i:3;s:28:"7)Rede: Relatos e Sugestões";}i:2;i:3555;}i:78;a:3:{i:0;s:6:"header";i:1;a:3:{i:0;s:25:"8)Curso de Linux CEUE-PET";i:1;i:2;i:2;i:3555;}i:2;i:3555;}i:79;a:3:{i:0;s:12:"section_open";i:1;a:1:{i:0;i:2;}i:2;i:3555;}i:80;a:3:{i:0;s:6:"p_open";i:1;a:0:{}i:2;i:3592;}i:81;a:3:{i:0;s:5:"cdata";i:1;a:1:{i:0;s:633:"
O CEUE tem interesse no curso, Sérgio vai contatar Tiago em duas semanas para tratar sobre material, local entre outras coisas. Tiago acha mais atrativo ser lá do que no Intituto de Informática. Fabiano expõe o fato de lá não ter máquinas boas para aplicação do curso. Tiago argumenta falando que tendo hardware funcionando, os computadores serão formatados e será possível dar o curso. Ainda ressalta que data show, que lá não teria, não é essencial. Em duas semanas terá-se uma amostragem e vai ser visto o número de interessados. O curso seria no segundo semestre e o público alvo seria um público mais leigo.";}i:2;i:3593;}i:82;a:3:{i:0;s:7:"p_close";i:1;a:0:{}i:2;i:4226;}i:83;a:3:{i:0;s:13:"section_close";i:1;a:0:{}i:2;i:4228;}i:84;a:3:{i:0;s:12:"section_edit";i:1;a:4:{i:0;i:3555;i:1;i:4227;i:2;i:2;i:3;s:25:"8)Curso de Linux CEUE-PET";}i:2;i:4228;}i:85;a:3:{i:0;s:6:"header";i:1;a:3:{i:0;s:23:"9)Organização da sala";i:1;i:2;i:2;i:4228;}i:2;i:4228;}i:86;a:3:{i:0;s:12:"section_open";i:1;a:1:{i:0;i:2;}i:2;i:4228;}i:87;a:3:{i:0;s:6:"p_open";i:1;a:0:{}i:2;i:4263;}i:88;a:3:{i:0;s:5:"cdata";i:1;a:1:{i:0;s:602:"
Fabiano ressalta que o assunto mesmo seria comportamento e atitudes na sala. Ele fala ter perdido tempo, às vezes, para suas tarefas devido a conversas na sala. É sugerido que cada um verifique e mude, caso seja inadequadas, suas atitudes na sala, como conversas altas, discussões, risadas em alto tom, entre outras. É ressaltado as recomendações internas do PET. Fabiano ainda fala que causa uma má impressão para quem olhar de fora no caso de conversas e discussões em alto tom. Ainda há uma observação quanto ao lugar para se deixar as mochilas, na estante e não no chão ou nas mesas.";}i:2;i:4264;}i:89;a:3:{i:0;s:7:"p_close";i:1;a:0:{}i:2;i:4866;}i:90;a:3:{i:0;s:13:"section_close";i:1;a:0:{}i:2;i:4868;}i:91;a:3:{i:0;s:12:"section_edit";i:1;a:4:{i:0;i:4228;i:1;i:4867;i:2;i:2;i:3;s:23:"9)Organização da sala";}i:2;i:4868;}i:92;a:3:{i:0;s:6:"header";i:1;a:3:{i:0;s:34:"10)Administração da rede windows";i:1;i:2;i:2;i:4868;}i:2;i:4868;}i:93;a:3:{i:0;s:12:"section_open";i:1;a:1:{i:0;i:2;}i:2;i:4868;}i:94;a:3:{i:0;s:6:"p_open";i:1;a:0:{}i:2;i:4914;}i:95;a:3:{i:0;s:5:"cdata";i:1;a:1:{i:0;s:684:"
Nondilho ressalta que vai se formar e que seria bom alguém entrar, aprender e assumir a rede windows. Marcos comenta que, às vezes, apenas um ter a senha do Administrador pode-se perder tempo caso alguém precise de uma tarefa que só possa ser feita pelo Administrador. O grupo não apoia e é decidido apenas o Administrador ter a senha. Lucas Cavalheiro e Lucas Misuzaki se candidatam. Fabiano ressalta que alguém deve ir aprendendo em conjunto para quando Nondilho sair estar apto a administrar. Marcos ainda comenta que futuramente precisará de um tempo no PET, estando todas as máquinas disponíveis, para testar seu projeto e precisará da ajuda do administrador de rede.";}i:2;i:4915;}i:96;a:3:{i:0;s:7:"p_close";i:1;a:0:{}i:2;i:5599;}i:97;a:3:{i:0;s:13:"section_close";i:1;a:0:{}i:2;i:5601;}i:98;a:3:{i:0;s:12:"section_edit";i:1;a:4:{i:0;i:4868;i:1;i:5600;i:2;i:2;i:3;s:34:"10)Administração da rede windows";}i:2;i:5601;}i:99;a:3:{i:0;s:6:"header";i:1;a:3:{i:0;s:20:"11)Fonte da Charlize";i:1;i:2;i:2;i:5601;}i:2;i:5601;}i:100;a:3:{i:0;s:12:"section_open";i:1;a:1:{i:0;i:2;}i:2;i:5601;}i:101;a:3:{i:0;s:6:"p_open";i:1;a:0:{}i:2;i:5633;}i:102;a:3:{i:0;s:5:"cdata";i:1;a:1:{i:0;s:183:"
Tiago questiona quando estaria disponível a Charlize, Estevão fala que no dia seguinte providenciará. Far-se-á teste com o fuzível para verificar se o problema é só ele mesmo.";}i:2;i:5634;}i:103;a:3:{i:0;s:7:"p_close";i:1;a:0:{}i:2;i:5817;}i:104;a:3:{i:0;s:13:"section_close";i:1;a:0:{}i:2;i:5819;}i:105;a:3:{i:0;s:12:"section_edit";i:1;a:4:{i:0;i:5601;i:1;i:5818;i:2;i:2;i:3;s:20:"11)Fonte da Charlize";}i:2;i:5819;}i:106;a:3:{i:0;s:6:"header";i:1;a:3:{i:0;s:9:"12)ENAPET";i:1;i:2;i:2;i:5819;}i:2;i:5819;}i:107;a:3:{i:0;s:12:"section_open";i:1;a:1:{i:0;i:2;}i:2;i:5819;}i:108;a:3:{i:0;s:6:"p_open";i:1;a:0:{}i:2;i:5840;}i:109;a:3:{i:0;s:5:"cdata";i:1;a:1:{i:0;s:466:"
Nondilho comenta que está se aproximando a data, assim é preciso estar atento quanto às inscrições e organização. Tiago ressalta que comentará sobre isso no interpet. Sabe-se que as inscrições são mais baratas até uma determinada data a ser confirmada. Marcos ressalta a má comunicação do último evento em relação ao ônibus, pois não deve acontecer novamente. É exigida uma confirmação de todos os membros do grupo. A princípio, todos irão.";}i:2;i:5841;}i:110;a:3:{i:0;s:7:"p_close";i:1;a:0:{}i:2;i:6307;}i:111;a:3:{i:0;s:13:"section_close";i:1;a:0:{}i:2;i:6309;}i:112;a:3:{i:0;s:12:"section_edit";i:1;a:4:{i:0;i:5819;i:1;i:6308;i:2;i:2;i:3;s:9:"12)ENAPET";}i:2;i:6309;}i:113;a:3:{i:0;s:6:"header";i:1;a:3:{i:0;s:13:"13)Seminário";i:1;i:2;i:2;i:6309;}i:2;i:6309;}i:114;a:3:{i:0;s:12:"section_open";i:1;a:1:{i:0;i:2;}i:2;i:6309;}i:115;a:3:{i:0;s:6:"p_open";i:1;a:0:{}i:2;i:6334;}i:116;a:3:{i:0;s:5:"cdata";i:1;a:1:{i:0;s:65:"
Tiago finalmente apresentou seu seminário sobre a Rede Interna.";}i:2;i:6335;}i:117;a:3:{i:0;s:7:"p_close";i:1;a:0:{}i:2;i:6400;}i:118;a:3:{i:0;s:13:"section_close";i:1;a:0:{}i:2;i:6401;}i:119;a:3:{i:0;s:12:"section_edit";i:1;a:4:{i:0;i:6309;i:1;i:0;i:2;i:2;i:3;s:13:"13)Seminário";}i:2;i:6401;}i:120;a:3:{i:0;s:12:"document_end";i:1;a:0:{}i:2;i:6401;}}