a:242:{i:0;a:3:{i:0;s:14:"document_start";i:1;a:0:{}i:2;i:0;}i:1;a:3:{i:0;s:6:"p_open";i:1;a:0:{}i:2;i:0;}i:2;a:3:{i:0;s:7:"p_close";i:1;a:0:{}i:2;i:1;}i:3;a:3:{i:0;s:12:"section_edit";i:1;a:4:{i:0;i:-1;i:1;i:0;i:2;i:1;i:3;s:0:"";}i:2;i:1;}i:4;a:3:{i:0;s:6:"header";i:1;a:3:{i:0;s:29:"Ata da Reunião de 05/09/2006";i:1;i:1;i:2;i:1;}i:2;i:1;}i:5;a:3:{i:0;s:12:"section_open";i:1;a:1:{i:0;i:1;}i:2;i:1;}i:6;a:3:{i:0;s:6:"p_open";i:1;a:0:{}i:2;i:44;}i:7;a:3:{i:0;s:5:"cdata";i:1;a:1:{i:0;s:84:"
Presentes: Alexandre, Dante, Estevão, Fabiano, Felipe, Gabriela, Lucas Cavalheiro,";}i:2;i:45;}i:8;a:3:{i:0;s:7:"p_close";i:1;a:0:{}i:2;i:129;}i:9;a:3:{i:0;s:6:"p_open";i:1;a:0:{}i:2;i:129;}i:10;a:3:{i:0;s:5:"cdata";i:1;a:1:{i:0;s:55:"Lucas Mizusaki, Marcelo, Marcos, Pablo, Ricardo, Thiago";}i:2;i:131;}i:11;a:3:{i:0;s:7:"p_close";i:1;a:0:{}i:2;i:186;}i:12;a:3:{i:0;s:6:"p_open";i:1;a:0:{}i:2;i:186;}i:13;a:3:{i:0;s:5:"cdata";i:1;a:1:{i:0;s:10:"Ausentes: ";}i:2;i:188;}i:14;a:3:{i:0;s:6:"entity";i:1;a:1:{i:0;s:3:"---";}i:2;i:198;}i:15;a:3:{i:0;s:6:"entity";i:1;a:1:{i:0;s:3:"---";}i:2;i:201;}i:16;a:3:{i:0;s:5:"cdata";i:1;a:1:{i:0;s:1:"-";}i:2;i:204;}i:17;a:3:{i:0;s:7:"p_close";i:1;a:0:{}i:2;i:205;}i:18;a:3:{i:0;s:6:"p_open";i:1;a:0:{}i:2;i:205;}i:19;a:3:{i:0;s:5:"cdata";i:1;a:1:{i:0;s:16:"Relator: Ricardo";}i:2;i:207;}i:20;a:3:{i:0;s:7:"p_close";i:1;a:0:{}i:2;i:223;}i:21;a:3:{i:0;s:13:"section_close";i:1;a:0:{}i:2;i:225;}i:22;a:3:{i:0;s:12:"section_edit";i:1;a:4:{i:0;i:1;i:1;i:224;i:2;i:1;i:3;s:29:"Ata da Reunião de 05/09/2006";}i:2;i:225;}i:23;a:3:{i:0;s:6:"header";i:1;a:3:{i:0;s:42:"1. Confraternização (Churrasco, Futebol)";i:1;i:2;i:2;i:225;}i:2;i:225;}i:24;a:3:{i:0;s:12:"section_open";i:1;a:1:{i:0;i:2;}i:2;i:225;}i:25;a:3:{i:0;s:6:"p_open";i:1;a:0:{}i:2;i:279;}i:26;a:3:{i:0;s:5:"cdata";i:1;a:1:{i:0;s:85:"
Futebol: Sairá por R$126,00. Gabriela disse que provavelmente não vai, mas vai pro";}i:2;i:280;}i:27;a:3:{i:0;s:7:"p_close";i:1;a:0:{}i:2;i:365;}i:28;a:3:{i:0;s:6:"p_open";i:1;a:0:{}i:2;i:365;}i:29;a:3:{i:0;s:5:"cdata";i:1;a:1:{i:0;s:95:"churrasco. Churrasco: Mizusaki pesquisou preços e localização e apresentou algumas opções.";}i:2;i:367;}i:30;a:3:{i:0;s:7:"p_close";i:1;a:0:{}i:2;i:462;}i:31;a:3:{i:0;s:6:"p_open";i:1;a:0:{}i:2;i:462;}i:32;a:3:{i:0;s:5:"cdata";i:1;a:1:{i:0;s:81:"Ficou na Santana (21h, R$8,90, Ônibus T1). Se houver problema, será escolhida a";}i:2;i:464;}i:33;a:3:{i:0;s:7:"p_close";i:1;a:0:{}i:2;i:545;}i:34;a:3:{i:0;s:6:"p_open";i:1;a:0:{}i:2;i:545;}i:35;a:3:{i:0;s:5:"cdata";i:1;a:1:{i:0;s:28:"mais barata e mais próxima.";}i:2;i:547;}i:36;a:3:{i:0;s:7:"p_close";i:1;a:0:{}i:2;i:575;}i:37;a:3:{i:0;s:13:"section_close";i:1;a:0:{}i:2;i:577;}i:38;a:3:{i:0;s:12:"section_edit";i:1;a:4:{i:0;i:225;i:1;i:576;i:2;i:2;i:3;s:42:"1. Confraternização (Churrasco, Futebol)";}i:2;i:577;}i:39;a:3:{i:0;s:6:"header";i:1;a:3:{i:0;s:17:"2. Estágio x PET";i:1;i:2;i:2;i:577;}i:2;i:577;}i:40;a:3:{i:0;s:12:"section_open";i:1;a:1:{i:0;i:2;}i:2;i:577;}i:41;a:3:{i:0;s:6:"p_open";i:1;a:0:{}i:2;i:606;}i:42;a:3:{i:0;s:5:"cdata";i:1;a:1:{i:0;s:84:"
Foi discutido se é válido ou não fazer estágio ao mesmo tempo que o PET, como o";}i:2;i:607;}i:43;a:3:{i:0;s:7:"p_close";i:1;a:0:{}i:2;i:691;}i:44;a:3:{i:0;s:6:"p_open";i:1;a:0:{}i:2;i:691;}i:45;a:3:{i:0;s:5:"cdata";i:1;a:1:{i:0;s:75:"Nondillo fez. A opinião, em geral, é de que, apesar da necessidade de ser";}i:2;i:693;}i:46;a:3:{i:0;s:7:"p_close";i:1;a:0:{}i:2;i:768;}i:47;a:3:{i:0;s:6:"p_open";i:1;a:0:{}i:2;i:768;}i:48;a:3:{i:0;s:5:"cdata";i:1;a:1:{i:0;s:82:"extra-oficial, é válido, desde que seja feito conscientemente, mais para o final";}i:2;i:770;}i:49;a:3:{i:0;s:7:"p_close";i:1;a:0:{}i:2;i:852;}i:50;a:3:{i:0;s:6:"p_open";i:1;a:0:{}i:2;i:852;}i:51;a:3:{i:0;s:5:"cdata";i:1;a:1:{i:0;s:87:"do curso, e que hajauma boa adaptação (sugestão: período de 3 meses para ver se há";}i:2;i:854;}i:52;a:3:{i:0;s:7:"p_close";i:1;a:0:{}i:2;i:941;}i:53;a:3:{i:0;s:6:"p_open";i:1;a:0:{}i:2;i:941;}i:54;a:3:{i:0;s:5:"cdata";i:1;a:1:{i:0;s:84:"adaptação ou não). Fabiano destacou que o Nondillo teve que vincular ao PET o seu";}i:2;i:943;}i:55;a:3:{i:0;s:7:"p_close";i:1;a:0:{}i:2;i:1027;}i:56;a:3:{i:0;s:6:"p_open";i:1;a:0:{}i:2;i:1027;}i:57;a:3:{i:0;s:5:"cdata";i:1;a:1:{i:0;s:84:"trabalho de conclusão, mas que isso é também uma coisa válida e que em geral ele";}i:2;i:1029;}i:58;a:3:{i:0;s:7:"p_close";i:1;a:0:{}i:2;i:1113;}i:59;a:3:{i:0;s:6:"p_open";i:1;a:0:{}i:2;i:1113;}i:60;a:3:{i:0;s:5:"cdata";i:1;a:1:{i:0;s:62:"teve uma boa adaptação e conseguiu conciliar as duas coisas.";}i:2;i:1115;}i:61;a:3:{i:0;s:7:"p_close";i:1;a:0:{}i:2;i:1177;}i:62;a:3:{i:0;s:13:"section_close";i:1;a:0:{}i:2;i:1179;}i:63;a:3:{i:0;s:12:"section_edit";i:1;a:4:{i:0;i:577;i:1;i:1178;i:2;i:2;i:3;s:17:"2. Estágio x PET";}i:2;i:1179;}i:64;a:3:{i:0;s:6:"header";i:1;a:3:{i:0;s:31:"3. Palestra Ações Afirmativas";i:1;i:2;i:2;i:1179;}i:2;i:1179;}i:65;a:3:{i:0;s:12:"section_open";i:1;a:1:{i:0;i:2;}i:2;i:1179;}i:66;a:3:{i:0;s:6:"p_open";i:1;a:0:{}i:2;i:1222;}i:67;a:3:{i:0;s:5:"cdata";i:1;a:1:{i:0;s:85:"
Ficaram de ir Marcos, Flores, Ricardo e Capra, sendo que os dois últimos irão pela";}i:2;i:1223;}i:68;a:3:{i:0;s:7:"p_close";i:1;a:0:{}i:2;i:1308;}i:69;a:3:{i:0;s:6:"p_open";i:1;a:0:{}i:2;i:1308;}i:70;a:3:{i:0;s:5:"cdata";i:1;a:1:{i:0;s:15:"manhã também.";}i:2;i:1310;}i:71;a:3:{i:0;s:7:"p_close";i:1;a:0:{}i:2;i:1325;}i:72;a:3:{i:0;s:13:"section_close";i:1;a:0:{}i:2;i:1327;}i:73;a:3:{i:0;s:12:"section_edit";i:1;a:4:{i:0;i:1179;i:1;i:1326;i:2;i:2;i:3;s:31:"3. Palestra Ações Afirmativas";}i:2;i:1327;}i:74;a:3:{i:0;s:6:"header";i:1;a:3:{i:0;s:68:"4. Cooperação Internacional - Interesse pelo curso de Computação";i:1;i:2;i:2;i:1327;}i:2;i:1327;}i:75;a:3:{i:0;s:12:"section_open";i:1;a:1:{i:0;i:2;}i:2;i:1327;}i:76;a:3:{i:0;s:6:"p_open";i:1;a:0:{}i:2;i:1407;}i:77;a:3:{i:0;s:5:"cdata";i:1;a:1:{i:0;s:80:"
Dante propõe um evento para discutir a diminuição do interesse pelo curso de";}i:2;i:1408;}i:78;a:3:{i:0;s:7:"p_close";i:1;a:0:{}i:2;i:1488;}i:79;a:3:{i:0;s:6:"p_open";i:1;a:0:{}i:2;i:1488;}i:80;a:3:{i:0;s:5:"cdata";i:1;a:1:{i:0;s:76:"Computação no Brasil. Marcos e Mizusaki vão falar com Palazzo a respeito.";}i:2;i:1490;}i:81;a:3:{i:0;s:7:"p_close";i:1;a:0:{}i:2;i:1566;}i:82;a:3:{i:0;s:13:"section_close";i:1;a:0:{}i:2;i:1568;}i:83;a:3:{i:0;s:12:"section_edit";i:1;a:4:{i:0;i:1327;i:1;i:1567;i:2;i:2;i:3;s:68:"4. Cooperação Internacional - Interesse pelo curso de Computação";}i:2;i:1568;}i:84;a:3:{i:0;s:6:"header";i:1;a:3:{i:0;s:47:"5. Atividades Culturais / Sugestões de leitura";i:1;i:2;i:2;i:1568;}i:2;i:1568;}i:85;a:3:{i:0;s:12:"section_open";i:1;a:1:{i:0;i:2;}i:2;i:1568;}i:86;a:3:{i:0;s:6:"p_open";i:1;a:0:{}i:2;i:1627;}i:87;a:3:{i:0;s:5:"cdata";i:1;a:1:{i:0;s:29:"
Gabriela fala sobre o livro ";}i:2;i:1628;}i:88;a:3:{i:0;s:18:"doublequoteopening";i:1;a:0:{}i:2;i:1657;}i:89;a:3:{i:0;s:5:"cdata";i:1;a:1:{i:0;s:18:"Profecia Celestina";}i:2;i:1658;}i:90;a:3:{i:0;s:18:"doublequoteclosing";i:1;a:0:{}i:2;i:1676;}i:91;a:3:{i:0;s:5:"cdata";i:1;a:1:{i:0;s:32:". Marcos disse que leu e achou o";}i:2;i:1677;}i:92;a:3:{i:0;s:7:"p_close";i:1;a:0:{}i:2;i:1709;}i:93;a:3:{i:0;s:6:"p_open";i:1;a:0:{}i:2;i:1709;}i:94;a:3:{i:0;s:5:"cdata";i:1;a:1:{i:0;s:5:"livro";}i:2;i:1711;}i:95;a:3:{i:0;s:6:"entity";i:1;a:1:{i:0;s:3:"...";}i:2;i:1716;}i:96;a:3:{i:0;s:5:"cdata";i:1;a:1:{i:0;s:70:" místico demais. Dante sugere leituras sobre o 11 de setembro. Thiago";}i:2;i:1719;}i:97;a:3:{i:0;s:7:"p_close";i:1;a:0:{}i:2;i:1789;}i:98;a:3:{i:0;s:6:"p_open";i:1;a:0:{}i:2;i:1789;}i:99;a:3:{i:0;s:5:"cdata";i:1;a:1:{i:0;s:76:"sugere sobre Lula e as eleições. Todos ficaram de trazer material sobre as";}i:2;i:1791;}i:100;a:3:{i:0;s:7:"p_close";i:1;a:0:{}i:2;i:1867;}i:101;a:3:{i:0;s:6:"p_open";i:1;a:0:{}i:2;i:1867;}i:102;a:3:{i:0;s:5:"cdata";i:1;a:1:{i:0;s:36:"eleições para a próxima reunião.";}i:2;i:1869;}i:103;a:3:{i:0;s:7:"p_close";i:1;a:0:{}i:2;i:1905;}i:104;a:3:{i:0;s:13:"section_close";i:1;a:0:{}i:2;i:1907;}i:105;a:3:{i:0;s:12:"section_edit";i:1;a:4:{i:0;i:1568;i:1;i:1906;i:2;i:2;i:3;s:47:"5. Atividades Culturais / Sugestões de leitura";}i:2;i:1907;}i:106;a:3:{i:0;s:6:"header";i:1;a:3:{i:0;s:41:"6. Apresentação Edital Olimpíadas CNPQ";i:1;i:2;i:2;i:1907;}i:2;i:1907;}i:107;a:3:{i:0;s:12:"section_open";i:1;a:1:{i:0;i:2;}i:2;i:1907;}i:108;a:3:{i:0;s:6:"p_open";i:1;a:0:{}i:2;i:1960;}i:109;a:3:{i:0;s:5:"cdata";i:1;a:1:{i:0;s:84:"
Fundo de 1 milhão para olimpíadas. Thiago sugeriu que fizéssemos um evento desse";}i:2;i:1961;}i:110;a:3:{i:0;s:7:"p_close";i:1;a:0:{}i:2;i:2045;}i:111;a:3:{i:0;s:6:"p_open";i:1;a:0:{}i:2;i:2045;}i:112;a:3:{i:0;s:5:"cdata";i:1;a:1:{i:0;s:81:"tipo, como uma olimpíada de robótica.Mizusaki e3 Thiago ficaram encarregados de";}i:2;i:2047;}i:113;a:3:{i:0;s:7:"p_close";i:1;a:0:{}i:2;i:2128;}i:114;a:3:{i:0;s:6:"p_open";i:1;a:0:{}i:2;i:2128;}i:115;a:3:{i:0;s:5:"cdata";i:1;a:1:{i:0;s:9:"ver isso.";}i:2;i:2130;}i:116;a:3:{i:0;s:7:"p_close";i:1;a:0:{}i:2;i:2139;}i:117;a:3:{i:0;s:13:"section_close";i:1;a:0:{}i:2;i:2141;}i:118;a:3:{i:0;s:12:"section_edit";i:1;a:4:{i:0;i:1907;i:1;i:2140;i:2;i:2;i:3;s:41:"6. Apresentação Edital Olimpíadas CNPQ";}i:2;i:2141;}i:119;a:3:{i:0;s:6:"header";i:1;a:3:{i:0;s:27:"7. Apresentação do Portal";i:1;i:2;i:2;i:2141;}i:2;i:2141;}i:120;a:3:{i:0;s:12:"section_open";i:1;a:1:{i:0;i:2;}i:2;i:2141;}i:121;a:3:{i:0;s:6:"p_open";i:1;a:0:{}i:2;i:2180;}i:122;a:3:{i:0;s:5:"cdata";i:1;a:1:{i:0;s:80:"
Pablo apresentou um esboço (muito bom, por sinal =P) do Portal CENAPET e pediu";}i:2;i:2181;}i:123;a:3:{i:0;s:7:"p_close";i:1;a:0:{}i:2;i:2261;}i:124;a:3:{i:0;s:6:"p_open";i:1;a:0:{}i:2;i:2261;}i:125;a:3:{i:0;s:5:"cdata";i:1;a:1:{i:0;s:24:"sugestões para o grupo.";}i:2;i:2263;}i:126;a:3:{i:0;s:7:"p_close";i:1;a:0:{}i:2;i:2287;}i:127;a:3:{i:0;s:13:"section_close";i:1;a:0:{}i:2;i:2289;}i:128;a:3:{i:0;s:12:"section_edit";i:1;a:4:{i:0;i:2141;i:1;i:2288;i:2;i:2;i:3;s:27:"7. Apresentação do Portal";}i:2;i:2289;}i:129;a:3:{i:0;s:6:"header";i:1;a:3:{i:0;s:42:"8. Prestação de contas Curso de HTML/PHP";i:1;i:2;i:2;i:2289;}i:2;i:2289;}i:130;a:3:{i:0;s:12:"section_open";i:1;a:1:{i:0;i:2;}i:2;i:2289;}i:131;a:3:{i:0;s:6:"p_open";i:1;a:0:{}i:2;i:2343;}i:132;a:3:{i:0;s:5:"cdata";i:1;a:1:{i:0;s:77:"
Pablo disse que a experiência de ministrar o curso foi muito boa. Três dos";}i:2;i:2344;}i:133;a:3:{i:0;s:7:"p_close";i:1;a:0:{}i:2;i:2421;}i:134;a:3:{i:0;s:6:"p_open";i:1;a:0:{}i:2;i:2421;}i:135;a:3:{i:0;s:5:"cdata";i:1;a:1:{i:0;s:79:"inscritos não apareceram, dois dos que foram ainda não pagaram. O livro a ser";}i:2;i:2423;}i:136;a:3:{i:0;s:7:"p_close";i:1;a:0:{}i:2;i:2502;}i:137;a:3:{i:0;s:6:"p_open";i:1;a:0:{}i:2;i:2502;}i:138;a:3:{i:0;s:5:"cdata";i:1;a:1:{i:0;s:21:"comprado será sobre ";}i:2;i:2504;}i:139;a:3:{i:0;s:7:"acronym";i:1;a:1:{i:0;s:3:"PHP";}i:2;i:2525;}i:140;a:3:{i:0;s:5:"cdata";i:1;a:1:{i:0;s:1:".";}i:2;i:2528;}i:141;a:3:{i:0;s:7:"p_close";i:1;a:0:{}i:2;i:2529;}i:142;a:3:{i:0;s:13:"section_close";i:1;a:0:{}i:2;i:2531;}i:143;a:3:{i:0;s:12:"section_edit";i:1;a:4:{i:0;i:2289;i:1;i:2530;i:2;i:2;i:3;s:42:"8. Prestação de contas Curso de HTML/PHP";}i:2;i:2531;}i:144;a:3:{i:0;s:6:"header";i:1;a:3:{i:0;s:33:"9. Feira do livro Ribeirão Preto";i:1;i:2;i:2;i:2531;}i:2;i:2531;}i:145;a:3:{i:0;s:12:"section_open";i:1;a:1:{i:0;i:2;}i:2;i:2531;}i:146;a:3:{i:0;s:6:"p_open";i:1;a:0:{}i:2;i:2576;}i:147;a:3:{i:0;s:5:"cdata";i:1;a:1:{i:0;s:51:"
De 15 a 24 de setembro. Quem vai: Thiago, Fabiano.";}i:2;i:2577;}i:148;a:3:{i:0;s:7:"p_close";i:1;a:0:{}i:2;i:2628;}i:149;a:3:{i:0;s:13:"section_close";i:1;a:0:{}i:2;i:2630;}i:150;a:3:{i:0;s:12:"section_edit";i:1;a:4:{i:0;i:2531;i:1;i:2629;i:2;i:2;i:3;s:33:"9. Feira do livro Ribeirão Preto";}i:2;i:2630;}i:151;a:3:{i:0;s:6:"header";i:1;a:3:{i:0;s:29:"10. Configuração do novo PC";i:1;i:2;i:2;i:2630;}i:2;i:2630;}i:152;a:3:{i:0;s:12:"section_open";i:1;a:1:{i:0;i:2;}i:2;i:2630;}i:153;a:3:{i:0;s:6:"p_open";i:1;a:0:{}i:2;i:2671;}i:154;a:3:{i:0;s:5:"cdata";i:1;a:1:{i:0;s:83:"
gabriela falou sobr os preços das peças do PC novo. No geral, sairia em torno de";}i:2;i:2672;}i:155;a:3:{i:0;s:7:"p_close";i:1;a:0:{}i:2;i:2755;}i:156;a:3:{i:0;s:6:"p_open";i:1;a:0:{}i:2;i:2755;}i:157;a:3:{i:0;s:5:"cdata";i:1;a:1:{i:0;s:83:"R$1300,00, máximo R$1500,00. O processador estava em falta e a motherboard vai ser";}i:2;i:2757;}i:158;a:3:{i:0;s:7:"p_close";i:1;a:0:{}i:2;i:2840;}i:159;a:3:{i:0;s:6:"p_open";i:1;a:0:{}i:2;i:2840;}i:160;a:3:{i:0;s:5:"cdata";i:1;a:1:{i:0;s:79:"trocada por uma melhor. Foi decidido fazer dois computadores de R$1500,00 cada.";}i:2;i:2842;}i:161;a:3:{i:0;s:7:"p_close";i:1;a:0:{}i:2;i:2921;}i:162;a:3:{i:0;s:13:"section_close";i:1;a:0:{}i:2;i:2923;}i:163;a:3:{i:0;s:12:"section_edit";i:1;a:4:{i:0;i:2630;i:1;i:2922;i:2;i:2;i:3;s:29:"10. Configuração do novo PC";}i:2;i:2923;}i:164;a:3:{i:0;s:6:"header";i:1;a:3:{i:0;s:24:"11. Limpeza dos Desktops";i:1;i:2;i:2;i:2923;}i:2;i:2923;}i:165;a:3:{i:0;s:12:"section_open";i:1;a:1:{i:0;i:2;}i:2;i:2923;}i:166;a:3:{i:0;s:6:"p_open";i:1;a:0:{}i:2;i:2959;}i:167;a:3:{i:0;s:5:"cdata";i:1;a:1:{i:0;s:24:"
Tudo pode ser deletado.";}i:2;i:2960;}i:168;a:3:{i:0;s:7:"p_close";i:1;a:0:{}i:2;i:2984;}i:169;a:3:{i:0;s:13:"section_close";i:1;a:0:{}i:2;i:2986;}i:170;a:3:{i:0;s:12:"section_edit";i:1;a:4:{i:0;i:2923;i:1;i:2985;i:2;i:2;i:3;s:24:"11. Limpeza dos Desktops";}i:2;i:2986;}i:171;a:3:{i:0;s:6:"header";i:1;a:3:{i:0;s:42:"12. Primeira reunião do projeto Wikigraph";i:1;i:2;i:2;i:2986;}i:2;i:2986;}i:172;a:3:{i:0;s:12:"section_open";i:1;a:1:{i:0;i:2;}i:2;i:2986;}i:173;a:3:{i:0;s:6:"p_open";i:1;a:0:{}i:2;i:3040;}i:174;a:3:{i:0;s:5:"cdata";i:1;a:1:{i:0;s:79:"
Zambiasi disse que parece que o projetoi vai andar, e que tem tudo para ser um";}i:2;i:3041;}i:175;a:3:{i:0;s:7:"p_close";i:1;a:0:{}i:2;i:3120;}i:176;a:3:{i:0;s:6:"p_open";i:1;a:0:{}i:2;i:3120;}i:177;a:3:{i:0;s:5:"cdata";i:1;a:1:{i:0;s:21:"projeto interessante.";}i:2;i:3122;}i:178;a:3:{i:0;s:7:"p_close";i:1;a:0:{}i:2;i:3143;}i:179;a:3:{i:0;s:13:"section_close";i:1;a:0:{}i:2;i:3145;}i:180;a:3:{i:0;s:12:"section_edit";i:1;a:4:{i:0;i:2986;i:1;i:3144;i:2;i:2;i:3;s:42:"12. Primeira reunião do projeto Wikigraph";}i:2;i:3145;}i:181;a:3:{i:0;s:6:"header";i:1;a:3:{i:0;s:38:"13.Seminário sobre fotografia digital";i:1;i:2;i:2;i:3145;}i:2;i:3145;}i:182;a:3:{i:0;s:12:"section_open";i:1;a:1:{i:0;i:2;}i:2;i:3145;}i:183;a:3:{i:0;s:6:"p_open";i:1;a:0:{}i:2;i:3195;}i:184;a:3:{i:0;s:5:"cdata";i:1;a:1:{i:0;s:39:"
Fica marcado para a próxima reunião.";}i:2;i:3196;}i:185;a:3:{i:0;s:7:"p_close";i:1;a:0:{}i:2;i:3235;}i:186;a:3:{i:0;s:13:"section_close";i:1;a:0:{}i:2;i:3237;}i:187;a:3:{i:0;s:12:"section_edit";i:1;a:4:{i:0;i:3145;i:1;i:3236;i:2;i:2;i:3;s:38:"13.Seminário sobre fotografia digital";}i:2;i:3237;}i:188;a:3:{i:0;s:6:"header";i:1;a:3:{i:0;s:19:"14. Visita ao Museu";i:1;i:2;i:2;i:3237;}i:2;i:3237;}i:189;a:3:{i:0;s:12:"section_open";i:1;a:1:{i:0;i:2;}i:2;i:3237;}i:190;a:3:{i:0;s:6:"p_open";i:1;a:0:{}i:2;i:3268;}i:191;a:3:{i:0;s:5:"cdata";i:1;a:1:{i:0;s:82:"
Uma escola do interior marcou uma visita ao Museu de Informática. Será marcada,";}i:2;i:3269;}i:192;a:3:{i:0;s:7:"p_close";i:1;a:0:{}i:2;i:3351;}i:193;a:3:{i:0;s:6:"p_open";i:1;a:0:{}i:2;i:3351;}i:194;a:3:{i:0;s:5:"cdata";i:1;a:1:{i:0;s:49:"preferencialmente, para dia 19 ou 26 de setembro.";}i:2;i:3353;}i:195;a:3:{i:0;s:7:"p_close";i:1;a:0:{}i:2;i:3402;}i:196;a:3:{i:0;s:13:"section_close";i:1;a:0:{}i:2;i:3404;}i:197;a:3:{i:0;s:12:"section_edit";i:1;a:4:{i:0;i:3237;i:1;i:3403;i:2;i:2;i:3;s:19:"14. Visita ao Museu";}i:2;i:3404;}i:198;a:3:{i:0;s:6:"header";i:1;a:3:{i:0;s:25:"15. Aniversário do capra";i:1;i:2;i:2;i:3404;}i:2;i:3404;}i:199;a:3:{i:0;s:12:"section_open";i:1;a:1:{i:0;i:2;}i:2;i:3404;}i:200;a:3:{i:0;s:6:"p_open";i:1;a:0:{}i:2;i:3441;}i:201;a:3:{i:0;s:5:"cdata";i:1;a:1:{i:0;s:18:"
Parabéns a você";}i:2;i:3442;}i:202;a:3:{i:0;s:6:"entity";i:1;a:1:{i:0;s:3:"...";}i:2;i:3460;}i:203;a:3:{i:0;s:5:"cdata";i:1;a:1:{i:0;s:12:" *clap clap*";}i:2;i:3463;}i:204;a:3:{i:0;s:7:"p_close";i:1;a:0:{}i:2;i:3475;}i:205;a:3:{i:0;s:13:"section_close";i:1;a:0:{}i:2;i:3477;}i:206;a:3:{i:0;s:12:"section_edit";i:1;a:4:{i:0;i:3404;i:1;i:3476;i:2;i:2;i:3;s:25:"15. Aniversário do capra";}i:2;i:3477;}i:207;a:3:{i:0;s:6:"header";i:1;a:3:{i:0;s:27:"16. Reunião currículo ECP";i:1;i:2;i:2;i:3477;}i:2;i:3477;}i:208;a:3:{i:0;s:12:"section_open";i:1;a:1:{i:0;i:2;}i:2;i:3477;}i:209;a:3:{i:0;s:6:"p_open";i:1;a:0:{}i:2;i:3516;}i:210;a:3:{i:0;s:5:"cdata";i:1;a:1:{i:0;s:81:"
É melhor enfatizar os pontos mais importantes, e que cada ponto seja falado por";}i:2;i:3517;}i:211;a:3:{i:0;s:7:"p_close";i:1;a:0:{}i:2;i:3598;}i:212;a:3:{i:0;s:6:"p_open";i:1;a:0:{}i:2;i:3598;}i:213;a:3:{i:0;s:5:"cdata";i:1;a:1:{i:0;s:15:"uma só pessoa.";}i:2;i:3600;}i:214;a:3:{i:0;s:7:"p_close";i:1;a:0:{}i:2;i:3615;}i:215;a:3:{i:0;s:13:"section_close";i:1;a:0:{}i:2;i:3617;}i:216;a:3:{i:0;s:12:"section_edit";i:1;a:4:{i:0;i:3477;i:1;i:3616;i:2;i:2;i:3;s:27:"16. Reunião currículo ECP";}i:2;i:3617;}i:217;a:3:{i:0;s:6:"header";i:1;a:3:{i:0;s:11:"17. RoboEDU";i:1;i:2;i:2;i:3617;}i:2;i:3617;}i:218;a:3:{i:0;s:12:"section_open";i:1;a:1:{i:0;i:2;}i:2;i:3617;}i:219;a:3:{i:0;s:6:"p_open";i:1;a:0:{}i:2;i:3640;}i:220;a:3:{i:0;s:5:"cdata";i:1;a:1:{i:0;s:80:"
Fabiano diz que tudo no RoboEDU, principalmente nas visitas a escolas, deve ser";}i:2;i:3641;}i:221;a:3:{i:0;s:7:"p_close";i:1;a:0:{}i:2;i:3721;}i:222;a:3:{i:0;s:6:"p_open";i:1;a:0:{}i:2;i:3721;}i:223;a:3:{i:0;s:5:"cdata";i:1;a:1:{i:0;s:77:"bem documentado para futuro relatório. Thiago sugere uma reunião semanal ou";}i:2;i:3723;}i:224;a:3:{i:0;s:7:"p_close";i:1;a:0:{}i:2;i:3800;}i:225;a:3:{i:0;s:6:"p_open";i:1;a:0:{}i:2;i:3800;}i:226;a:3:{i:0;s:5:"cdata";i:1;a:1:{i:0;s:81:"quinzenal. A próxima reunião do RoboEDU ficou para o final da próxima reunião";}i:2;i:3802;}i:227;a:3:{i:0;s:7:"p_close";i:1;a:0:{}i:2;i:3883;}i:228;a:3:{i:0;s:6:"p_open";i:1;a:0:{}i:2;i:3883;}i:229;a:3:{i:0;s:5:"cdata";i:1;a:1:{i:0;s:15:"semanal do PET.";}i:2;i:3885;}i:230;a:3:{i:0;s:7:"p_close";i:1;a:0:{}i:2;i:3900;}i:231;a:3:{i:0;s:13:"section_close";i:1;a:0:{}i:2;i:3902;}i:232;a:3:{i:0;s:12:"section_edit";i:1;a:4:{i:0;i:3617;i:1;i:3901;i:2;i:2;i:3;s:11:"17. RoboEDU";}i:2;i:3902;}i:233;a:3:{i:0;s:6:"header";i:1;a:3:{i:0;s:79:"18. Discussão de pontos do relatório do MEC / Avaliação do tutor pelo grupo";i:1;i:2;i:2;i:3902;}i:2;i:3902;}i:234;a:3:{i:0;s:12:"section_open";i:1;a:1:{i:0;i:2;}i:2;i:3902;}i:235;a:3:{i:0;s:6:"p_open";i:1;a:0:{}i:2;i:3993;}i:236;a:3:{i:0;s:5:"cdata";i:1;a:1:{i:0;s:42:"
A avaliação foi concluída com sucesso ";}i:2;i:3994;}i:237;a:3:{i:0;s:6:"smiley";i:1;a:1:{i:0;s:2:"=)";}i:2;i:4036;}i:238;a:3:{i:0;s:7:"p_close";i:1;a:0:{}i:2;i:4038;}i:239;a:3:{i:0;s:13:"section_close";i:1;a:0:{}i:2;i:4039;}i:240;a:3:{i:0;s:12:"section_edit";i:1;a:4:{i:0;i:3902;i:1;i:0;i:2;i:2;i:3;s:79:"18. Discussão de pontos do relatório do MEC / Avaliação do tutor pelo grupo";}i:2;i:4039;}i:241;a:3:{i:0;s:12:"document_end";i:1;a:0:{}i:2;i:4039;}}