a:96:{i:0;a:3:{i:0;s:14:"document_start";i:1;a:0:{}i:2;i:0;}i:1;a:3:{i:0;s:6:"p_open";i:1;a:0:{}i:2;i:0;}i:2;a:3:{i:0;s:7:"p_close";i:1;a:0:{}i:2;i:1;}i:3;a:3:{i:0;s:12:"section_edit";i:1;a:4:{i:0;i:-1;i:1;i:0;i:2;i:1;i:3;s:0:"";}i:2;i:1;}i:4;a:3:{i:0;s:6:"header";i:1;a:3:{i:0;s:29:"Ata da reunião de 21/06/2006";i:1;i:2;i:2;i:1;}i:2;i:1;}i:5;a:3:{i:0;s:12:"section_open";i:1;a:1:{i:0;i:2;}i:2;i:1;}i:6;a:3:{i:0;s:6:"p_open";i:1;a:0:{}i:2;i:42;}i:7;a:3:{i:0;s:5:"cdata";i:1;a:1:{i:0;s:120:"
Presentes: Alexandre, Estevão, Fabiano, Felipe, Gabriela, Lucas Cavalheiro, Lucas Mizusaki, Marcelo, Marcos, Nondillo,";}i:2;i:43;}i:8;a:3:{i:0;s:7:"p_close";i:1;a:0:{}i:2;i:163;}i:9;a:3:{i:0;s:6:"p_open";i:1;a:0:{}i:2;i:163;}i:10;a:3:{i:0;s:5:"cdata";i:1;a:1:{i:0;s:16:"Ricardo e Thiago";}i:2;i:165;}i:11;a:3:{i:0;s:7:"p_close";i:1;a:0:{}i:2;i:181;}i:12;a:3:{i:0;s:6:"p_open";i:1;a:0:{}i:2;i:181;}i:13;a:3:{i:0;s:5:"cdata";i:1;a:1:{i:0;s:23:"Ausentes: Dante e Pablo";}i:2;i:183;}i:14;a:3:{i:0;s:7:"p_close";i:1;a:0:{}i:2;i:206;}i:15;a:3:{i:0;s:6:"p_open";i:1;a:0:{}i:2;i:206;}i:16;a:3:{i:0;s:5:"cdata";i:1;a:1:{i:0;s:38:"Relator: Estevao Naoto Osawa Gutierrez";}i:2;i:208;}i:17;a:3:{i:0;s:7:"p_close";i:1;a:0:{}i:2;i:246;}i:18;a:3:{i:0;s:13:"section_close";i:1;a:0:{}i:2;i:248;}i:19;a:3:{i:0;s:12:"section_edit";i:1;a:4:{i:0;i:1;i:1;i:247;i:2;i:2;i:3;s:29:"Ata da reunião de 21/06/2006";}i:2;i:248;}i:20;a:3:{i:0;s:6:"header";i:1;a:3:{i:0;s:55:"1) Justificativa da Gabriela e dos petianos no InterPET";i:1;i:2;i:2;i:248;}i:2;i:248;}i:21;a:3:{i:0;s:12:"section_open";i:1;a:1:{i:0;i:2;}i:2;i:248;}i:22;a:3:{i:0;s:6:"p_open";i:1;a:0:{}i:2;i:315;}i:23;a:3:{i:0;s:5:"cdata";i:1;a:1:{i:0;s:128:"
Gabriela : Por problemas pessoais ocorridos no dia da reunião anterior, a mesma não pode comparecer a Reunião por motivos de";}i:2;i:316;}i:24;a:3:{i:0;s:7:"p_close";i:1;a:0:{}i:2;i:444;}i:25;a:3:{i:0;s:6:"p_open";i:1;a:0:{}i:2;i:444;}i:26;a:3:{i:0;s:5:"cdata";i:1;a:1:{i:0;s:13:"força maior.";}i:2;i:446;}i:27;a:3:{i:0;s:7:"p_close";i:1;a:0:{}i:2;i:459;}i:28;a:3:{i:0;s:6:"p_open";i:1;a:0:{}i:2;i:459;}i:29;a:3:{i:0;s:5:"cdata";i:1;a:1:{i:0;s:108:"Ausentes no InterPET (Pablo, Marcelo e Nondillo) : Não compareceram enquanto todos deveriam ir ao Interpet.";}i:2;i:461;}i:30;a:3:{i:0;s:7:"p_close";i:1;a:0:{}i:2;i:569;}i:31;a:3:{i:0;s:6:"p_open";i:1;a:0:{}i:2;i:569;}i:32;a:3:{i:0;s:5:"cdata";i:1;a:1:{i:0;s:111:"Ausentes citados acima foram para o historico (o responsavel por botar os respectivos nomes é o Atual relator)";}i:2;i:571;}i:33;a:3:{i:0;s:7:"p_close";i:1;a:0:{}i:2;i:682;}i:34;a:3:{i:0;s:13:"section_close";i:1;a:0:{}i:2;i:684;}i:35;a:3:{i:0;s:12:"section_edit";i:1;a:4:{i:0;i:248;i:1;i:683;i:2;i:2;i:3;s:55:"1) Justificativa da Gabriela e dos petianos no InterPET";}i:2;i:684;}i:36;a:3:{i:0;s:6:"header";i:1;a:3:{i:0;s:75:"2)Discussão a respeito sobre a lista de compras para o material de consumo";i:1;i:2;i:2;i:684;}i:2;i:684;}i:37;a:3:{i:0;s:12:"section_open";i:1;a:1:{i:0;i:2;}i:2;i:684;}i:38;a:3:{i:0;s:6:"p_open";i:1;a:0:{}i:2;i:771;}i:39;a:3:{i:0;s:5:"cdata";i:1;a:1:{i:0;s:226:"
Nondillo sugere que se faça um esforço para não gastar tanto, pois ai sobraria dinhiero para comprar mais um micro. Muitos itens e topicos foram discutidos nesta ocassião e as descisões definitivas foram editadas no trac";}i:2;i:772;}i:40;a:3:{i:0;s:7:"p_close";i:1;a:0:{}i:2;i:998;}i:41;a:3:{i:0;s:6:"p_open";i:1;a:0:{}i:2;i:998;}i:42;a:3:{i:0;s:5:"cdata";i:1;a:1:{i:0;s:1:"(";}i:2;i:1000;}i:43;a:3:{i:0;s:12:"externallink";i:1;a:2:{i:0;s:32:"http://pet/trac/pet/wiki/Consumo";i:1;N;}i:2;i:1001;}i:44;a:3:{i:0;s:5:"cdata";i:1;a:1:{i:0;s:123:"). Alem do material (que consta no Trac), Thiago Presa fica responsavel por comprar EXTRAS (para depois ser resarcido pelos";}i:2;i:1033;}i:45;a:3:{i:0;s:7:"p_close";i:1;a:0:{}i:2;i:1156;}i:46;a:3:{i:0;s:6:"p_open";i:1;a:0:{}i:2;i:1156;}i:47;a:3:{i:0;s:5:"cdata";i:1;a:1:{i:0;s:107:"outros petianos), alem de conversar com o Ezequiel para ver quais lojas ele irá encaminhar os orçamentos.";}i:2;i:1158;}i:48;a:3:{i:0;s:7:"p_close";i:1;a:0:{}i:2;i:1265;}i:49;a:3:{i:0;s:13:"section_close";i:1;a:0:{}i:2;i:1267;}i:50;a:3:{i:0;s:12:"section_edit";i:1;a:4:{i:0;i:684;i:1;i:1266;i:2;i:2;i:3;s:75:"2)Discussão a respeito sobre a lista de compras para o material de consumo";}i:2;i:1267;}i:51;a:3:{i:0;s:6:"header";i:1;a:3:{i:0;s:18:"3)Ciclo de Debates";i:1;i:2;i:2;i:1267;}i:2;i:1267;}i:52;a:3:{i:0;s:12:"section_open";i:1;a:1:{i:0;i:2;}i:2;i:1267;}i:53;a:3:{i:0;s:10:"quote_open";i:1;a:0:{}i:2;i:1298;}i:54;a:3:{i:0;s:5:"cdata";i:1;a:1:{i:0;s:115:" Ciclo de Debates será realizado na Sexta. marcelo relata que pensa-se em chamar um professor de cada area. Ha uma";}i:2;i:1300;}i:55;a:3:{i:0;s:11:"quote_close";i:1;a:0:{}i:2;i:1415;}i:56;a:3:{i:0;s:6:"p_open";i:1;a:0:{}i:2;i:1415;}i:57;a:3:{i:0;s:5:"cdata";i:1;a:1:{i:0;s:50:"
dificuldade para encontrar um professor de ARQ .
";}i:2;i:1416;}i:58;a:3:{i:0;s:7:"p_close";i:1;a:0:{}i:2;i:1466;}i:59;a:3:{i:0;s:10:"quote_open";i:1;a:0:{}i:2;i:1466;}i:60;a:3:{i:0;s:5:"cdata";i:1;a:1:{i:0;s:123:" Marcelo comenta sobre a divulgação , foi enviada por e-mail a lista de graduação e já está no site do PET e da INF).";}i:2;i:1468;}i:61;a:3:{i:0;s:11:"quote_close";i:1;a:0:{}i:2;i:1591;}i:62;a:3:{i:0;s:6:"p_open";i:1;a:0:{}i:2;i:1591;}i:63;a:3:{i:0;s:5:"cdata";i:1;a:1:{i:0;s:127:"
Fabiano confirma que vai opcorrer o 5 (quinto) ciclo (palestra sobre o cara da Australia). Até la o Dante quer se entregue as";}i:2;i:1592;}i:64;a:3:{i:0;s:7:"p_close";i:1;a:0:{}i:2;i:1719;}i:65;a:3:{i:0;s:6:"p_open";i:1;a:0:{}i:2;i:1719;}i:66;a:3:{i:0;s:5:"cdata";i:1;a:1:{i:0;s:123:"sugestões p/ as alterações do Curriculo para o Vice e o Diretor (atual e novo), alem de um relatorio sobre como foram os";}i:2;i:1721;}i:67;a:3:{i:0;s:7:"p_close";i:1;a:0:{}i:2;i:1844;}i:68;a:3:{i:0;s:6:"p_open";i:1;a:0:{}i:2;i:1844;}i:69;a:3:{i:0;s:5:"cdata";i:1;a:1:{i:0;s:31:"ciclos (participantes, assuntos";}i:2;i:1846;}i:70;a:3:{i:0;s:6:"entity";i:1;a:1:{i:0;s:3:"...";}i:2;i:1877;}i:71;a:3:{i:0;s:5:"cdata";i:1;a:1:{i:0;s:85:"). Fica marcado para Segunda-Feira dia 06 de Julho as 14h00 a entregue dos documentos";}i:2;i:1880;}i:72;a:3:{i:0;s:7:"p_close";i:1;a:0:{}i:2;i:1965;}i:73;a:3:{i:0;s:6:"p_open";i:1;a:0:{}i:2;i:1965;}i:74;a:3:{i:0;s:5:"cdata";i:1;a:1:{i:0;s:51:"citados acima + palestra do visitante da Australia.";}i:2;i:1967;}i:75;a:3:{i:0;s:7:"p_close";i:1;a:0:{}i:2;i:2018;}i:76;a:3:{i:0;s:13:"section_close";i:1;a:0:{}i:2;i:2020;}i:77;a:3:{i:0;s:12:"section_edit";i:1;a:4:{i:0;i:1267;i:1;i:2019;i:2;i:2;i:3;s:18:"3)Ciclo de Debates";}i:2;i:2020;}i:78;a:3:{i:0;s:6:"header";i:1;a:3:{i:0;s:31:"4)Atrasos no Inicio da Reunião";i:1;i:2;i:2;i:2020;}i:2;i:2020;}i:79;a:3:{i:0;s:12:"section_open";i:1;a:1:{i:0;i:2;}i:2;i:2020;}i:80;a:3:{i:0;s:6:"p_open";i:1;a:0:{}i:2;i:2063;}i:81;a:3:{i:0;s:5:"cdata";i:1;a:1:{i:0;s:128:"
Lucas comenta que as duas ultimas reuniões tiveram atrasos, até para não prejudicar quem tem compromissos depois da reunião";}i:2;i:2064;}i:82;a:3:{i:0;s:7:"p_close";i:1;a:0:{}i:2;i:2192;}i:83;a:3:{i:0;s:6:"p_open";i:1;a:0:{}i:2;i:2192;}i:84;a:3:{i:0;s:5:"cdata";i:1;a:1:{i:0;s:36:"ou prescisa estudar depois da prova.";}i:2;i:2194;}i:85;a:3:{i:0;s:7:"p_close";i:1;a:0:{}i:2;i:2230;}i:86;a:3:{i:0;s:13:"section_close";i:1;a:0:{}i:2;i:2232;}i:87;a:3:{i:0;s:12:"section_edit";i:1;a:4:{i:0;i:2020;i:1;i:2231;i:2;i:2;i:3;s:31:"4)Atrasos no Inicio da Reunião";}i:2;i:2232;}i:88;a:3:{i:0;s:6:"header";i:1;a:3:{i:0;s:19:"5)Visita a YecnoPUC";i:1;i:2;i:2;i:2232;}i:2;i:2232;}i:89;a:3:{i:0;s:12:"section_open";i:1;a:1:{i:0;i:2;}i:2;i:2232;}i:90;a:3:{i:0;s:6:"p_open";i:1;a:0:{}i:2;i:2263;}i:91;a:3:{i:0;s:5:"cdata";i:1;a:1:{i:0;s:92:"
Visita a TecnoPUC ja esta marcada (ver e-mail; Quem nao for, avisar o quanto antes o Pablo.";}i:2;i:2264;}i:92;a:3:{i:0;s:7:"p_close";i:1;a:0:{}i:2;i:2356;}i:93;a:3:{i:0;s:13:"section_close";i:1;a:0:{}i:2;i:2357;}i:94;a:3:{i:0;s:12:"section_edit";i:1;a:4:{i:0;i:2232;i:1;i:0;i:2;i:2;i:3;s:19:"5)Visita a YecnoPUC";}i:2;i:2357;}i:95;a:3:{i:0;s:12:"document_end";i:1;a:0:{}i:2;i:2357;}}