a:836:{i:0;a:3:{i:0;s:14:"document_start";i:1;a:0:{}i:2;i:0;}i:1;a:3:{i:0;s:6:"p_open";i:1;a:0:{}i:2;i:0;}i:2;a:3:{i:0;s:7:"p_close";i:1;a:0:{}i:2;i:1;}i:3;a:3:{i:0;s:12:"section_edit";i:1;a:4:{i:0;i:-1;i:1;i:0;i:2;i:1;i:3;s:0:"";}i:2;i:1;}i:4;a:3:{i:0;s:6:"header";i:1;a:3:{i:0;s:8:"Antônio";i:1;i:3;i:2;i:1;}i:2;i:1;}i:5;a:3:{i:0;s:12:"section_open";i:1;a:1:{i:0;i:3;}i:2;i:1;}i:6;a:3:{i:0;s:13:"section_close";i:1;a:0:{}i:2;i:21;}i:7;a:3:{i:0;s:12:"section_edit";i:1;a:4:{i:0;i:1;i:1;i:20;i:2;i:3;i:3;s:8:"Antônio";}i:2;i:21;}i:8;a:3:{i:0;s:6:"header";i:1;a:3:{i:0;s:13:"24/09 a 30/09";i:1;i:2;i:2;i:21;}i:2;i:21;}i:9;a:3:{i:0;s:12:"section_open";i:1;a:1:{i:0;i:2;}i:2;i:21;}i:10;a:3:{i:0;s:6:"p_open";i:1;a:0:{}i:2;i:46;}i:11;a:3:{i:0;s:5:"cdata";i:1;a:1:{i:0;s:1:"
";}i:2;i:47;}i:12;a:3:{i:0;s:11:"strong_open";i:1;a:0:{}i:2;i:48;}i:13;a:3:{i:0;s:12:"strong_close";i:1;a:0:{}i:2;i:50;}i:14;a:3:{i:0;s:11:"strong_open";i:1;a:0:{}i:2;i:52;}i:15;a:3:{i:0;s:12:"strong_close";i:1;a:0:{}i:2;i:54;}i:16;a:3:{i:0;s:11:"strong_open";i:1;a:0:{}i:2;i:56;}i:17;a:3:{i:0;s:12:"strong_close";i:1;a:0:{}i:2;i:58;}i:18;a:3:{i:0;s:11:"strong_open";i:1;a:0:{}i:2;i:60;}i:19;a:3:{i:0;s:12:"strong_close";i:1;a:0:{}i:2;i:62;}i:20;a:3:{i:0;s:11:"strong_open";i:1;a:0:{}i:2;i:64;}i:21;a:3:{i:0;s:12:"strong_close";i:1;a:0:{}i:2;i:66;}i:22;a:3:{i:0;s:11:"strong_open";i:1;a:0:{}i:2;i:68;}i:23;a:3:{i:0;s:12:"strong_close";i:1;a:0:{}i:2;i:70;}i:24;a:3:{i:0;s:11:"strong_open";i:1;a:0:{}i:2;i:72;}i:25;a:3:{i:0;s:12:"strong_close";i:1;a:0:{}i:2;i:74;}i:26;a:3:{i:0;s:11:"strong_open";i:1;a:0:{}i:2;i:76;}i:27;a:3:{i:0;s:12:"strong_close";i:1;a:0:{}i:2;i:78;}i:28;a:3:{i:0;s:11:"strong_open";i:1;a:0:{}i:2;i:80;}i:29;a:3:{i:0;s:12:"strong_close";i:1;a:0:{}i:2;i:82;}i:30;a:3:{i:0;s:11:"strong_open";i:1;a:0:{}i:2;i:84;}i:31;a:3:{i:0;s:12:"strong_close";i:1;a:0:{}i:2;i:86;}i:32;a:3:{i:0;s:11:"strong_open";i:1;a:0:{}i:2;i:88;}i:33;a:3:{i:0;s:12:"strong_close";i:1;a:0:{}i:2;i:90;}i:34;a:3:{i:0;s:11:"strong_open";i:1;a:0:{}i:2;i:92;}i:35;a:3:{i:0;s:12:"strong_close";i:1;a:0:{}i:2;i:94;}i:36;a:3:{i:0;s:11:"strong_open";i:1;a:0:{}i:2;i:96;}i:37;a:3:{i:0;s:12:"strong_close";i:1;a:0:{}i:2;i:98;}i:38;a:3:{i:0;s:11:"strong_open";i:1;a:0:{}i:2;i:100;}i:39;a:3:{i:0;s:12:"strong_close";i:1;a:0:{}i:2;i:102;}i:40;a:3:{i:0;s:11:"strong_open";i:1;a:0:{}i:2;i:104;}i:41;a:3:{i:0;s:12:"strong_close";i:1;a:0:{}i:2;i:106;}i:42;a:3:{i:0;s:11:"strong_open";i:1;a:0:{}i:2;i:108;}i:43;a:3:{i:0;s:12:"strong_close";i:1;a:0:{}i:2;i:110;}i:44;a:3:{i:0;s:11:"strong_open";i:1;a:0:{}i:2;i:112;}i:45;a:3:{i:0;s:12:"strong_close";i:1;a:0:{}i:2;i:114;}i:46;a:3:{i:0;s:11:"strong_open";i:1;a:0:{}i:2;i:116;}i:47;a:3:{i:0;s:12:"strong_close";i:1;a:0:{}i:2;i:118;}i:48;a:3:{i:0;s:11:"strong_open";i:1;a:0:{}i:2;i:120;}i:49;a:3:{i:0;s:12:"strong_close";i:1;a:0:{}i:2;i:122;}i:50;a:3:{i:0;s:11:"strong_open";i:1;a:0:{}i:2;i:124;}i:51;a:3:{i:0;s:12:"strong_close";i:1;a:0:{}i:2;i:126;}i:52;a:3:{i:0;s:11:"strong_open";i:1;a:0:{}i:2;i:128;}i:53;a:3:{i:0;s:5:"cdata";i:1;a:1:{i:0;s:131:"

==== Arthur ====

===== 24/09 a 30/09 =====

  * Continuação dos estudos de Java2ME e Bluetooth;
  * Aula na Escola Técnica;

";}i:2;i:130;}i:54;a:3:{i:0;s:12:"strong_close";i:1;a:0:{}i:2;i:261;}i:55;a:3:{i:0;s:11:"strong_open";i:1;a:0:{}i:2;i:263;}i:56;a:3:{i:0;s:12:"strong_close";i:1;a:0:{}i:2;i:265;}i:57;a:3:{i:0;s:11:"strong_open";i:1;a:0:{}i:2;i:267;}i:58;a:3:{i:0;s:12:"strong_close";i:1;a:0:{}i:2;i:269;}i:59;a:3:{i:0;s:11:"strong_open";i:1;a:0:{}i:2;i:271;}i:60;a:3:{i:0;s:12:"strong_close";i:1;a:0:{}i:2;i:273;}i:61;a:3:{i:0;s:11:"strong_open";i:1;a:0:{}i:2;i:275;}i:62;a:3:{i:0;s:12:"strong_close";i:1;a:0:{}i:2;i:277;}i:63;a:3:{i:0;s:11:"strong_open";i:1;a:0:{}i:2;i:279;}i:64;a:3:{i:0;s:12:"strong_close";i:1;a:0:{}i:2;i:281;}i:65;a:3:{i:0;s:11:"strong_open";i:1;a:0:{}i:2;i:283;}i:66;a:3:{i:0;s:12:"strong_close";i:1;a:0:{}i:2;i:285;}i:67;a:3:{i:0;s:11:"strong_open";i:1;a:0:{}i:2;i:287;}i:68;a:3:{i:0;s:12:"strong_close";i:1;a:0:{}i:2;i:289;}i:69;a:3:{i:0;s:11:"strong_open";i:1;a:0:{}i:2;i:291;}i:70;a:3:{i:0;s:12:"strong_close";i:1;a:0:{}i:2;i:293;}i:71;a:3:{i:0;s:11:"strong_open";i:1;a:0:{}i:2;i:295;}i:72;a:3:{i:0;s:12:"strong_close";i:1;a:0:{}i:2;i:297;}i:73;a:3:{i:0;s:11:"strong_open";i:1;a:0:{}i:2;i:299;}i:74;a:3:{i:0;s:12:"strong_close";i:1;a:0:{}i:2;i:301;}i:75;a:3:{i:0;s:11:"strong_open";i:1;a:0:{}i:2;i:303;}i:76;a:3:{i:0;s:12:"strong_close";i:1;a:0:{}i:2;i:305;}i:77;a:3:{i:0;s:11:"strong_open";i:1;a:0:{}i:2;i:307;}i:78;a:3:{i:0;s:12:"strong_close";i:1;a:0:{}i:2;i:309;}i:79;a:3:{i:0;s:11:"strong_open";i:1;a:0:{}i:2;i:311;}i:80;a:3:{i:0;s:12:"strong_close";i:1;a:0:{}i:2;i:313;}i:81;a:3:{i:0;s:11:"strong_open";i:1;a:0:{}i:2;i:315;}i:82;a:3:{i:0;s:12:"strong_close";i:1;a:0:{}i:2;i:317;}i:83;a:3:{i:0;s:11:"strong_open";i:1;a:0:{}i:2;i:319;}i:84;a:3:{i:0;s:12:"strong_close";i:1;a:0:{}i:2;i:321;}i:85;a:3:{i:0;s:11:"strong_open";i:1;a:0:{}i:2;i:323;}i:86;a:3:{i:0;s:12:"strong_close";i:1;a:0:{}i:2;i:325;}i:87;a:3:{i:0;s:11:"strong_open";i:1;a:0:{}i:2;i:327;}i:88;a:3:{i:0;s:12:"strong_close";i:1;a:0:{}i:2;i:329;}i:89;a:3:{i:0;s:11:"strong_open";i:1;a:0:{}i:2;i:331;}i:90;a:3:{i:0;s:12:"strong_close";i:1;a:0:{}i:2;i:333;}i:91;a:3:{i:0;s:11:"strong_open";i:1;a:0:{}i:2;i:335;}i:92;a:3:{i:0;s:12:"strong_close";i:1;a:0:{}i:2;i:337;}i:93;a:3:{i:0;s:11:"strong_open";i:1;a:0:{}i:2;i:339;}i:94;a:3:{i:0;s:12:"strong_close";i:1;a:0:{}i:2;i:341;}i:95;a:3:{i:0;s:7:"p_close";i:1;a:0:{}i:2;i:343;}i:96;a:3:{i:0;s:13:"section_close";i:1;a:0:{}i:2;i:345;}i:97;a:3:{i:0;s:12:"section_edit";i:1;a:4:{i:0;i:21;i:1;i:344;i:2;i:2;i:3;s:13:"24/09 a 30/09";}i:2;i:345;}i:98;a:3:{i:0;s:6:"header";i:1;a:3:{i:0;s:5:"Bruno";i:1;i:3;i:2;i:345;}i:2;i:345;}i:99;a:3:{i:0;s:12:"section_open";i:1;a:1:{i:0;i:3;}i:2;i:345;}i:100;a:3:{i:0;s:13:"section_close";i:1;a:0:{}i:2;i:362;}i:101;a:3:{i:0;s:12:"section_edit";i:1;a:4:{i:0;i:345;i:1;i:361;i:2;i:3;i:3;s:5:"Bruno";}i:2;i:362;}i:102;a:3:{i:0;s:6:"header";i:1;a:3:{i:0;s:13:"24/09 a 30/09";i:1;i:2;i:2;i:362;}i:2;i:362;}i:103;a:3:{i:0;s:12:"section_open";i:1;a:1:{i:0;i:2;}i:2;i:362;}i:104;a:3:{i:0;s:10:"listu_open";i:1;a:0:{}i:2;i:388;}i:105;a:3:{i:0;s:13:"listitem_open";i:1;a:1:{i:0;i:1;}i:2;i:388;}i:106;a:3:{i:0;s:16:"listcontent_open";i:1;a:0:{}i:2;i:388;}i:107;a:3:{i:0;s:5:"cdata";i:1;a:1:{i:0;s:76:" Reunião sobre o MIC com Antonio, Ismael, Marcela, Bruno e Matheus (quarta)";}i:2;i:392;}i:108;a:3:{i:0;s:17:"listcontent_close";i:1;a:0:{}i:2;i:468;}i:109;a:3:{i:0;s:14:"listitem_close";i:1;a:0:{}i:2;i:468;}i:110;a:3:{i:0;s:13:"listitem_open";i:1;a:1:{i:0;i:1;}i:2;i:468;}i:111;a:3:{i:0;s:16:"listcontent_open";i:1;a:0:{}i:2;i:468;}i:112;a:3:{i:0;s:5:"cdata";i:1;a:1:{i:0;s:48:" Recebimento das peças do museu emprestadas à ";}i:2;i:472;}i:113;a:3:{i:0;s:12:"internallink";i:1;a:2:{i:0;s:20:"/trac/wiki/UniRitter";i:1;s:10:"UniRitter?";}i:2;i:520;}i:114;a:3:{i:0;s:5:"cdata";i:1;a:1:{i:0;s:9:" (quarta)";}i:2;i:555;}i:115;a:3:{i:0;s:17:"listcontent_close";i:1;a:0:{}i:2;i:564;}i:116;a:3:{i:0;s:14:"listitem_close";i:1;a:0:{}i:2;i:564;}i:117;a:3:{i:0;s:13:"listitem_open";i:1;a:1:{i:0;i:1;}i:2;i:564;}i:118;a:3:{i:0;s:16:"listcontent_open";i:1;a:0:{}i:2;i:564;}i:119;a:3:{i:0;s:5:"cdata";i:1;a:1:{i:0;s:52:" Terminei o programa de comunicação serial (sexta)";}i:2;i:568;}i:120;a:3:{i:0;s:17:"listcontent_close";i:1;a:0:{}i:2;i:620;}i:121;a:3:{i:0;s:14:"listitem_close";i:1;a:0:{}i:2;i:620;}i:122;a:3:{i:0;s:13:"listitem_open";i:1;a:1:{i:0;i:1;}i:2;i:620;}i:123;a:3:{i:0;s:16:"listcontent_open";i:1;a:0:{}i:2;i:620;}i:124;a:3:{i:0;s:5:"cdata";i:1;a:1:{i:0;s:53:" Terminei o circuito do transmissor de rádio (sexta)";}i:2;i:624;}i:125;a:3:{i:0;s:17:"listcontent_close";i:1;a:0:{}i:2;i:677;}i:126;a:3:{i:0;s:14:"listitem_close";i:1;a:0:{}i:2;i:677;}i:127;a:3:{i:0;s:13:"listitem_open";i:1;a:1:{i:0;i:1;}i:2;i:677;}i:128;a:3:{i:0;s:16:"listcontent_open";i:1;a:0:{}i:2;i:677;}i:129;a:3:{i:0;s:5:"cdata";i:1;a:1:{i:0;s:34:" Comecei estudos sobre PIC (sexta)";}i:2;i:681;}i:130;a:3:{i:0;s:17:"listcontent_close";i:1;a:0:{}i:2;i:715;}i:131;a:3:{i:0;s:14:"listitem_close";i:1;a:0:{}i:2;i:715;}i:132;a:3:{i:0;s:11:"listu_close";i:1;a:0:{}i:2;i:715;}i:133;a:3:{i:0;s:13:"section_close";i:1;a:0:{}i:2;i:717;}i:134;a:3:{i:0;s:12:"section_edit";i:1;a:4:{i:0;i:362;i:1;i:716;i:2;i:2;i:3;s:13:"24/09 a 30/09";}i:2;i:717;}i:135;a:3:{i:0;s:6:"header";i:1;a:3:{i:0;s:13:"01/10 a 07/10";i:1;i:2;i:2;i:717;}i:2;i:717;}i:136;a:3:{i:0;s:12:"section_open";i:1;a:1:{i:0;i:2;}i:2;i:717;}i:137;a:3:{i:0;s:10:"listu_open";i:1;a:0:{}i:2;i:743;}i:138;a:3:{i:0;s:13:"listitem_open";i:1;a:1:{i:0;i:1;}i:2;i:743;}i:139;a:3:{i:0;s:16:"listcontent_open";i:1;a:0:{}i:2;i:743;}i:140;a:3:{i:0;s:5:"cdata";i:1;a:1:{i:0;s:30:" Tarefas administrativas (seg)";}i:2;i:747;}i:141;a:3:{i:0;s:17:"listcontent_close";i:1;a:0:{}i:2;i:777;}i:142;a:3:{i:0;s:14:"listitem_close";i:1;a:0:{}i:2;i:777;}i:143;a:3:{i:0;s:13:"listitem_open";i:1;a:1:{i:0;i:1;}i:2;i:777;}i:144;a:3:{i:0;s:16:"listcontent_open";i:1;a:0:{}i:2;i:777;}i:145;a:3:{i:0;s:5:"cdata";i:1;a:1:{i:0;s:70:" Estudos sobre pic (programacao basica no MPLab) (seg,ter,qua,qui,sex)";}i:2;i:781;}i:146;a:3:{i:0;s:17:"listcontent_close";i:1;a:0:{}i:2;i:851;}i:147;a:3:{i:0;s:14:"listitem_close";i:1;a:0:{}i:2;i:851;}i:148;a:3:{i:0;s:13:"listitem_open";i:1;a:1:{i:0;i:1;}i:2;i:851;}i:149;a:3:{i:0;s:16:"listcontent_open";i:1;a:0:{}i:2;i:851;}i:150;a:3:{i:0;s:5:"cdata";i:1;a:1:{i:0;s:121:" Tarefas administrativas (ajeitar acesso na helena, instalar win na ellen) e de hardware (transformando 2 pcs em 1) (qui)";}i:2;i:855;}i:151;a:3:{i:0;s:17:"listcontent_close";i:1;a:0:{}i:2;i:976;}i:152;a:3:{i:0;s:14:"listitem_close";i:1;a:0:{}i:2;i:976;}i:153;a:3:{i:0;s:11:"listu_close";i:1;a:0:{}i:2;i:976;}i:154;a:3:{i:0;s:6:"p_open";i:1;a:0:{}i:2;i:976;}i:155;a:3:{i:0;s:5:"cdata";i:1;a:1:{i:0;s:1:"
";}i:2;i:977;}i:156;a:3:{i:0;s:11:"strong_open";i:1;a:0:{}i:2;i:978;}i:157;a:3:{i:0;s:12:"strong_close";i:1;a:0:{}i:2;i:980;}i:158;a:3:{i:0;s:11:"strong_open";i:1;a:0:{}i:2;i:982;}i:159;a:3:{i:0;s:12:"strong_close";i:1;a:0:{}i:2;i:984;}i:160;a:3:{i:0;s:11:"strong_open";i:1;a:0:{}i:2;i:986;}i:161;a:3:{i:0;s:12:"strong_close";i:1;a:0:{}i:2;i:988;}i:162;a:3:{i:0;s:11:"strong_open";i:1;a:0:{}i:2;i:990;}i:163;a:3:{i:0;s:12:"strong_close";i:1;a:0:{}i:2;i:992;}i:164;a:3:{i:0;s:11:"strong_open";i:1;a:0:{}i:2;i:994;}i:165;a:3:{i:0;s:12:"strong_close";i:1;a:0:{}i:2;i:996;}i:166;a:3:{i:0;s:11:"strong_open";i:1;a:0:{}i:2;i:998;}i:167;a:3:{i:0;s:12:"strong_close";i:1;a:0:{}i:2;i:1000;}i:168;a:3:{i:0;s:11:"strong_open";i:1;a:0:{}i:2;i:1002;}i:169;a:3:{i:0;s:12:"strong_close";i:1;a:0:{}i:2;i:1004;}i:170;a:3:{i:0;s:11:"strong_open";i:1;a:0:{}i:2;i:1006;}i:171;a:3:{i:0;s:12:"strong_close";i:1;a:0:{}i:2;i:1008;}i:172;a:3:{i:0;s:11:"strong_open";i:1;a:0:{}i:2;i:1010;}i:173;a:3:{i:0;s:12:"strong_close";i:1;a:0:{}i:2;i:1012;}i:174;a:3:{i:0;s:11:"strong_open";i:1;a:0:{}i:2;i:1014;}i:175;a:3:{i:0;s:12:"strong_close";i:1;a:0:{}i:2;i:1016;}i:176;a:3:{i:0;s:11:"strong_open";i:1;a:0:{}i:2;i:1018;}i:177;a:3:{i:0;s:12:"strong_close";i:1;a:0:{}i:2;i:1020;}i:178;a:3:{i:0;s:11:"strong_open";i:1;a:0:{}i:2;i:1022;}i:179;a:3:{i:0;s:12:"strong_close";i:1;a:0:{}i:2;i:1024;}i:180;a:3:{i:0;s:11:"strong_open";i:1;a:0:{}i:2;i:1026;}i:181;a:3:{i:0;s:12:"strong_close";i:1;a:0:{}i:2;i:1028;}i:182;a:3:{i:0;s:11:"strong_open";i:1;a:0:{}i:2;i:1030;}i:183;a:3:{i:0;s:12:"strong_close";i:1;a:0:{}i:2;i:1032;}i:184;a:3:{i:0;s:11:"strong_open";i:1;a:0:{}i:2;i:1034;}i:185;a:3:{i:0;s:12:"strong_close";i:1;a:0:{}i:2;i:1036;}i:186;a:3:{i:0;s:11:"strong_open";i:1;a:0:{}i:2;i:1038;}i:187;a:3:{i:0;s:12:"strong_close";i:1;a:0:{}i:2;i:1040;}i:188;a:3:{i:0;s:11:"strong_open";i:1;a:0:{}i:2;i:1042;}i:189;a:3:{i:0;s:12:"strong_close";i:1;a:0:{}i:2;i:1044;}i:190;a:3:{i:0;s:11:"strong_open";i:1;a:0:{}i:2;i:1046;}i:191;a:3:{i:0;s:12:"strong_close";i:1;a:0:{}i:2;i:1048;}i:192;a:3:{i:0;s:11:"strong_open";i:1;a:0:{}i:2;i:1050;}i:193;a:3:{i:0;s:12:"strong_close";i:1;a:0:{}i:2;i:1052;}i:194;a:3:{i:0;s:11:"strong_open";i:1;a:0:{}i:2;i:1054;}i:195;a:3:{i:0;s:12:"strong_close";i:1;a:0:{}i:2;i:1056;}i:196;a:3:{i:0;s:11:"strong_open";i:1;a:0:{}i:2;i:1058;}i:197;a:3:{i:0;s:5:"cdata";i:1;a:1:{i:0;s:489:"

==== Fabiano ====

===== 24/09 a 30/09 =====

  * Esquematização de horários para semana acadêmica, convite para empresas, descrição da atividade do ciclo de palestras sobre o mercado ecp; (seg, terça)
  * Entrega dos documentos, assinados pelo dante, para o ressarcimento das inscrições do cobenge para o caixa do pet. (terca)
  * Impressão de dois certificados de participação do pet (seg)
  * Digitalização da ata; (terça)
  * Inniciaçização do novo trac. (terça)

";}i:2;i:1060;}i:198;a:3:{i:0;s:12:"strong_close";i:1;a:0:{}i:2;i:1549;}i:199;a:3:{i:0;s:11:"strong_open";i:1;a:0:{}i:2;i:1551;}i:200;a:3:{i:0;s:12:"strong_close";i:1;a:0:{}i:2;i:1553;}i:201;a:3:{i:0;s:11:"strong_open";i:1;a:0:{}i:2;i:1555;}i:202;a:3:{i:0;s:12:"strong_close";i:1;a:0:{}i:2;i:1557;}i:203;a:3:{i:0;s:11:"strong_open";i:1;a:0:{}i:2;i:1559;}i:204;a:3:{i:0;s:12:"strong_close";i:1;a:0:{}i:2;i:1561;}i:205;a:3:{i:0;s:11:"strong_open";i:1;a:0:{}i:2;i:1563;}i:206;a:3:{i:0;s:12:"strong_close";i:1;a:0:{}i:2;i:1565;}i:207;a:3:{i:0;s:11:"strong_open";i:1;a:0:{}i:2;i:1567;}i:208;a:3:{i:0;s:12:"strong_close";i:1;a:0:{}i:2;i:1569;}i:209;a:3:{i:0;s:11:"strong_open";i:1;a:0:{}i:2;i:1571;}i:210;a:3:{i:0;s:12:"strong_close";i:1;a:0:{}i:2;i:1573;}i:211;a:3:{i:0;s:11:"strong_open";i:1;a:0:{}i:2;i:1575;}i:212;a:3:{i:0;s:12:"strong_close";i:1;a:0:{}i:2;i:1577;}i:213;a:3:{i:0;s:11:"strong_open";i:1;a:0:{}i:2;i:1579;}i:214;a:3:{i:0;s:12:"strong_close";i:1;a:0:{}i:2;i:1581;}i:215;a:3:{i:0;s:11:"strong_open";i:1;a:0:{}i:2;i:1583;}i:216;a:3:{i:0;s:12:"strong_close";i:1;a:0:{}i:2;i:1585;}i:217;a:3:{i:0;s:11:"strong_open";i:1;a:0:{}i:2;i:1587;}i:218;a:3:{i:0;s:12:"strong_close";i:1;a:0:{}i:2;i:1589;}i:219;a:3:{i:0;s:11:"strong_open";i:1;a:0:{}i:2;i:1591;}i:220;a:3:{i:0;s:12:"strong_close";i:1;a:0:{}i:2;i:1593;}i:221;a:3:{i:0;s:11:"strong_open";i:1;a:0:{}i:2;i:1595;}i:222;a:3:{i:0;s:12:"strong_close";i:1;a:0:{}i:2;i:1597;}i:223;a:3:{i:0;s:11:"strong_open";i:1;a:0:{}i:2;i:1599;}i:224;a:3:{i:0;s:12:"strong_close";i:1;a:0:{}i:2;i:1601;}i:225;a:3:{i:0;s:11:"strong_open";i:1;a:0:{}i:2;i:1603;}i:226;a:3:{i:0;s:12:"strong_close";i:1;a:0:{}i:2;i:1605;}i:227;a:3:{i:0;s:11:"strong_open";i:1;a:0:{}i:2;i:1607;}i:228;a:3:{i:0;s:12:"strong_close";i:1;a:0:{}i:2;i:1609;}i:229;a:3:{i:0;s:11:"strong_open";i:1;a:0:{}i:2;i:1611;}i:230;a:3:{i:0;s:12:"strong_close";i:1;a:0:{}i:2;i:1613;}i:231;a:3:{i:0;s:11:"strong_open";i:1;a:0:{}i:2;i:1615;}i:232;a:3:{i:0;s:12:"strong_close";i:1;a:0:{}i:2;i:1617;}i:233;a:3:{i:0;s:11:"strong_open";i:1;a:0:{}i:2;i:1619;}i:234;a:3:{i:0;s:12:"strong_close";i:1;a:0:{}i:2;i:1621;}i:235;a:3:{i:0;s:11:"strong_open";i:1;a:0:{}i:2;i:1623;}i:236;a:3:{i:0;s:12:"strong_close";i:1;a:0:{}i:2;i:1625;}i:237;a:3:{i:0;s:11:"strong_open";i:1;a:0:{}i:2;i:1627;}i:238;a:3:{i:0;s:12:"strong_close";i:1;a:0:{}i:2;i:1629;}i:239;a:3:{i:0;s:7:"p_close";i:1;a:0:{}i:2;i:1631;}i:240;a:3:{i:0;s:13:"section_close";i:1;a:0:{}i:2;i:1633;}i:241;a:3:{i:0;s:12:"section_edit";i:1;a:4:{i:0;i:717;i:1;i:1632;i:2;i:2;i:3;s:13:"01/10 a 07/10";}i:2;i:1633;}i:242;a:3:{i:0;s:6:"header";i:1;a:3:{i:0;s:6:"Felipe";i:1;i:3;i:2;i:1633;}i:2;i:1633;}i:243;a:3:{i:0;s:12:"section_open";i:1;a:1:{i:0;i:3;}i:2;i:1633;}i:244;a:3:{i:0;s:13:"section_close";i:1;a:0:{}i:2;i:1651;}i:245;a:3:{i:0;s:12:"section_edit";i:1;a:4:{i:0;i:1633;i:1;i:1650;i:2;i:3;i:3;s:6:"Felipe";}i:2;i:1651;}i:246;a:3:{i:0;s:6:"header";i:1;a:3:{i:0;s:13:"24/09 a 30/09";i:1;i:2;i:2;i:1651;}i:2;i:1651;}i:247;a:3:{i:0;s:12:"section_open";i:1;a:1:{i:0;i:2;}i:2;i:1651;}i:248;a:3:{i:0;s:10:"listu_open";i:1;a:0:{}i:2;i:1677;}i:249;a:3:{i:0;s:13:"listitem_open";i:1;a:1:{i:0;i:1;}i:2;i:1677;}i:250;a:3:{i:0;s:16:"listcontent_open";i:1;a:0:{}i:2;i:1677;}i:251;a:3:{i:0;s:5:"cdata";i:1;a:1:{i:0;s:76:" Reunião sobre o MIC com Antonio, Ismael, Marcela, Bruno e Matheus (quarta)";}i:2;i:1681;}i:252;a:3:{i:0;s:17:"listcontent_close";i:1;a:0:{}i:2;i:1757;}i:253;a:3:{i:0;s:14:"listitem_close";i:1;a:0:{}i:2;i:1757;}i:254;a:3:{i:0;s:13:"listitem_open";i:1;a:1:{i:0;i:1;}i:2;i:1757;}i:255;a:3:{i:0;s:16:"listcontent_open";i:1;a:0:{}i:2;i:1757;}i:256;a:3:{i:0;s:5:"cdata";i:1;a:1:{i:0;s:59:" Migração do Logador de SQLite para MySQL (quarta/quinta)";}i:2;i:1761;}i:257;a:3:{i:0;s:17:"listcontent_close";i:1;a:0:{}i:2;i:1820;}i:258;a:3:{i:0;s:14:"listitem_close";i:1;a:0:{}i:2;i:1820;}i:259;a:3:{i:0;s:13:"listitem_open";i:1;a:1:{i:0;i:1;}i:2;i:1820;}i:260;a:3:{i:0;s:16:"listcontent_open";i:1;a:0:{}i:2;i:1820;}i:261;a:3:{i:0;s:5:"cdata";i:1;a:1:{i:0;s:126:" Ajuda a Marcela na arrumação dos slides da apresentação sobre o KNESIS que o Dante faria na ESEF no dia seguinte (quarta)";}i:2;i:1824;}i:262;a:3:{i:0;s:17:"listcontent_close";i:1;a:0:{}i:2;i:1950;}i:263;a:3:{i:0;s:14:"listitem_close";i:1;a:0:{}i:2;i:1950;}i:264;a:3:{i:0;s:13:"listitem_open";i:1;a:1:{i:0;i:1;}i:2;i:1950;}i:265;a:3:{i:0;s:16:"listcontent_open";i:1;a:0:{}i:2;i:1950;}i:266;a:3:{i:0;s:5:"cdata";i:1;a:1:{i:0;s:63:" Ida a ESEF com a Marcela para assistir a tal palestra (quinta)";}i:2;i:1954;}i:267;a:3:{i:0;s:17:"listcontent_close";i:1;a:0:{}i:2;i:2017;}i:268;a:3:{i:0;s:14:"listitem_close";i:1;a:0:{}i:2;i:2017;}i:269;a:3:{i:0;s:13:"listitem_open";i:1;a:1:{i:0;i:1;}i:2;i:2017;}i:270;a:3:{i:0;s:16:"listcontent_open";i:1;a:0:{}i:2;i:2017;}i:271;a:3:{i:0;s:5:"cdata";i:1;a:1:{i:0;s:134:" Preparação própria, impressão de folhas e encaminhamento de e-mails relativos a reunião sobre a semana acadêmica (quinta/sexta)";}i:2;i:2021;}i:272;a:3:{i:0;s:17:"listcontent_close";i:1;a:0:{}i:2;i:2155;}i:273;a:3:{i:0;s:14:"listitem_close";i:1;a:0:{}i:2;i:2155;}i:274;a:3:{i:0;s:13:"listitem_open";i:1;a:1:{i:0;i:1;}i:2;i:2155;}i:275;a:3:{i:0;s:16:"listcontent_open";i:1;a:0:{}i:2;i:2155;}i:276;a:3:{i:0;s:5:"cdata";i:1;a:1:{i:0;s:74:" Participação na reunião sobre a Semana Acadêmica no Instituto (sexta)";}i:2;i:2159;}i:277;a:3:{i:0;s:17:"listcontent_close";i:1;a:0:{}i:2;i:2233;}i:278;a:3:{i:0;s:14:"listitem_close";i:1;a:0:{}i:2;i:2233;}i:279;a:3:{i:0;s:11:"listu_close";i:1;a:0:{}i:2;i:2233;}i:280;a:3:{i:0;s:13:"section_close";i:1;a:0:{}i:2;i:2235;}i:281;a:3:{i:0;s:12:"section_edit";i:1;a:4:{i:0;i:1651;i:1;i:2234;i:2;i:2;i:3;s:13:"24/09 a 30/09";}i:2;i:2235;}i:282;a:3:{i:0;s:6:"header";i:1;a:3:{i:0;s:13:"01/10 a 07/10";i:1;i:2;i:2;i:2235;}i:2;i:2235;}i:283;a:3:{i:0;s:12:"section_open";i:1;a:1:{i:0;i:2;}i:2;i:2235;}i:284;a:3:{i:0;s:10:"listu_open";i:1;a:0:{}i:2;i:2261;}i:285;a:3:{i:0;s:13:"listitem_open";i:1;a:1:{i:0;i:1;}i:2;i:2261;}i:286;a:3:{i:0;s:16:"listcontent_open";i:1;a:0:{}i:2;i:2261;}i:287;a:3:{i:0;s:5:"cdata";i:1;a:1:{i:0;s:136:" Mudança na planilha enviada pela Galante sobre a Semana Acadêmica / encaminhamento da mesma ao Petianos interessados (segunda/terça)";}i:2;i:2265;}i:288;a:3:{i:0;s:17:"listcontent_close";i:1;a:0:{}i:2;i:2401;}i:289;a:3:{i:0;s:14:"listitem_close";i:1;a:0:{}i:2;i:2401;}i:290;a:3:{i:0;s:13:"listitem_open";i:1;a:1:{i:0;i:1;}i:2;i:2401;}i:291;a:3:{i:0;s:16:"listcontent_open";i:1;a:0:{}i:2;i:2401;}i:292;a:3:{i:0;s:5:"cdata";i:1;a:1:{i:0;s:72:" Confecção da Ata da reunião passada, e arrumação da Pauta (quarta)";}i:2;i:2405;}i:293;a:3:{i:0;s:17:"listcontent_close";i:1;a:0:{}i:2;i:2477;}i:294;a:3:{i:0;s:14:"listitem_close";i:1;a:0:{}i:2;i:2477;}i:295;a:3:{i:0;s:13:"listitem_open";i:1;a:1:{i:0;i:1;}i:2;i:2477;}i:296;a:3:{i:0;s:16:"listcontent_open";i:1;a:0:{}i:2;i:2477;}i:297;a:3:{i:0;s:5:"cdata";i:1;a:1:{i:0;s:161:" Busca dod Materiais de Consumo e entrega da Folha de Efetividade, Planejamento mensal e oficio sobre os certificados de petiano ao Ezequiel, na PROGRAD (quarta)";}i:2;i:2481;}i:298;a:3:{i:0;s:17:"listcontent_close";i:1;a:0:{}i:2;i:2642;}i:299;a:3:{i:0;s:14:"listitem_close";i:1;a:0:{}i:2;i:2642;}i:300;a:3:{i:0;s:13:"listitem_open";i:1;a:1:{i:0;i:1;}i:2;i:2642;}i:301;a:3:{i:0;s:16:"listcontent_open";i:1;a:0:{}i:2;i:2642;}i:302;a:3:{i:0;s:5:"cdata";i:1;a:1:{i:0;s:38:" Término do planejamento do curso de ";}i:2;i:2646;}i:303;a:3:{i:0;s:7:"acronym";i:1;a:1:{i:0;s:3:"PHP";}i:2;i:2684;}i:304;a:3:{i:0;s:5:"cdata";i:1;a:1:{i:0;s:54:" com o Ismael, e envio do mesmo para o Antonio (sexta)";}i:2;i:2687;}i:305;a:3:{i:0;s:17:"listcontent_close";i:1;a:0:{}i:2;i:2741;}i:306;a:3:{i:0;s:14:"listitem_close";i:1;a:0:{}i:2;i:2741;}i:307;a:3:{i:0;s:13:"listitem_open";i:1;a:1:{i:0;i:1;}i:2;i:2741;}i:308;a:3:{i:0;s:16:"listcontent_open";i:1;a:0:{}i:2;i:2741;}i:309;a:3:{i:0;s:5:"cdata";i:1;a:1:{i:0;s:23:" Olhada no material de ";}i:2;i:2745;}i:310;a:3:{i:0;s:7:"acronym";i:1;a:1:{i:0;s:3:"PHP";}i:2;i:2768;}i:311;a:3:{i:0;s:5:"cdata";i:1;a:1:{i:0;s:56:" que já tenho, para ver o que precisa ser feito (sexta)";}i:2;i:2771;}i:312;a:3:{i:0;s:17:"listcontent_close";i:1;a:0:{}i:2;i:2827;}i:313;a:3:{i:0;s:14:"listitem_close";i:1;a:0:{}i:2;i:2827;}i:314;a:3:{i:0;s:11:"listu_close";i:1;a:0:{}i:2;i:2827;}i:315;a:3:{i:0;s:6:"p_open";i:1;a:0:{}i:2;i:2827;}i:316;a:3:{i:0;s:5:"cdata";i:1;a:1:{i:0;s:1:"
";}i:2;i:2828;}i:317;a:3:{i:0;s:11:"strong_open";i:1;a:0:{}i:2;i:2829;}i:318;a:3:{i:0;s:12:"strong_close";i:1;a:0:{}i:2;i:2831;}i:319;a:3:{i:0;s:11:"strong_open";i:1;a:0:{}i:2;i:2833;}i:320;a:3:{i:0;s:12:"strong_close";i:1;a:0:{}i:2;i:2835;}i:321;a:3:{i:0;s:11:"strong_open";i:1;a:0:{}i:2;i:2837;}i:322;a:3:{i:0;s:12:"strong_close";i:1;a:0:{}i:2;i:2839;}i:323;a:3:{i:0;s:11:"strong_open";i:1;a:0:{}i:2;i:2841;}i:324;a:3:{i:0;s:12:"strong_close";i:1;a:0:{}i:2;i:2843;}i:325;a:3:{i:0;s:11:"strong_open";i:1;a:0:{}i:2;i:2845;}i:326;a:3:{i:0;s:12:"strong_close";i:1;a:0:{}i:2;i:2847;}i:327;a:3:{i:0;s:11:"strong_open";i:1;a:0:{}i:2;i:2849;}i:328;a:3:{i:0;s:12:"strong_close";i:1;a:0:{}i:2;i:2851;}i:329;a:3:{i:0;s:11:"strong_open";i:1;a:0:{}i:2;i:2853;}i:330;a:3:{i:0;s:12:"strong_close";i:1;a:0:{}i:2;i:2855;}i:331;a:3:{i:0;s:11:"strong_open";i:1;a:0:{}i:2;i:2857;}i:332;a:3:{i:0;s:12:"strong_close";i:1;a:0:{}i:2;i:2859;}i:333;a:3:{i:0;s:11:"strong_open";i:1;a:0:{}i:2;i:2861;}i:334;a:3:{i:0;s:12:"strong_close";i:1;a:0:{}i:2;i:2863;}i:335;a:3:{i:0;s:11:"strong_open";i:1;a:0:{}i:2;i:2865;}i:336;a:3:{i:0;s:12:"strong_close";i:1;a:0:{}i:2;i:2867;}i:337;a:3:{i:0;s:11:"strong_open";i:1;a:0:{}i:2;i:2869;}i:338;a:3:{i:0;s:12:"strong_close";i:1;a:0:{}i:2;i:2871;}i:339;a:3:{i:0;s:11:"strong_open";i:1;a:0:{}i:2;i:2873;}i:340;a:3:{i:0;s:12:"strong_close";i:1;a:0:{}i:2;i:2875;}i:341;a:3:{i:0;s:11:"strong_open";i:1;a:0:{}i:2;i:2877;}i:342;a:3:{i:0;s:12:"strong_close";i:1;a:0:{}i:2;i:2879;}i:343;a:3:{i:0;s:11:"strong_open";i:1;a:0:{}i:2;i:2881;}i:344;a:3:{i:0;s:12:"strong_close";i:1;a:0:{}i:2;i:2883;}i:345;a:3:{i:0;s:11:"strong_open";i:1;a:0:{}i:2;i:2885;}i:346;a:3:{i:0;s:12:"strong_close";i:1;a:0:{}i:2;i:2887;}i:347;a:3:{i:0;s:11:"strong_open";i:1;a:0:{}i:2;i:2889;}i:348;a:3:{i:0;s:12:"strong_close";i:1;a:0:{}i:2;i:2891;}i:349;a:3:{i:0;s:11:"strong_open";i:1;a:0:{}i:2;i:2893;}i:350;a:3:{i:0;s:12:"strong_close";i:1;a:0:{}i:2;i:2895;}i:351;a:3:{i:0;s:11:"strong_open";i:1;a:0:{}i:2;i:2897;}i:352;a:3:{i:0;s:12:"strong_close";i:1;a:0:{}i:2;i:2899;}i:353;a:3:{i:0;s:11:"strong_open";i:1;a:0:{}i:2;i:2901;}i:354;a:3:{i:0;s:12:"strong_close";i:1;a:0:{}i:2;i:2903;}i:355;a:3:{i:0;s:11:"strong_open";i:1;a:0:{}i:2;i:2905;}i:356;a:3:{i:0;s:12:"strong_close";i:1;a:0:{}i:2;i:2907;}i:357;a:3:{i:0;s:11:"strong_open";i:1;a:0:{}i:2;i:2909;}i:358;a:3:{i:0;s:5:"cdata";i:1;a:1:{i:0;s:48:"

==== Gabriel ====

===== 24/09 a 30/09 =====

";}i:2;i:2911;}i:359;a:3:{i:0;s:12:"strong_close";i:1;a:0:{}i:2;i:2959;}i:360;a:3:{i:0;s:11:"strong_open";i:1;a:0:{}i:2;i:2961;}i:361;a:3:{i:0;s:12:"strong_close";i:1;a:0:{}i:2;i:2963;}i:362;a:3:{i:0;s:11:"strong_open";i:1;a:0:{}i:2;i:2965;}i:363;a:3:{i:0;s:12:"strong_close";i:1;a:0:{}i:2;i:2967;}i:364;a:3:{i:0;s:11:"strong_open";i:1;a:0:{}i:2;i:2969;}i:365;a:3:{i:0;s:12:"strong_close";i:1;a:0:{}i:2;i:2971;}i:366;a:3:{i:0;s:11:"strong_open";i:1;a:0:{}i:2;i:2973;}i:367;a:3:{i:0;s:12:"strong_close";i:1;a:0:{}i:2;i:2975;}i:368;a:3:{i:0;s:11:"strong_open";i:1;a:0:{}i:2;i:2977;}i:369;a:3:{i:0;s:12:"strong_close";i:1;a:0:{}i:2;i:2979;}i:370;a:3:{i:0;s:11:"strong_open";i:1;a:0:{}i:2;i:2981;}i:371;a:3:{i:0;s:12:"strong_close";i:1;a:0:{}i:2;i:2983;}i:372;a:3:{i:0;s:11:"strong_open";i:1;a:0:{}i:2;i:2985;}i:373;a:3:{i:0;s:12:"strong_close";i:1;a:0:{}i:2;i:2987;}i:374;a:3:{i:0;s:11:"strong_open";i:1;a:0:{}i:2;i:2989;}i:375;a:3:{i:0;s:12:"strong_close";i:1;a:0:{}i:2;i:2991;}i:376;a:3:{i:0;s:11:"strong_open";i:1;a:0:{}i:2;i:2993;}i:377;a:3:{i:0;s:12:"strong_close";i:1;a:0:{}i:2;i:2995;}i:378;a:3:{i:0;s:11:"strong_open";i:1;a:0:{}i:2;i:2997;}i:379;a:3:{i:0;s:12:"strong_close";i:1;a:0:{}i:2;i:2999;}i:380;a:3:{i:0;s:11:"strong_open";i:1;a:0:{}i:2;i:3001;}i:381;a:3:{i:0;s:12:"strong_close";i:1;a:0:{}i:2;i:3003;}i:382;a:3:{i:0;s:11:"strong_open";i:1;a:0:{}i:2;i:3005;}i:383;a:3:{i:0;s:12:"strong_close";i:1;a:0:{}i:2;i:3007;}i:384;a:3:{i:0;s:11:"strong_open";i:1;a:0:{}i:2;i:3009;}i:385;a:3:{i:0;s:12:"strong_close";i:1;a:0:{}i:2;i:3011;}i:386;a:3:{i:0;s:11:"strong_open";i:1;a:0:{}i:2;i:3013;}i:387;a:3:{i:0;s:12:"strong_close";i:1;a:0:{}i:2;i:3015;}i:388;a:3:{i:0;s:11:"strong_open";i:1;a:0:{}i:2;i:3017;}i:389;a:3:{i:0;s:12:"strong_close";i:1;a:0:{}i:2;i:3019;}i:390;a:3:{i:0;s:11:"strong_open";i:1;a:0:{}i:2;i:3021;}i:391;a:3:{i:0;s:12:"strong_close";i:1;a:0:{}i:2;i:3023;}i:392;a:3:{i:0;s:11:"strong_open";i:1;a:0:{}i:2;i:3025;}i:393;a:3:{i:0;s:12:"strong_close";i:1;a:0:{}i:2;i:3027;}i:394;a:3:{i:0;s:11:"strong_open";i:1;a:0:{}i:2;i:3029;}i:395;a:3:{i:0;s:12:"strong_close";i:1;a:0:{}i:2;i:3031;}i:396;a:3:{i:0;s:11:"strong_open";i:1;a:0:{}i:2;i:3033;}i:397;a:3:{i:0;s:12:"strong_close";i:1;a:0:{}i:2;i:3035;}i:398;a:3:{i:0;s:11:"strong_open";i:1;a:0:{}i:2;i:3037;}i:399;a:3:{i:0;s:12:"strong_close";i:1;a:0:{}i:2;i:3039;}i:400;a:3:{i:0;s:7:"p_close";i:1;a:0:{}i:2;i:3041;}i:401;a:3:{i:0;s:13:"section_close";i:1;a:0:{}i:2;i:3043;}i:402;a:3:{i:0;s:12:"section_edit";i:1;a:4:{i:0;i:2235;i:1;i:3042;i:2;i:2;i:3;s:13:"01/10 a 07/10";}i:2;i:3043;}i:403;a:3:{i:0;s:6:"header";i:1;a:3:{i:0;s:6:"Ismael";i:1;i:3;i:2;i:3043;}i:2;i:3043;}i:404;a:3:{i:0;s:12:"section_open";i:1;a:1:{i:0;i:3;}i:2;i:3043;}i:405;a:3:{i:0;s:13:"section_close";i:1;a:0:{}i:2;i:3061;}i:406;a:3:{i:0;s:12:"section_edit";i:1;a:4:{i:0;i:3043;i:1;i:3060;i:2;i:3;i:3;s:6:"Ismael";}i:2;i:3061;}i:407;a:3:{i:0;s:6:"header";i:1;a:3:{i:0;s:13:"24/09 a 30/09";i:1;i:2;i:2;i:3061;}i:2;i:3061;}i:408;a:3:{i:0;s:12:"section_open";i:1;a:1:{i:0;i:2;}i:2;i:3061;}i:409;a:3:{i:0;s:10:"listu_open";i:1;a:0:{}i:2;i:3087;}i:410;a:3:{i:0;s:13:"listitem_open";i:1;a:1:{i:0;i:1;}i:2;i:3087;}i:411;a:3:{i:0;s:16:"listcontent_open";i:1;a:0:{}i:2;i:3087;}i:412;a:3:{i:0;s:5:"cdata";i:1;a:1:{i:0;s:21:" Estudo de Java (seg)";}i:2;i:3091;}i:413;a:3:{i:0;s:17:"listcontent_close";i:1;a:0:{}i:2;i:3112;}i:414;a:3:{i:0;s:14:"listitem_close";i:1;a:0:{}i:2;i:3112;}i:415;a:3:{i:0;s:13:"listitem_open";i:1;a:1:{i:0;i:1;}i:2;i:3112;}i:416;a:3:{i:0;s:16:"listcontent_open";i:1;a:0:{}i:2;i:3112;}i:417;a:3:{i:0;s:5:"cdata";i:1;a:1:{i:0;s:68:" Realização do Planejamento Mensal e da Folha de Efetividade (qua)";}i:2;i:3116;}i:418;a:3:{i:0;s:17:"listcontent_close";i:1;a:0:{}i:2;i:3184;}i:419;a:3:{i:0;s:14:"listitem_close";i:1;a:0:{}i:2;i:3184;}i:420;a:3:{i:0;s:13:"listitem_open";i:1;a:1:{i:0;i:1;}i:2;i:3184;}i:421;a:3:{i:0;s:16:"listcontent_open";i:1;a:0:{}i:2;i:3184;}i:422;a:3:{i:0;s:5:"cdata";i:1;a:1:{i:0;s:19:" Reunião MIC (qua)";}i:2;i:3188;}i:423;a:3:{i:0;s:17:"listcontent_close";i:1;a:0:{}i:2;i:3207;}i:424;a:3:{i:0;s:14:"listitem_close";i:1;a:0:{}i:2;i:3207;}i:425;a:3:{i:0;s:13:"listitem_open";i:1;a:1:{i:0;i:1;}i:2;i:3207;}i:426;a:3:{i:0;s:16:"listcontent_open";i:1;a:0:{}i:2;i:3207;}i:427;a:3:{i:0;s:5:"cdata";i:1;a:1:{i:0;s:34:" Criação da página do Curso de ";}i:2;i:3211;}i:428;a:3:{i:0;s:7:"acronym";i:1;a:1:{i:0;s:3:"PHP";}i:2;i:3245;}i:429;a:3:{i:0;s:5:"cdata";i:1;a:1:{i:0;s:14:" no TRAC (qua)";}i:2;i:3248;}i:430;a:3:{i:0;s:17:"listcontent_close";i:1;a:0:{}i:2;i:3262;}i:431;a:3:{i:0;s:14:"listitem_close";i:1;a:0:{}i:2;i:3262;}i:432;a:3:{i:0;s:13:"listitem_open";i:1;a:1:{i:0;i:1;}i:2;i:3262;}i:433;a:3:{i:0;s:16:"listcontent_open";i:1;a:0:{}i:2;i:3262;}i:434;a:3:{i:0;s:5:"cdata";i:1;a:1:{i:0;s:32:" Documentação do logador (sex)";}i:2;i:3266;}i:435;a:3:{i:0;s:17:"listcontent_close";i:1;a:0:{}i:2;i:3298;}i:436;a:3:{i:0;s:14:"listitem_close";i:1;a:0:{}i:2;i:3298;}i:437;a:3:{i:0;s:13:"listitem_open";i:1;a:1:{i:0;i:1;}i:2;i:3298;}i:438;a:3:{i:0;s:16:"listcontent_open";i:1;a:0:{}i:2;i:3298;}i:439;a:3:{i:0;s:5:"cdata";i:1;a:1:{i:0;s:54:" Tentativa de ajeitar o servidor/Apache para o logador";}i:2;i:3302;}i:440;a:3:{i:0;s:17:"listcontent_close";i:1;a:0:{}i:2;i:3356;}i:441;a:3:{i:0;s:14:"listitem_close";i:1;a:0:{}i:2;i:3356;}i:442;a:3:{i:0;s:11:"listu_close";i:1;a:0:{}i:2;i:3356;}i:443;a:3:{i:0;s:13:"section_close";i:1;a:0:{}i:2;i:3358;}i:444;a:3:{i:0;s:12:"section_edit";i:1;a:4:{i:0;i:3061;i:1;i:3357;i:2;i:2;i:3;s:13:"24/09 a 30/09";}i:2;i:3358;}i:445;a:3:{i:0;s:6:"header";i:1;a:3:{i:0;s:13:"01/10 a 07/10";i:1;i:3;i:2;i:3358;}i:2;i:3358;}i:446;a:3:{i:0;s:12:"section_open";i:1;a:1:{i:0;i:3;}i:2;i:3358;}i:447;a:3:{i:0;s:10:"listu_open";i:1;a:0:{}i:2;i:3382;}i:448;a:3:{i:0;s:13:"listitem_open";i:1;a:1:{i:0;i:1;}i:2;i:3382;}i:449;a:3:{i:0;s:16:"listcontent_open";i:1;a:0:{}i:2;i:3382;}i:450;a:3:{i:0;s:5:"cdata";i:1;a:1:{i:0;s:49:" Continuação da documentação do logador (seg)";}i:2;i:3386;}i:451;a:3:{i:0;s:17:"listcontent_close";i:1;a:0:{}i:2;i:3435;}i:452;a:3:{i:0;s:14:"listitem_close";i:1;a:0:{}i:2;i:3435;}i:453;a:3:{i:0;s:13:"listitem_open";i:1;a:1:{i:0;i:1;}i:2;i:3435;}i:454;a:3:{i:0;s:16:"listcontent_open";i:1;a:0:{}i:2;i:3435;}i:455;a:3:{i:0;s:5:"cdata";i:1;a:1:{i:0;s:127:" Reunião da Comissão de Seleção, falada com Weber e Dante, espalhamento de cartazes, envio de e-mails, definição de datas";}i:2;i:3439;}i:456;a:3:{i:0;s:6:"entity";i:1;a:1:{i:0;s:3:"...";}i:2;i:3566;}i:457;a:3:{i:0;s:5:"cdata";i:1;a:1:{i:0;s:10:" (qui-sex)";}i:2;i:3569;}i:458;a:3:{i:0;s:17:"listcontent_close";i:1;a:0:{}i:2;i:3579;}i:459;a:3:{i:0;s:14:"listitem_close";i:1;a:0:{}i:2;i:3579;}i:460;a:3:{i:0;s:13:"listitem_open";i:1;a:1:{i:0;i:1;}i:2;i:3579;}i:461;a:3:{i:0;s:16:"listcontent_open";i:1;a:0:{}i:2;i:3579;}i:462;a:3:{i:0;s:5:"cdata";i:1;a:1:{i:0;s:11:" Estudo de ";}i:2;i:3583;}i:463;a:3:{i:0;s:7:"acronym";i:1;a:1:{i:0;s:3:"CSS";}i:2;i:3594;}i:464;a:3:{i:0;s:5:"cdata";i:1;a:1:{i:0;s:29:" para o site do MIC (qui-sex)";}i:2;i:3597;}i:465;a:3:{i:0;s:17:"listcontent_close";i:1;a:0:{}i:2;i:3626;}i:466;a:3:{i:0;s:14:"listitem_close";i:1;a:0:{}i:2;i:3626;}i:467;a:3:{i:0;s:13:"listitem_open";i:1;a:1:{i:0;i:1;}i:2;i:3626;}i:468;a:3:{i:0;s:16:"listcontent_open";i:1;a:0:{}i:2;i:3626;}i:469;a:3:{i:0;s:5:"cdata";i:1;a:1:{i:0;s:49:" Criação do site para inscrições do curso de ";}i:2;i:3630;}i:470;a:3:{i:0;s:7:"acronym";i:1;a:1:{i:0;s:3:"PHP";}i:2;i:3679;}i:471;a:3:{i:0;s:5:"cdata";i:1;a:1:{i:0;s:45:" e definição de quem irá fazer o que (sex)";}i:2;i:3682;}i:472;a:3:{i:0;s:17:"listcontent_close";i:1;a:0:{}i:2;i:3727;}i:473;a:3:{i:0;s:14:"listitem_close";i:1;a:0:{}i:2;i:3727;}i:474;a:3:{i:0;s:13:"listitem_open";i:1;a:1:{i:0;i:1;}i:2;i:3727;}i:475;a:3:{i:0;s:16:"listcontent_open";i:1;a:0:{}i:2;i:3727;}i:476;a:3:{i:0;s:5:"cdata";i:1;a:1:{i:0;s:37:" Pegada dos certificados do curso de ";}i:2;i:3731;}i:477;a:3:{i:0;s:7:"acronym";i:1;a:1:{i:0;s:3:"PHP";}i:2;i:3768;}i:478;a:3:{i:0;s:5:"cdata";i:1;a:1:{i:0;s:61:" na 'Lurdinha' e envio de e-mail avisando a graduação (qui)";}i:2;i:3771;}i:479;a:3:{i:0;s:17:"listcontent_close";i:1;a:0:{}i:2;i:3832;}i:480;a:3:{i:0;s:14:"listitem_close";i:1;a:0:{}i:2;i:3832;}i:481;a:3:{i:0;s:11:"listu_close";i:1;a:0:{}i:2;i:3832;}i:482;a:3:{i:0;s:6:"p_open";i:1;a:0:{}i:2;i:3832;}i:483;a:3:{i:0;s:5:"cdata";i:1;a:1:{i:0;s:1:"
";}i:2;i:3833;}i:484;a:3:{i:0;s:11:"strong_open";i:1;a:0:{}i:2;i:3834;}i:485;a:3:{i:0;s:12:"strong_close";i:1;a:0:{}i:2;i:3836;}i:486;a:3:{i:0;s:11:"strong_open";i:1;a:0:{}i:2;i:3838;}i:487;a:3:{i:0;s:12:"strong_close";i:1;a:0:{}i:2;i:3840;}i:488;a:3:{i:0;s:11:"strong_open";i:1;a:0:{}i:2;i:3842;}i:489;a:3:{i:0;s:12:"strong_close";i:1;a:0:{}i:2;i:3844;}i:490;a:3:{i:0;s:11:"strong_open";i:1;a:0:{}i:2;i:3846;}i:491;a:3:{i:0;s:12:"strong_close";i:1;a:0:{}i:2;i:3848;}i:492;a:3:{i:0;s:11:"strong_open";i:1;a:0:{}i:2;i:3850;}i:493;a:3:{i:0;s:12:"strong_close";i:1;a:0:{}i:2;i:3852;}i:494;a:3:{i:0;s:11:"strong_open";i:1;a:0:{}i:2;i:3854;}i:495;a:3:{i:0;s:12:"strong_close";i:1;a:0:{}i:2;i:3856;}i:496;a:3:{i:0;s:11:"strong_open";i:1;a:0:{}i:2;i:3858;}i:497;a:3:{i:0;s:12:"strong_close";i:1;a:0:{}i:2;i:3860;}i:498;a:3:{i:0;s:11:"strong_open";i:1;a:0:{}i:2;i:3862;}i:499;a:3:{i:0;s:12:"strong_close";i:1;a:0:{}i:2;i:3864;}i:500;a:3:{i:0;s:11:"strong_open";i:1;a:0:{}i:2;i:3866;}i:501;a:3:{i:0;s:12:"strong_close";i:1;a:0:{}i:2;i:3868;}i:502;a:3:{i:0;s:11:"strong_open";i:1;a:0:{}i:2;i:3870;}i:503;a:3:{i:0;s:12:"strong_close";i:1;a:0:{}i:2;i:3872;}i:504;a:3:{i:0;s:11:"strong_open";i:1;a:0:{}i:2;i:3874;}i:505;a:3:{i:0;s:12:"strong_close";i:1;a:0:{}i:2;i:3876;}i:506;a:3:{i:0;s:11:"strong_open";i:1;a:0:{}i:2;i:3878;}i:507;a:3:{i:0;s:12:"strong_close";i:1;a:0:{}i:2;i:3880;}i:508;a:3:{i:0;s:11:"strong_open";i:1;a:0:{}i:2;i:3882;}i:509;a:3:{i:0;s:12:"strong_close";i:1;a:0:{}i:2;i:3884;}i:510;a:3:{i:0;s:11:"strong_open";i:1;a:0:{}i:2;i:3886;}i:511;a:3:{i:0;s:12:"strong_close";i:1;a:0:{}i:2;i:3888;}i:512;a:3:{i:0;s:11:"strong_open";i:1;a:0:{}i:2;i:3890;}i:513;a:3:{i:0;s:12:"strong_close";i:1;a:0:{}i:2;i:3892;}i:514;a:3:{i:0;s:11:"strong_open";i:1;a:0:{}i:2;i:3894;}i:515;a:3:{i:0;s:12:"strong_close";i:1;a:0:{}i:2;i:3896;}i:516;a:3:{i:0;s:11:"strong_open";i:1;a:0:{}i:2;i:3898;}i:517;a:3:{i:0;s:12:"strong_close";i:1;a:0:{}i:2;i:3900;}i:518;a:3:{i:0;s:11:"strong_open";i:1;a:0:{}i:2;i:3902;}i:519;a:3:{i:0;s:12:"strong_close";i:1;a:0:{}i:2;i:3904;}i:520;a:3:{i:0;s:11:"strong_open";i:1;a:0:{}i:2;i:3906;}i:521;a:3:{i:0;s:12:"strong_close";i:1;a:0:{}i:2;i:3908;}i:522;a:3:{i:0;s:11:"strong_open";i:1;a:0:{}i:2;i:3910;}i:523;a:3:{i:0;s:12:"strong_close";i:1;a:0:{}i:2;i:3912;}i:524;a:3:{i:0;s:11:"strong_open";i:1;a:0:{}i:2;i:3914;}i:525;a:3:{i:0;s:5:"cdata";i:1;a:1:{i:0;s:591:"

==== Lucas ====

===== 24/09 a 30/09 =====

  * Aulas para a escola Técnica;
  * Esquematização de horários para semana acadêmica;
  * Um monte de coisinhas que nao me lembro;

===== 1/10 a 7/10 =====

  * Encontro com o professor Tamanha, coordnador das engenharias (segunda, 25min);
  * Planejamentos da semana acadêmica;
  * Final da reforma no robô seguidor;
  * Alguma programação do robô-seguidor;

===== 8/10 a 14/10 =====

  * Planejamentos da semana acadêmica - Horários, confirmações e folder (segunda, terça);
  * Trabalhei com a apresentação do PET (terça);

";}i:2;i:3916;}i:526;a:3:{i:0;s:12:"strong_close";i:1;a:0:{}i:2;i:4507;}i:527;a:3:{i:0;s:11:"strong_open";i:1;a:0:{}i:2;i:4509;}i:528;a:3:{i:0;s:12:"strong_close";i:1;a:0:{}i:2;i:4511;}i:529;a:3:{i:0;s:11:"strong_open";i:1;a:0:{}i:2;i:4513;}i:530;a:3:{i:0;s:12:"strong_close";i:1;a:0:{}i:2;i:4515;}i:531;a:3:{i:0;s:11:"strong_open";i:1;a:0:{}i:2;i:4517;}i:532;a:3:{i:0;s:12:"strong_close";i:1;a:0:{}i:2;i:4519;}i:533;a:3:{i:0;s:11:"strong_open";i:1;a:0:{}i:2;i:4521;}i:534;a:3:{i:0;s:12:"strong_close";i:1;a:0:{}i:2;i:4523;}i:535;a:3:{i:0;s:11:"strong_open";i:1;a:0:{}i:2;i:4525;}i:536;a:3:{i:0;s:12:"strong_close";i:1;a:0:{}i:2;i:4527;}i:537;a:3:{i:0;s:11:"strong_open";i:1;a:0:{}i:2;i:4529;}i:538;a:3:{i:0;s:12:"strong_close";i:1;a:0:{}i:2;i:4531;}i:539;a:3:{i:0;s:11:"strong_open";i:1;a:0:{}i:2;i:4533;}i:540;a:3:{i:0;s:12:"strong_close";i:1;a:0:{}i:2;i:4535;}i:541;a:3:{i:0;s:11:"strong_open";i:1;a:0:{}i:2;i:4537;}i:542;a:3:{i:0;s:12:"strong_close";i:1;a:0:{}i:2;i:4539;}i:543;a:3:{i:0;s:11:"strong_open";i:1;a:0:{}i:2;i:4541;}i:544;a:3:{i:0;s:12:"strong_close";i:1;a:0:{}i:2;i:4543;}i:545;a:3:{i:0;s:11:"strong_open";i:1;a:0:{}i:2;i:4545;}i:546;a:3:{i:0;s:12:"strong_close";i:1;a:0:{}i:2;i:4547;}i:547;a:3:{i:0;s:11:"strong_open";i:1;a:0:{}i:2;i:4549;}i:548;a:3:{i:0;s:12:"strong_close";i:1;a:0:{}i:2;i:4551;}i:549;a:3:{i:0;s:11:"strong_open";i:1;a:0:{}i:2;i:4553;}i:550;a:3:{i:0;s:12:"strong_close";i:1;a:0:{}i:2;i:4555;}i:551;a:3:{i:0;s:11:"strong_open";i:1;a:0:{}i:2;i:4557;}i:552;a:3:{i:0;s:12:"strong_close";i:1;a:0:{}i:2;i:4559;}i:553;a:3:{i:0;s:11:"strong_open";i:1;a:0:{}i:2;i:4561;}i:554;a:3:{i:0;s:12:"strong_close";i:1;a:0:{}i:2;i:4563;}i:555;a:3:{i:0;s:11:"strong_open";i:1;a:0:{}i:2;i:4565;}i:556;a:3:{i:0;s:12:"strong_close";i:1;a:0:{}i:2;i:4567;}i:557;a:3:{i:0;s:11:"strong_open";i:1;a:0:{}i:2;i:4569;}i:558;a:3:{i:0;s:12:"strong_close";i:1;a:0:{}i:2;i:4571;}i:559;a:3:{i:0;s:11:"strong_open";i:1;a:0:{}i:2;i:4573;}i:560;a:3:{i:0;s:12:"strong_close";i:1;a:0:{}i:2;i:4575;}i:561;a:3:{i:0;s:11:"strong_open";i:1;a:0:{}i:2;i:4577;}i:562;a:3:{i:0;s:12:"strong_close";i:1;a:0:{}i:2;i:4579;}i:563;a:3:{i:0;s:11:"strong_open";i:1;a:0:{}i:2;i:4581;}i:564;a:3:{i:0;s:12:"strong_close";i:1;a:0:{}i:2;i:4583;}i:565;a:3:{i:0;s:11:"strong_open";i:1;a:0:{}i:2;i:4585;}i:566;a:3:{i:0;s:12:"strong_close";i:1;a:0:{}i:2;i:4587;}i:567;a:3:{i:0;s:7:"p_close";i:1;a:0:{}i:2;i:4589;}i:568;a:3:{i:0;s:13:"section_close";i:1;a:0:{}i:2;i:4591;}i:569;a:3:{i:0;s:12:"section_edit";i:1;a:4:{i:0;i:3358;i:1;i:4590;i:2;i:3;i:3;s:13:"01/10 a 07/10";}i:2;i:4591;}i:570;a:3:{i:0;s:6:"header";i:1;a:3:{i:0;s:7:"Marcela";i:1;i:3;i:2;i:4591;}i:2;i:4591;}i:571;a:3:{i:0;s:12:"section_open";i:1;a:1:{i:0;i:3;}i:2;i:4591;}i:572;a:3:{i:0;s:13:"section_close";i:1;a:0:{}i:2;i:4610;}i:573;a:3:{i:0;s:12:"section_edit";i:1;a:4:{i:0;i:4591;i:1;i:4609;i:2;i:3;i:3;s:7:"Marcela";}i:2;i:4610;}i:574;a:3:{i:0;s:6:"header";i:1;a:3:{i:0;s:13:"24/09 a 30/09";i:1;i:2;i:2;i:4610;}i:2;i:4610;}i:575;a:3:{i:0;s:12:"section_open";i:1;a:1:{i:0;i:2;}i:2;i:4610;}i:576;a:3:{i:0;s:10:"listu_open";i:1;a:0:{}i:2;i:4636;}i:577;a:3:{i:0;s:13:"listitem_open";i:1;a:1:{i:0;i:1;}i:2;i:4636;}i:578;a:3:{i:0;s:16:"listcontent_open";i:1;a:0:{}i:2;i:4636;}i:579;a:3:{i:0;s:5:"cdata";i:1;a:1:{i:0;s:11:" estudo de ";}i:2;i:4640;}i:580;a:3:{i:0;s:7:"acronym";i:1;a:1:{i:0;s:3:"PHP";}i:2;i:4651;}i:581;a:3:{i:0;s:5:"cdata";i:1;a:1:{i:0;s:6:" (qua)";}i:2;i:4654;}i:582;a:3:{i:0;s:17:"listcontent_close";i:1;a:0:{}i:2;i:4660;}i:583;a:3:{i:0;s:14:"listitem_close";i:1;a:0:{}i:2;i:4660;}i:584;a:3:{i:0;s:13:"listitem_open";i:1;a:1:{i:0;i:1;}i:2;i:4660;}i:585;a:3:{i:0;s:16:"listcontent_open";i:1;a:0:{}i:2;i:4660;}i:586;a:3:{i:0;s:5:"cdata";i:1;a:1:{i:0;s:45:" implementação do escorpiao - RoboEDU (ter)";}i:2;i:4664;}i:587;a:3:{i:0;s:17:"listcontent_close";i:1;a:0:{}i:2;i:4709;}i:588;a:3:{i:0;s:14:"listitem_close";i:1;a:0:{}i:2;i:4709;}i:589;a:3:{i:0;s:13:"listitem_open";i:1;a:1:{i:0;i:1;}i:2;i:4709;}i:590;a:3:{i:0;s:16:"listcontent_open";i:1;a:0:{}i:2;i:4709;}i:591;a:3:{i:0;s:5:"cdata";i:1;a:1:{i:0;s:72:" leitura de artigos sobre visão de futebol de robos - ROBOPET (seg/ter)";}i:2;i:4713;}i:592;a:3:{i:0;s:17:"listcontent_close";i:1;a:0:{}i:2;i:4785;}i:593;a:3:{i:0;s:14:"listitem_close";i:1;a:0:{}i:2;i:4785;}i:594;a:3:{i:0;s:13:"listitem_open";i:1;a:1:{i:0;i:1;}i:2;i:4785;}i:595;a:3:{i:0;s:16:"listcontent_open";i:1;a:0:{}i:2;i:4785;}i:596;a:3:{i:0;s:5:"cdata";i:1;a:1:{i:0;s:19:" reunião MIC (qua)";}i:2;i:4789;}i:597;a:3:{i:0;s:17:"listcontent_close";i:1;a:0:{}i:2;i:4808;}i:598;a:3:{i:0;s:14:"listitem_close";i:1;a:0:{}i:2;i:4808;}i:599;a:3:{i:0;s:13:"listitem_open";i:1;a:1:{i:0;i:1;}i:2;i:4808;}i:600;a:3:{i:0;s:16:"listcontent_open";i:1;a:0:{}i:2;i:4808;}i:601;a:3:{i:0;s:5:"cdata";i:1;a:1:{i:0;s:57:" slides: Avaliação de Esportes de Alto Rendimento (qua)";}i:2;i:4812;}i:602;a:3:{i:0;s:17:"listcontent_close";i:1;a:0:{}i:2;i:4869;}i:603;a:3:{i:0;s:14:"listitem_close";i:1;a:0:{}i:2;i:4869;}i:604;a:3:{i:0;s:13:"listitem_open";i:1;a:1:{i:0;i:1;}i:2;i:4869;}i:605;a:3:{i:0;s:16:"listcontent_open";i:1;a:0:{}i:2;i:4869;}i:606;a:3:{i:0;s:5:"cdata";i:1;a:1:{i:0;s:57:" participação na apresentação do projeto KNASIS (qui)";}i:2;i:4873;}i:607;a:3:{i:0;s:17:"listcontent_close";i:1;a:0:{}i:2;i:4930;}i:608;a:3:{i:0;s:14:"listitem_close";i:1;a:0:{}i:2;i:4930;}i:609;a:3:{i:0;s:11:"listu_close";i:1;a:0:{}i:2;i:4930;}i:610;a:3:{i:0;s:13:"section_close";i:1;a:0:{}i:2;i:4932;}i:611;a:3:{i:0;s:12:"section_edit";i:1;a:4:{i:0;i:4610;i:1;i:4931;i:2;i:2;i:3;s:13:"24/09 a 30/09";}i:2;i:4932;}i:612;a:3:{i:0;s:6:"header";i:1;a:3:{i:0;s:13:"01/10 a 07/10";i:1;i:2;i:2;i:4932;}i:2;i:4932;}i:613;a:3:{i:0;s:12:"section_open";i:1;a:1:{i:0;i:2;}i:2;i:4932;}i:614;a:3:{i:0;s:10:"listu_open";i:1;a:0:{}i:2;i:4958;}i:615;a:3:{i:0;s:13:"listitem_open";i:1;a:1:{i:0;i:1;}i:2;i:4958;}i:616;a:3:{i:0;s:16:"listcontent_open";i:1;a:0:{}i:2;i:4958;}i:617;a:3:{i:0;s:5:"cdata";i:1;a:1:{i:0;s:20:" robo carrinho (sex)";}i:2;i:4962;}i:618;a:3:{i:0;s:17:"listcontent_close";i:1;a:0:{}i:2;i:4982;}i:619;a:3:{i:0;s:14:"listitem_close";i:1;a:0:{}i:2;i:4982;}i:620;a:3:{i:0;s:13:"listitem_open";i:1;a:1:{i:0;i:1;}i:2;i:4982;}i:621;a:3:{i:0;s:16:"listcontent_open";i:1;a:0:{}i:2;i:4982;}i:622;a:3:{i:0;s:5:"cdata";i:1;a:1:{i:0;s:32:" estudo de php (seg/ter/qua/qui)";}i:2;i:4986;}i:623;a:3:{i:0;s:17:"listcontent_close";i:1;a:0:{}i:2;i:5018;}i:624;a:3:{i:0;s:14:"listitem_close";i:1;a:0:{}i:2;i:5018;}i:625;a:3:{i:0;s:13:"listitem_open";i:1;a:1:{i:0;i:1;}i:2;i:5018;}i:626;a:3:{i:0;s:16:"listcontent_open";i:1;a:0:{}i:2;i:5018;}i:627;a:3:{i:0;s:5:"cdata";i:1;a:1:{i:0;s:33:" ajuda na IA so robopet (qui/sex)";}i:2;i:5022;}i:628;a:3:{i:0;s:17:"listcontent_close";i:1;a:0:{}i:2;i:5055;}i:629;a:3:{i:0;s:14:"listitem_close";i:1;a:0:{}i:2;i:5055;}i:630;a:3:{i:0;s:13:"listitem_open";i:1;a:1:{i:0;i:1;}i:2;i:5055;}i:631;a:3:{i:0;s:16:"listcontent_open";i:1;a:0:{}i:2;i:5055;}i:632;a:3:{i:0;s:5:"cdata";i:1;a:1:{i:0;s:12:" site do mic";}i:2;i:5059;}i:633;a:3:{i:0;s:17:"listcontent_close";i:1;a:0:{}i:2;i:5071;}i:634;a:3:{i:0;s:14:"listitem_close";i:1;a:0:{}i:2;i:5071;}i:635;a:3:{i:0;s:13:"listitem_open";i:1;a:1:{i:0;i:1;}i:2;i:5071;}i:636;a:3:{i:0;s:16:"listcontent_open";i:1;a:0:{}i:2;i:5071;}i:637;a:3:{i:0;s:5:"cdata";i:1;a:1:{i:0;s:48:" comissao de seleção (e-mail e cartazes) (sex)";}i:2;i:5075;}i:638;a:3:{i:0;s:17:"listcontent_close";i:1;a:0:{}i:2;i:5123;}i:639;a:3:{i:0;s:14:"listitem_close";i:1;a:0:{}i:2;i:5123;}i:640;a:3:{i:0;s:11:"listu_close";i:1;a:0:{}i:2;i:5123;}i:641;a:3:{i:0;s:6:"p_open";i:1;a:0:{}i:2;i:5123;}i:642;a:3:{i:0;s:5:"cdata";i:1;a:1:{i:0;s:1:"
";}i:2;i:5124;}i:643;a:3:{i:0;s:11:"strong_open";i:1;a:0:{}i:2;i:5125;}i:644;a:3:{i:0;s:12:"strong_close";i:1;a:0:{}i:2;i:5127;}i:645;a:3:{i:0;s:11:"strong_open";i:1;a:0:{}i:2;i:5129;}i:646;a:3:{i:0;s:12:"strong_close";i:1;a:0:{}i:2;i:5131;}i:647;a:3:{i:0;s:11:"strong_open";i:1;a:0:{}i:2;i:5133;}i:648;a:3:{i:0;s:12:"strong_close";i:1;a:0:{}i:2;i:5135;}i:649;a:3:{i:0;s:11:"strong_open";i:1;a:0:{}i:2;i:5137;}i:650;a:3:{i:0;s:12:"strong_close";i:1;a:0:{}i:2;i:5139;}i:651;a:3:{i:0;s:11:"strong_open";i:1;a:0:{}i:2;i:5141;}i:652;a:3:{i:0;s:12:"strong_close";i:1;a:0:{}i:2;i:5143;}i:653;a:3:{i:0;s:11:"strong_open";i:1;a:0:{}i:2;i:5145;}i:654;a:3:{i:0;s:12:"strong_close";i:1;a:0:{}i:2;i:5147;}i:655;a:3:{i:0;s:11:"strong_open";i:1;a:0:{}i:2;i:5149;}i:656;a:3:{i:0;s:12:"strong_close";i:1;a:0:{}i:2;i:5151;}i:657;a:3:{i:0;s:11:"strong_open";i:1;a:0:{}i:2;i:5153;}i:658;a:3:{i:0;s:12:"strong_close";i:1;a:0:{}i:2;i:5155;}i:659;a:3:{i:0;s:11:"strong_open";i:1;a:0:{}i:2;i:5157;}i:660;a:3:{i:0;s:12:"strong_close";i:1;a:0:{}i:2;i:5159;}i:661;a:3:{i:0;s:11:"strong_open";i:1;a:0:{}i:2;i:5161;}i:662;a:3:{i:0;s:12:"strong_close";i:1;a:0:{}i:2;i:5163;}i:663;a:3:{i:0;s:11:"strong_open";i:1;a:0:{}i:2;i:5165;}i:664;a:3:{i:0;s:12:"strong_close";i:1;a:0:{}i:2;i:5167;}i:665;a:3:{i:0;s:11:"strong_open";i:1;a:0:{}i:2;i:5169;}i:666;a:3:{i:0;s:12:"strong_close";i:1;a:0:{}i:2;i:5171;}i:667;a:3:{i:0;s:11:"strong_open";i:1;a:0:{}i:2;i:5173;}i:668;a:3:{i:0;s:12:"strong_close";i:1;a:0:{}i:2;i:5175;}i:669;a:3:{i:0;s:11:"strong_open";i:1;a:0:{}i:2;i:5177;}i:670;a:3:{i:0;s:12:"strong_close";i:1;a:0:{}i:2;i:5179;}i:671;a:3:{i:0;s:11:"strong_open";i:1;a:0:{}i:2;i:5181;}i:672;a:3:{i:0;s:12:"strong_close";i:1;a:0:{}i:2;i:5183;}i:673;a:3:{i:0;s:11:"strong_open";i:1;a:0:{}i:2;i:5185;}i:674;a:3:{i:0;s:12:"strong_close";i:1;a:0:{}i:2;i:5187;}i:675;a:3:{i:0;s:11:"strong_open";i:1;a:0:{}i:2;i:5189;}i:676;a:3:{i:0;s:12:"strong_close";i:1;a:0:{}i:2;i:5191;}i:677;a:3:{i:0;s:11:"strong_open";i:1;a:0:{}i:2;i:5193;}i:678;a:3:{i:0;s:12:"strong_close";i:1;a:0:{}i:2;i:5195;}i:679;a:3:{i:0;s:11:"strong_open";i:1;a:0:{}i:2;i:5197;}i:680;a:3:{i:0;s:12:"strong_close";i:1;a:0:{}i:2;i:5199;}i:681;a:3:{i:0;s:11:"strong_open";i:1;a:0:{}i:2;i:5201;}i:682;a:3:{i:0;s:12:"strong_close";i:1;a:0:{}i:2;i:5203;}i:683;a:3:{i:0;s:11:"strong_open";i:1;a:0:{}i:2;i:5205;}i:684;a:3:{i:0;s:5:"cdata";i:1;a:1:{i:0;s:48:"

==== Marcelo ====

===== 24/09 a 30/09 =====

";}i:2;i:5207;}i:685;a:3:{i:0;s:12:"strong_close";i:1;a:0:{}i:2;i:5255;}i:686;a:3:{i:0;s:11:"strong_open";i:1;a:0:{}i:2;i:5257;}i:687;a:3:{i:0;s:12:"strong_close";i:1;a:0:{}i:2;i:5259;}i:688;a:3:{i:0;s:11:"strong_open";i:1;a:0:{}i:2;i:5261;}i:689;a:3:{i:0;s:12:"strong_close";i:1;a:0:{}i:2;i:5263;}i:690;a:3:{i:0;s:11:"strong_open";i:1;a:0:{}i:2;i:5265;}i:691;a:3:{i:0;s:12:"strong_close";i:1;a:0:{}i:2;i:5267;}i:692;a:3:{i:0;s:11:"strong_open";i:1;a:0:{}i:2;i:5269;}i:693;a:3:{i:0;s:12:"strong_close";i:1;a:0:{}i:2;i:5271;}i:694;a:3:{i:0;s:11:"strong_open";i:1;a:0:{}i:2;i:5273;}i:695;a:3:{i:0;s:12:"strong_close";i:1;a:0:{}i:2;i:5275;}i:696;a:3:{i:0;s:11:"strong_open";i:1;a:0:{}i:2;i:5277;}i:697;a:3:{i:0;s:12:"strong_close";i:1;a:0:{}i:2;i:5279;}i:698;a:3:{i:0;s:11:"strong_open";i:1;a:0:{}i:2;i:5281;}i:699;a:3:{i:0;s:12:"strong_close";i:1;a:0:{}i:2;i:5283;}i:700;a:3:{i:0;s:11:"strong_open";i:1;a:0:{}i:2;i:5285;}i:701;a:3:{i:0;s:12:"strong_close";i:1;a:0:{}i:2;i:5287;}i:702;a:3:{i:0;s:11:"strong_open";i:1;a:0:{}i:2;i:5289;}i:703;a:3:{i:0;s:12:"strong_close";i:1;a:0:{}i:2;i:5291;}i:704;a:3:{i:0;s:11:"strong_open";i:1;a:0:{}i:2;i:5293;}i:705;a:3:{i:0;s:12:"strong_close";i:1;a:0:{}i:2;i:5295;}i:706;a:3:{i:0;s:11:"strong_open";i:1;a:0:{}i:2;i:5297;}i:707;a:3:{i:0;s:12:"strong_close";i:1;a:0:{}i:2;i:5299;}i:708;a:3:{i:0;s:11:"strong_open";i:1;a:0:{}i:2;i:5301;}i:709;a:3:{i:0;s:12:"strong_close";i:1;a:0:{}i:2;i:5303;}i:710;a:3:{i:0;s:11:"strong_open";i:1;a:0:{}i:2;i:5305;}i:711;a:3:{i:0;s:12:"strong_close";i:1;a:0:{}i:2;i:5307;}i:712;a:3:{i:0;s:11:"strong_open";i:1;a:0:{}i:2;i:5309;}i:713;a:3:{i:0;s:12:"strong_close";i:1;a:0:{}i:2;i:5311;}i:714;a:3:{i:0;s:11:"strong_open";i:1;a:0:{}i:2;i:5313;}i:715;a:3:{i:0;s:12:"strong_close";i:1;a:0:{}i:2;i:5315;}i:716;a:3:{i:0;s:11:"strong_open";i:1;a:0:{}i:2;i:5317;}i:717;a:3:{i:0;s:12:"strong_close";i:1;a:0:{}i:2;i:5319;}i:718;a:3:{i:0;s:11:"strong_open";i:1;a:0:{}i:2;i:5321;}i:719;a:3:{i:0;s:12:"strong_close";i:1;a:0:{}i:2;i:5323;}i:720;a:3:{i:0;s:11:"strong_open";i:1;a:0:{}i:2;i:5325;}i:721;a:3:{i:0;s:12:"strong_close";i:1;a:0:{}i:2;i:5327;}i:722;a:3:{i:0;s:11:"strong_open";i:1;a:0:{}i:2;i:5329;}i:723;a:3:{i:0;s:12:"strong_close";i:1;a:0:{}i:2;i:5331;}i:724;a:3:{i:0;s:11:"strong_open";i:1;a:0:{}i:2;i:5333;}i:725;a:3:{i:0;s:12:"strong_close";i:1;a:0:{}i:2;i:5335;}i:726;a:3:{i:0;s:7:"p_close";i:1;a:0:{}i:2;i:5337;}i:727;a:3:{i:0;s:13:"section_close";i:1;a:0:{}i:2;i:5339;}i:728;a:3:{i:0;s:12:"section_edit";i:1;a:4:{i:0;i:4932;i:1;i:5338;i:2;i:2;i:3;s:13:"01/10 a 07/10";}i:2;i:5339;}i:729;a:3:{i:0;s:6:"header";i:1;a:3:{i:0;s:7:"Matheus";i:1;i:3;i:2;i:5339;}i:2;i:5339;}i:730;a:3:{i:0;s:12:"section_open";i:1;a:1:{i:0;i:3;}i:2;i:5339;}i:731;a:3:{i:0;s:13:"section_close";i:1;a:0:{}i:2;i:5358;}i:732;a:3:{i:0;s:12:"section_edit";i:1;a:4:{i:0;i:5339;i:1;i:5357;i:2;i:3;i:3;s:7:"Matheus";}i:2;i:5358;}i:733;a:3:{i:0;s:6:"header";i:1;a:3:{i:0;s:13:"24/09 a 30/09";i:1;i:2;i:2;i:5358;}i:2;i:5358;}i:734;a:3:{i:0;s:12:"section_open";i:1;a:1:{i:0;i:2;}i:2;i:5358;}i:735;a:3:{i:0;s:10:"listu_open";i:1;a:0:{}i:2;i:5384;}i:736;a:3:{i:0;s:13:"listitem_open";i:1;a:1:{i:0;i:1;}i:2;i:5384;}i:737;a:3:{i:0;s:16:"listcontent_open";i:1;a:0:{}i:2;i:5384;}i:738;a:3:{i:0;s:5:"cdata";i:1;a:1:{i:0;s:19:" reunião MIC (qua)";}i:2;i:5388;}i:739;a:3:{i:0;s:17:"listcontent_close";i:1;a:0:{}i:2;i:5407;}i:740;a:3:{i:0;s:14:"listitem_close";i:1;a:0:{}i:2;i:5407;}i:741;a:3:{i:0;s:13:"listitem_open";i:1;a:1:{i:0;i:1;}i:2;i:5407;}i:742;a:3:{i:0;s:16:"listcontent_open";i:1;a:0:{}i:2;i:5407;}i:743;a:3:{i:0;s:5:"cdata";i:1;a:1:{i:0;s:47:" desenvolvimento da comunicação serial do PIC";}i:2;i:5411;}i:744;a:3:{i:0;s:17:"listcontent_close";i:1;a:0:{}i:2;i:5458;}i:745;a:3:{i:0;s:14:"listitem_close";i:1;a:0:{}i:2;i:5458;}i:746;a:3:{i:0;s:13:"listitem_open";i:1;a:1:{i:0;i:1;}i:2;i:5458;}i:747;a:3:{i:0;s:16:"listcontent_open";i:1;a:0:{}i:2;i:5458;}i:748;a:3:{i:0;s:5:"cdata";i:1;a:1:{i:0;s:37:" comecei a trabalhar no site do museu";}i:2;i:5462;}i:749;a:3:{i:0;s:17:"listcontent_close";i:1;a:0:{}i:2;i:5499;}i:750;a:3:{i:0;s:14:"listitem_close";i:1;a:0:{}i:2;i:5499;}i:751;a:3:{i:0;s:11:"listu_close";i:1;a:0:{}i:2;i:5499;}i:752;a:3:{i:0;s:6:"p_open";i:1;a:0:{}i:2;i:5499;}i:753;a:3:{i:0;s:5:"cdata";i:1;a:1:{i:0;s:1:"
";}i:2;i:5500;}i:754;a:3:{i:0;s:11:"strong_open";i:1;a:0:{}i:2;i:5501;}i:755;a:3:{i:0;s:12:"strong_close";i:1;a:0:{}i:2;i:5503;}i:756;a:3:{i:0;s:11:"strong_open";i:1;a:0:{}i:2;i:5505;}i:757;a:3:{i:0;s:12:"strong_close";i:1;a:0:{}i:2;i:5507;}i:758;a:3:{i:0;s:11:"strong_open";i:1;a:0:{}i:2;i:5509;}i:759;a:3:{i:0;s:12:"strong_close";i:1;a:0:{}i:2;i:5511;}i:760;a:3:{i:0;s:11:"strong_open";i:1;a:0:{}i:2;i:5513;}i:761;a:3:{i:0;s:12:"strong_close";i:1;a:0:{}i:2;i:5515;}i:762;a:3:{i:0;s:11:"strong_open";i:1;a:0:{}i:2;i:5517;}i:763;a:3:{i:0;s:12:"strong_close";i:1;a:0:{}i:2;i:5519;}i:764;a:3:{i:0;s:11:"strong_open";i:1;a:0:{}i:2;i:5521;}i:765;a:3:{i:0;s:12:"strong_close";i:1;a:0:{}i:2;i:5523;}i:766;a:3:{i:0;s:11:"strong_open";i:1;a:0:{}i:2;i:5525;}i:767;a:3:{i:0;s:12:"strong_close";i:1;a:0:{}i:2;i:5527;}i:768;a:3:{i:0;s:11:"strong_open";i:1;a:0:{}i:2;i:5529;}i:769;a:3:{i:0;s:12:"strong_close";i:1;a:0:{}i:2;i:5531;}i:770;a:3:{i:0;s:11:"strong_open";i:1;a:0:{}i:2;i:5533;}i:771;a:3:{i:0;s:12:"strong_close";i:1;a:0:{}i:2;i:5535;}i:772;a:3:{i:0;s:11:"strong_open";i:1;a:0:{}i:2;i:5537;}i:773;a:3:{i:0;s:12:"strong_close";i:1;a:0:{}i:2;i:5539;}i:774;a:3:{i:0;s:11:"strong_open";i:1;a:0:{}i:2;i:5541;}i:775;a:3:{i:0;s:12:"strong_close";i:1;a:0:{}i:2;i:5543;}i:776;a:3:{i:0;s:11:"strong_open";i:1;a:0:{}i:2;i:5545;}i:777;a:3:{i:0;s:12:"strong_close";i:1;a:0:{}i:2;i:5547;}i:778;a:3:{i:0;s:11:"strong_open";i:1;a:0:{}i:2;i:5549;}i:779;a:3:{i:0;s:12:"strong_close";i:1;a:0:{}i:2;i:5551;}i:780;a:3:{i:0;s:11:"strong_open";i:1;a:0:{}i:2;i:5553;}i:781;a:3:{i:0;s:12:"strong_close";i:1;a:0:{}i:2;i:5555;}i:782;a:3:{i:0;s:11:"strong_open";i:1;a:0:{}i:2;i:5557;}i:783;a:3:{i:0;s:12:"strong_close";i:1;a:0:{}i:2;i:5559;}i:784;a:3:{i:0;s:11:"strong_open";i:1;a:0:{}i:2;i:5561;}i:785;a:3:{i:0;s:12:"strong_close";i:1;a:0:{}i:2;i:5563;}i:786;a:3:{i:0;s:11:"strong_open";i:1;a:0:{}i:2;i:5565;}i:787;a:3:{i:0;s:12:"strong_close";i:1;a:0:{}i:2;i:5567;}i:788;a:3:{i:0;s:11:"strong_open";i:1;a:0:{}i:2;i:5569;}i:789;a:3:{i:0;s:12:"strong_close";i:1;a:0:{}i:2;i:5571;}i:790;a:3:{i:0;s:11:"strong_open";i:1;a:0:{}i:2;i:5573;}i:791;a:3:{i:0;s:12:"strong_close";i:1;a:0:{}i:2;i:5575;}i:792;a:3:{i:0;s:11:"strong_open";i:1;a:0:{}i:2;i:5577;}i:793;a:3:{i:0;s:12:"strong_close";i:1;a:0:{}i:2;i:5579;}i:794;a:3:{i:0;s:5:"cdata";i:1;a:1:{i:0;s:2:"**";}i:2;i:5581;}i:795;a:3:{i:0;s:7:"p_close";i:1;a:0:{}i:2;i:5583;}i:796;a:3:{i:0;s:13:"section_close";i:1;a:0:{}i:2;i:5585;}i:797;a:3:{i:0;s:12:"section_edit";i:1;a:4:{i:0;i:5358;i:1;i:5584;i:2;i:2;i:3;s:13:"24/09 a 30/09";}i:2;i:5585;}i:798;a:3:{i:0;s:6:"header";i:1;a:3:{i:0;s:6:"Thiago";i:1;i:3;i:2;i:5585;}i:2;i:5585;}i:799;a:3:{i:0;s:12:"section_open";i:1;a:1:{i:0;i:3;}i:2;i:5585;}i:800;a:3:{i:0;s:13:"section_close";i:1;a:0:{}i:2;i:5603;}i:801;a:3:{i:0;s:12:"section_edit";i:1;a:4:{i:0;i:5585;i:1;i:5602;i:2;i:3;i:3;s:6:"Thiago";}i:2;i:5603;}i:802;a:3:{i:0;s:6:"header";i:1;a:3:{i:0;s:13:"24/09 a 30/09";i:1;i:2;i:2;i:5603;}i:2;i:5603;}i:803;a:3:{i:0;s:12:"section_open";i:1;a:1:{i:0;i:2;}i:2;i:5603;}i:804;a:3:{i:0;s:10:"listu_open";i:1;a:0:{}i:2;i:5629;}i:805;a:3:{i:0;s:13:"listitem_open";i:1;a:1:{i:0;i:1;}i:2;i:5629;}i:806;a:3:{i:0;s:16:"listcontent_open";i:1;a:0:{}i:2;i:5629;}i:807;a:3:{i:0;s:5:"cdata";i:1;a:1:{i:0;s:58:" Instalação do Ubuntu no servidor, com Trac, Suversion, ";}i:2;i:5633;}i:808;a:3:{i:0;s:7:"acronym";i:1;a:1:{i:0;s:4:"LDAP";}i:2;i:5691;}i:809;a:3:{i:0;s:5:"cdata";i:1;a:1:{i:0;s:13:", NFS e Samba";}i:2;i:5695;}i:810;a:3:{i:0;s:17:"listcontent_close";i:1;a:0:{}i:2;i:5708;}i:811;a:3:{i:0;s:14:"listitem_close";i:1;a:0:{}i:2;i:5708;}i:812;a:3:{i:0;s:13:"listitem_open";i:1;a:1:{i:0;i:1;}i:2;i:5708;}i:813;a:3:{i:0;s:16:"listcontent_open";i:1;a:0:{}i:2;i:5708;}i:814;a:3:{i:0;s:5:"cdata";i:1;a:1:{i:0;s:48:" Codificação da classe da imagem para a visão";}i:2;i:5712;}i:815;a:3:{i:0;s:17:"listcontent_close";i:1;a:0:{}i:2;i:5760;}i:816;a:3:{i:0;s:14:"listitem_close";i:1;a:0:{}i:2;i:5760;}i:817;a:3:{i:0;s:13:"listitem_open";i:1;a:1:{i:0;i:1;}i:2;i:5760;}i:818;a:3:{i:0;s:16:"listcontent_open";i:1;a:0:{}i:2;i:5760;}i:819;a:3:{i:0;s:5:"cdata";i:1;a:1:{i:0;s:47:" Criação da página do Curso de Linux do Trac";}i:2;i:5764;}i:820;a:3:{i:0;s:17:"listcontent_close";i:1;a:0:{}i:2;i:5811;}i:821;a:3:{i:0;s:14:"listitem_close";i:1;a:0:{}i:2;i:5811;}i:822;a:3:{i:0;s:13:"listitem_open";i:1;a:1:{i:0;i:1;}i:2;i:5811;}i:823;a:3:{i:0;s:16:"listcontent_open";i:1;a:0:{}i:2;i:5811;}i:824;a:3:{i:0;s:5:"cdata";i:1;a:1:{i:0;s:49:" Conversa com Ronaldo sobre palestra da Microsoft";}i:2;i:5815;}i:825;a:3:{i:0;s:17:"listcontent_close";i:1;a:0:{}i:2;i:5864;}i:826;a:3:{i:0;s:14:"listitem_close";i:1;a:0:{}i:2;i:5864;}i:827;a:3:{i:0;s:13:"listitem_open";i:1;a:1:{i:0;i:1;}i:2;i:5864;}i:828;a:3:{i:0;s:16:"listcontent_open";i:1;a:0:{}i:2;i:5864;}i:829;a:3:{i:0;s:5:"cdata";i:1;a:1:{i:0;s:56:" Criação da página da Administração da Rede no Trac";}i:2;i:5868;}i:830;a:3:{i:0;s:17:"listcontent_close";i:1;a:0:{}i:2;i:5924;}i:831;a:3:{i:0;s:14:"listitem_close";i:1;a:0:{}i:2;i:5924;}i:832;a:3:{i:0;s:11:"listu_close";i:1;a:0:{}i:2;i:5924;}i:833;a:3:{i:0;s:13:"section_close";i:1;a:0:{}i:2;i:5925;}i:834;a:3:{i:0;s:12:"section_edit";i:1;a:4:{i:0;i:5603;i:1;i:0;i:2;i:2;i:3;s:13:"24/09 a 30/09";}i:2;i:5925;}i:835;a:3:{i:0;s:12:"document_end";i:1;a:0:{}i:2;i:5925;}}