a:5:{i:0;a:3:{i:0;s:14:"document_start";i:1;a:0:{}i:2;i:0;}i:1;a:3:{i:0;s:6:"p_open";i:1;a:0:{}i:2;i:0;}i:2;a:3:{i:0;s:5:"cdata";i:1;a:1:{i:0;s:314:"0106.txt
0113.txt
0304.txt
0318.txt
0329.txt
0405.txt
0419.txt
0426.txt
0510.txt
0517.txt
0524.txt
0531.txt
0607.txt
0621.txt
0628.txt
0705.txt
0712.txt
0726.txt
0810.txt
0817.txt
0824.txt
0831.txt
0914.txt
0921.txt
0928.txt
1005.txt
1019.txt
1026.txt
1109.txt
1116.txt
1123.txt
1130.txt
1207.txt
1214.txt
1221.txt";}i:2;i:1;}i:3;a:3:{i:0;s:7:"p_close";i:1;a:0:{}i:2;i:315;}i:4;a:3:{i:0;s:12:"document_end";i:1;a:0:{}i:2;i:315;}}