a:124:{i:0;a:3:{i:0;s:14:"document_start";i:1;a:0:{}i:2;i:0;}i:1;a:3:{i:0;s:6:"p_open";i:1;a:0:{}i:2;i:0;}i:2;a:3:{i:0;s:7:"p_close";i:1;a:0:{}i:2;i:1;}i:3;a:3:{i:0;s:12:"section_edit";i:1;a:4:{i:0;i:-1;i:1;i:0;i:2;i:1;i:3;s:0:"";}i:2;i:1;}i:4;a:3:{i:0;s:6:"header";i:1;a:3:{i:0;s:38:"Ata da Reunião de 01 de abril de 2008";i:1;i:1;i:2;i:1;}i:2;i:1;}i:5;a:3:{i:0;s:12:"section_open";i:1;a:1:{i:0;i:1;}i:2;i:1;}i:6;a:3:{i:0;s:6:"p_open";i:1;a:0:{}i:2;i:53;}i:7;a:3:{i:0;s:5:"cdata";i:1;a:1:{i:0;s:219:"
Presentes: Antônio, Dante, Ismael, Leonardo, Mizusaki, Portal e Marcela (saíram mais cedo, por causa do curso de linux), Matheus, Rosália, Felipe, Kauê e Cassiana. Ausentes: Arthur, Bruno, Zambiasi (Curso de Linux)";}i:2;i:54;}i:8;a:3:{i:0;s:7:"p_close";i:1;a:0:{}i:2;i:273;}i:9;a:3:{i:0;s:6:"p_open";i:1;a:0:{}i:2;i:273;}i:10;a:3:{i:0;s:5:"cdata";i:1;a:1:{i:0;s:18:"Relatora: Rosália";}i:2;i:275;}i:11;a:3:{i:0;s:7:"p_close";i:1;a:0:{}i:2;i:293;}i:12;a:3:{i:0;s:13:"section_close";i:1;a:0:{}i:2;i:295;}i:13;a:3:{i:0;s:12:"section_edit";i:1;a:4:{i:0;i:1;i:1;i:294;i:2;i:1;i:3;s:38:"Ata da Reunião de 01 de abril de 2008";}i:2;i:295;}i:14;a:3:{i:0;s:6:"header";i:1;a:3:{i:0;s:12:"1) Churrasco";i:1;i:2;i:2;i:295;}i:2;i:295;}i:15;a:3:{i:0;s:12:"section_open";i:1;a:1:{i:0;i:2;}i:2;i:295;}i:16;a:3:{i:0;s:6:"p_open";i:1;a:0:{}i:2;i:319;}i:17;a:3:{i:0;s:5:"cdata";i:1;a:1:{i:0;s:234:"
Marcela falará com o Flores, para ver a possibilidade de adiar o churrasco em uma semana, para sexta-feira dia 11, às 19:30. Portal, Mizu e Marcela ficam responsáveis pela organização do evento. Bruno enviará o mapa por e-mail.";}i:2;i:320;}i:18;a:3:{i:0;s:7:"p_close";i:1;a:0:{}i:2;i:554;}i:19;a:3:{i:0;s:6:"p_open";i:1;a:0:{}i:2;i:554;}i:20;a:3:{i:0;s:5:"cdata";i:1;a:1:{i:0;s:146:"Todos devem pagar 10,00 até sexta, pois a carne e as bebidas serão compradas na sexta de tarde. Felipe ficou responsável por assar o churrasco.";}i:2;i:556;}i:21;a:3:{i:0;s:7:"p_close";i:1;a:0:{}i:2;i:702;}i:22;a:3:{i:0;s:13:"section_close";i:1;a:0:{}i:2;i:704;}i:23;a:3:{i:0;s:12:"section_edit";i:1;a:4:{i:0;i:295;i:1;i:703;i:2;i:2;i:3;s:12:"1) Churrasco";}i:2;i:704;}i:24;a:3:{i:0;s:6:"header";i:1;a:3:{i:0;s:19:"2) Despedida Ismael";i:1;i:2;i:2;i:704;}i:2;i:704;}i:25;a:3:{i:0;s:12:"section_open";i:1;a:1:{i:0;i:2;}i:2;i:704;}i:26;a:3:{i:0;s:6:"p_open";i:1;a:0:{}i:2;i:735;}i:27;a:3:{i:0;s:5:"cdata";i:1;a:1:{i:0;s:22:"
Tchau Isma!!!!!! :Õ(";}i:2;i:736;}i:28;a:3:{i:0;s:7:"p_close";i:1;a:0:{}i:2;i:758;}i:29;a:3:{i:0;s:13:"section_close";i:1;a:0:{}i:2;i:760;}i:30;a:3:{i:0;s:12:"section_edit";i:1;a:4:{i:0;i:704;i:1;i:759;i:2;i:2;i:3;s:19:"2) Despedida Ismael";}i:2;i:760;}i:31;a:3:{i:0;s:6:"header";i:1;a:3:{i:0;s:28:"3) Apresentação do pessoal";i:1;i:2;i:2;i:760;}i:2;i:760;}i:32;a:3:{i:0;s:12:"section_open";i:1;a:1:{i:0;i:2;}i:2;i:760;}i:33;a:3:{i:0;s:6:"p_open";i:1;a:0:{}i:2;i:800;}i:34;a:3:{i:0;s:5:"cdata";i:1;a:1:{i:0;s:90:"
Cada um falou sua função no PET, e os novos petianos disseram suas áreas de interesse.";}i:2;i:801;}i:35;a:3:{i:0;s:7:"p_close";i:1;a:0:{}i:2;i:891;}i:36;a:3:{i:0;s:6:"p_open";i:1;a:0:{}i:2;i:891;}i:37;a:3:{i:0;s:5:"cdata";i:1;a:1:{i:0;s:50:"Cassiana: IA Felipe: Tudo Kauê: Ia + cursos C/C++";}i:2;i:893;}i:38;a:3:{i:0;s:7:"p_close";i:1;a:0:{}i:2;i:943;}i:39;a:3:{i:0;s:6:"p_open";i:1;a:0:{}i:2;i:943;}i:40;a:3:{i:0;s:5:"cdata";i:1;a:1:{i:0;s:20:"Grande erro pessoal ";}i:2;i:945;}i:41;a:3:{i:0;s:6:"smiley";i:1;a:1:{i:0;s:3:";-)";}i:2;i:965;}i:42;a:3:{i:0;s:7:"p_close";i:1;a:0:{}i:2;i:968;}i:43;a:3:{i:0;s:13:"section_close";i:1;a:0:{}i:2;i:970;}i:44;a:3:{i:0;s:12:"section_edit";i:1;a:4:{i:0;i:760;i:1;i:969;i:2;i:2;i:3;s:28:"3) Apresentação do pessoal";}i:2;i:970;}i:45;a:3:{i:0;s:6:"header";i:1;a:3:{i:0;s:17:"4) Apadrinhamento";i:1;i:2;i:2;i:970;}i:2;i:970;}i:46;a:3:{i:0;s:12:"section_open";i:1;a:1:{i:0;i:2;}i:2;i:970;}i:47;a:3:{i:0;s:6:"p_open";i:1;a:0:{}i:2;i:999;}i:48;a:3:{i:0;s:5:"cdata";i:1;a:1:{i:0;s:54:"
Rosália - Felipe Matheus - Cassiana Leonardo - Kauê";}i:2;i:1000;}i:49;a:3:{i:0;s:7:"p_close";i:1;a:0:{}i:2;i:1054;}i:50;a:3:{i:0;s:13:"section_close";i:1;a:0:{}i:2;i:1056;}i:51;a:3:{i:0;s:12:"section_edit";i:1;a:4:{i:0;i:970;i:1;i:1055;i:2;i:2;i:3;s:17:"4) Apadrinhamento";}i:2;i:1056;}i:52;a:3:{i:0;s:6:"header";i:1;a:3:{i:0;s:26:"5) Horas do curso de Linux";i:1;i:2;i:2;i:1056;}i:2;i:1056;}i:53;a:3:{i:0;s:12:"section_open";i:1;a:1:{i:0;i:2;}i:2;i:1056;}i:54;a:3:{i:0;s:6:"p_open";i:1;a:0:{}i:2;i:1094;}i:55;a:3:{i:0;s:5:"cdata";i:1;a:1:{i:0;s:115:"
Portal receberá abono de 4h semanais, durante essa semana e a próxima, por estar participando do curso de Linux.";}i:2;i:1095;}i:56;a:3:{i:0;s:7:"p_close";i:1;a:0:{}i:2;i:1210;}i:57;a:3:{i:0;s:13:"section_close";i:1;a:0:{}i:2;i:1212;}i:58;a:3:{i:0;s:12:"section_edit";i:1;a:4:{i:0;i:1056;i:1;i:1211;i:2;i:2;i:3;s:26:"5) Horas do curso de Linux";}i:2;i:1212;}i:59;a:3:{i:0;s:6:"header";i:1;a:3:{i:0;s:23:"6) Planejamento Prograd";i:1;i:2;i:2;i:1212;}i:2;i:1212;}i:60;a:3:{i:0;s:12:"section_open";i:1;a:1:{i:0;i:2;}i:2;i:1212;}i:61;a:3:{i:0;s:6:"p_open";i:1;a:0:{}i:2;i:1247;}i:62;a:3:{i:0;s:5:"cdata";i:1;a:1:{i:0;s:105:"
Felipe ficou responsável por cobrar o planejamento mensal. Marcela auxiliará com casos problemáticos ";}i:2;i:1248;}i:63;a:3:{i:0;s:6:"smiley";i:1;a:1:{i:0;s:3:";-)";}i:2;i:1353;}i:64;a:3:{i:0;s:7:"p_close";i:1;a:0:{}i:2;i:1356;}i:65;a:3:{i:0;s:13:"section_close";i:1;a:0:{}i:2;i:1358;}i:66;a:3:{i:0;s:12:"section_edit";i:1;a:4:{i:0;i:1212;i:1;i:1357;i:2;i:2;i:3;s:23:"6) Planejamento Prograd";}i:2;i:1358;}i:67;a:3:{i:0;s:6:"header";i:1;a:3:{i:0;s:9:"7) Comida";i:1;i:2;i:2;i:1358;}i:2;i:1358;}i:68;a:3:{i:0;s:12:"section_open";i:1;a:1:{i:0;i:2;}i:2;i:1358;}i:69;a:3:{i:0;s:6:"p_open";i:1;a:0:{}i:2;i:1379;}i:70;a:3:{i:0;s:5:"cdata";i:1;a:1:{i:0;s:140:"
Não estava na pauta, mas os novos petianos tem que trazer aproximadamente 20,00 em comida para alguma das reuniões. Ritual de entrada, e ";}i:2;i:1380;}i:71;a:3:{i:0;s:18:"doublequoteopening";i:1;a:0:{}i:2;i:1520;}i:72;a:3:{i:0;s:5:"cdata";i:1;a:1:{i:0;s:9:"pagamento";}i:2;i:1521;}i:73;a:3:{i:0;s:18:"doublequoteclosing";i:1;a:0:{}i:2;i:1530;}i:74;a:3:{i:0;s:5:"cdata";i:1;a:1:{i:0;s:28:" da vaquinha pela geladeira ";}i:2;i:1531;}i:75;a:3:{i:0;s:6:"smiley";i:1;a:1:{i:0;s:3:";-)";}i:2;i:1559;}i:76;a:3:{i:0;s:7:"p_close";i:1;a:0:{}i:2;i:1562;}i:77;a:3:{i:0;s:13:"section_close";i:1;a:0:{}i:2;i:1564;}i:78;a:3:{i:0;s:12:"section_edit";i:1;a:4:{i:0;i:1358;i:1;i:1563;i:2;i:2;i:3;s:9:"7) Comida";}i:2;i:1564;}i:79;a:3:{i:0;s:6:"header";i:1;a:3:{i:0;s:27:"8) Reunião sobre o RoboPET";i:1;i:2;i:2;i:1564;}i:2;i:1564;}i:80;a:3:{i:0;s:12:"section_open";i:1;a:1:{i:0;i:2;}i:2;i:1564;}i:81;a:3:{i:0;s:6:"p_open";i:1;a:0:{}i:2;i:1603;}i:82;a:3:{i:0;s:5:"cdata";i:1;a:1:{i:0;s:146:"
Será realizada na próxima terça-feira, dia 8, após a reunião (a partir das 19:30). A pauta para a reunião foi mandada pelo Mizu por e-mail.";}i:2;i:1604;}i:83;a:3:{i:0;s:7:"p_close";i:1;a:0:{}i:2;i:1750;}i:84;a:3:{i:0;s:13:"section_close";i:1;a:0:{}i:2;i:1752;}i:85;a:3:{i:0;s:12:"section_edit";i:1;a:4:{i:0;i:1564;i:1;i:1751;i:2;i:2;i:3;s:27:"8) Reunião sobre o RoboPET";}i:2;i:1752;}i:86;a:3:{i:0;s:6:"header";i:1;a:3:{i:0;s:5:"9) IA";i:1;i:2;i:2;i:1752;}i:2;i:1752;}i:87;a:3:{i:0;s:12:"section_open";i:1;a:1:{i:0;i:2;}i:2;i:1752;}i:88;a:3:{i:0;s:6:"p_open";i:1;a:0:{}i:2;i:1769;}i:89;a:3:{i:0;s:5:"cdata";i:1;a:1:{i:0;s:225:"
É necessário que se recomece o trabalho com Inteligência Artificial, dado que está se aproximando o dia em que será possível simular os movimentos dos robôs. Leonardo se disponibilizou, e centralizará esse reinício.";}i:2;i:1770;}i:90;a:3:{i:0;s:7:"p_close";i:1;a:0:{}i:2;i:1995;}i:91;a:3:{i:0;s:13:"section_close";i:1;a:0:{}i:2;i:1997;}i:92;a:3:{i:0;s:12:"section_edit";i:1;a:4:{i:0;i:1752;i:1;i:1996;i:2;i:2;i:3;s:5:"9) IA";}i:2;i:1997;}i:93;a:3:{i:0;s:6:"header";i:1;a:3:{i:0;s:19:"10) Curso de Python";i:1;i:2;i:2;i:1997;}i:2;i:1997;}i:94;a:3:{i:0;s:12:"section_open";i:1;a:1:{i:0;i:2;}i:2;i:1997;}i:95;a:3:{i:0;s:6:"p_open";i:1;a:0:{}i:2;i:2028;}i:96;a:3:{i:0;s:5:"cdata";i:1;a:1:{i:0;s:71:"
Será dado na Semana Acadêmica. Alguém deve contatar os professores.";}i:2;i:2029;}i:97;a:3:{i:0;s:7:"p_close";i:1;a:0:{}i:2;i:2100;}i:98;a:3:{i:0;s:13:"section_close";i:1;a:0:{}i:2;i:2102;}i:99;a:3:{i:0;s:12:"section_edit";i:1;a:4:{i:0;i:1997;i:1;i:2101;i:2;i:2;i:3;s:19:"10) Curso de Python";}i:2;i:2102;}i:100;a:3:{i:0;s:6:"header";i:1;a:3:{i:0;s:10:"11) SulPET";i:1;i:2;i:2;i:2102;}i:2;i:2102;}i:101;a:3:{i:0;s:12:"section_open";i:1;a:1:{i:0;i:2;}i:2;i:2102;}i:102;a:3:{i:0;s:6:"p_open";i:1;a:0:{}i:2;i:2124;}i:103;a:3:{i:0;s:5:"cdata";i:1;a:1:{i:0;s:148:"
Os novos petianos foram convidados a participar do SulPET. Aparentemente, não houve interesse. Todos devem confirmar a participaçõa para o Mizu.";}i:2;i:2125;}i:104;a:3:{i:0;s:7:"p_close";i:1;a:0:{}i:2;i:2273;}i:105;a:3:{i:0;s:13:"section_close";i:1;a:0:{}i:2;i:2275;}i:106;a:3:{i:0;s:12:"section_edit";i:1;a:4:{i:0;i:2102;i:1;i:2274;i:2;i:2;i:3;s:10:"11) SulPET";}i:2;i:2275;}i:107;a:3:{i:0;s:6:"header";i:1;a:3:{i:0;s:19:"12) Horas faltantes";i:1;i:2;i:2;i:2275;}i:2;i:2275;}i:108;a:3:{i:0;s:12:"section_open";i:1;a:1:{i:0;i:2;}i:2;i:2275;}i:109;a:3:{i:0;s:6:"p_open";i:1;a:0:{}i:2;i:2306;}i:110;a:3:{i:0;s:5:"cdata";i:1;a:1:{i:0;s:125:"
O histórico de faltas será reabilitado, e as tarefas burocráticas serão encaminhadas a quem estiver liderando o ranking.";}i:2;i:2307;}i:111;a:3:{i:0;s:7:"p_close";i:1;a:0:{}i:2;i:2432;}i:112;a:3:{i:0;s:13:"section_close";i:1;a:0:{}i:2;i:2434;}i:113;a:3:{i:0;s:12:"section_edit";i:1;a:4:{i:0;i:2275;i:1;i:2433;i:2;i:2;i:3;s:19:"12) Horas faltantes";}i:2;i:2434;}i:114;a:3:{i:0;s:6:"header";i:1;a:3:{i:0;s:13:"13) CV Lattes";i:1;i:2;i:2;i:2434;}i:2;i:2434;}i:115;a:3:{i:0;s:12:"section_open";i:1;a:1:{i:0;i:2;}i:2;i:2434;}i:116;a:3:{i:0;s:6:"p_open";i:1;a:0:{}i:2;i:2459;}i:117;a:3:{i:0;s:5:"cdata";i:1;a:1:{i:0;s:100:"
Todos devem fazer o currículo Lattes. O link (e o cpf de cada um) deve ser enviado para o Arhtur (";}i:2;i:2460;}i:118;a:3:{i:0;s:9:"emaillink";i:1;a:2:{i:0;s:29:"mailto:avribacki@inf.ufrgs.br";i:1;s:22:"avribacki@inf.ufrgs.br";}i:2;i:2560;}i:119;a:3:{i:0;s:5:"cdata";i:1;a:1:{i:0;s:1:")";}i:2;i:2616;}i:120;a:3:{i:0;s:7:"p_close";i:1;a:0:{}i:2;i:2617;}i:121;a:3:{i:0;s:13:"section_close";i:1;a:0:{}i:2;i:2618;}i:122;a:3:{i:0;s:12:"section_edit";i:1;a:4:{i:0;i:2434;i:1;i:0;i:2;i:2;i:3;s:13:"13) CV Lattes";}i:2;i:2618;}i:123;a:3:{i:0;s:12:"document_end";i:1;a:0:{}i:2;i:2618;}}