a:257:{i:0;a:3:{i:0;s:14:"document_start";i:1;a:0:{}i:2;i:0;}i:1;a:3:{i:0;s:6:"p_open";i:1;a:0:{}i:2;i:0;}i:2;a:3:{i:0;s:7:"p_close";i:1;a:0:{}i:2;i:1;}i:3;a:3:{i:0;s:12:"section_edit";i:1;a:4:{i:0;i:-1;i:1;i:0;i:2;i:1;i:3;s:0:"";}i:2;i:1;}i:4;a:3:{i:0;s:6:"header";i:1;a:3:{i:0;s:29:"Ata da reunião de 03/03/2009";i:1;i:1;i:2;i:1;}i:2;i:1;}i:5;a:3:{i:0;s:12:"section_open";i:1;a:1:{i:0;i:1;}i:2;i:1;}i:6;a:3:{i:0;s:10:"listu_open";i:1;a:0:{}i:2;i:45;}i:7;a:3:{i:0;s:13:"listitem_open";i:1;a:1:{i:0;i:1;}i:2;i:45;}i:8;a:3:{i:0;s:16:"listcontent_open";i:1;a:0:{}i:2;i:45;}i:9;a:3:{i:0;s:5:"cdata";i:1;a:1:{i:0;s:116:" Presentes: Matheus, Fábio, Lucas Fialho, Leonardo, Bruno Guedes, Matheus Proença, Portal, Bruno Jurkovski, Dante.";}i:2;i:49;}i:10;a:3:{i:0;s:17:"listcontent_close";i:1;a:0:{}i:2;i:165;}i:11;a:3:{i:0;s:14:"listitem_close";i:1;a:0:{}i:2;i:165;}i:12;a:3:{i:0;s:13:"listitem_open";i:1;a:1:{i:0;i:1;}i:2;i:165;}i:13;a:3:{i:0;s:16:"listcontent_open";i:1;a:0:{}i:2;i:165;}i:14;a:3:{i:0;s:5:"cdata";i:1;a:1:{i:0;s:43:" Ausentes: Marcos, Felipe (saiu mais cedo).";}i:2;i:169;}i:15;a:3:{i:0;s:17:"listcontent_close";i:1;a:0:{}i:2;i:212;}i:16;a:3:{i:0;s:14:"listitem_close";i:1;a:0:{}i:2;i:212;}i:17;a:3:{i:0;s:13:"listitem_open";i:1;a:1:{i:0;i:1;}i:2;i:212;}i:18;a:3:{i:0;s:16:"listcontent_open";i:1;a:0:{}i:2;i:212;}i:19;a:3:{i:0;s:5:"cdata";i:1;a:1:{i:0;s:17:" Relator: Matheus";}i:2;i:216;}i:20;a:3:{i:0;s:17:"listcontent_close";i:1;a:0:{}i:2;i:233;}i:21;a:3:{i:0;s:14:"listitem_close";i:1;a:0:{}i:2;i:233;}i:22;a:3:{i:0;s:11:"listu_close";i:1;a:0:{}i:2;i:233;}i:23;a:3:{i:0;s:13:"section_close";i:1;a:0:{}i:2;i:235;}i:24;a:3:{i:0;s:12:"section_edit";i:1;a:4:{i:0;i:1;i:1;i:234;i:2;i:1;i:3;s:29:"Ata da reunião de 03/03/2009";}i:2;i:235;}i:25;a:3:{i:0;s:6:"header";i:1;a:3:{i:0;s:29:"1. Saída antecipada (felipe)";i:1;i:2;i:2;i:235;}i:2;i:235;}i:26;a:3:{i:0;s:12:"section_open";i:1;a:1:{i:0;i:2;}i:2;i:235;}i:27;a:3:{i:0;s:6:"p_open";i:1;a:0:{}i:2;i:276;}i:28;a:3:{i:0;s:5:"cdata";i:1;a:1:{i:0;s:52:"
Ele tinha aula no centro e teve que sair mais cedo.";}i:2;i:277;}i:29;a:3:{i:0;s:7:"p_close";i:1;a:0:{}i:2;i:329;}i:30;a:3:{i:0;s:13:"section_close";i:1;a:0:{}i:2;i:331;}i:31;a:3:{i:0;s:12:"section_edit";i:1;a:4:{i:0;i:235;i:1;i:330;i:2;i:2;i:3;s:29:"1. Saída antecipada (felipe)";}i:2;i:331;}i:32;a:3:{i:0;s:6:"header";i:1;a:3:{i:0;s:10:"2. RoboPET";i:1;i:2;i:2;i:331;}i:2;i:331;}i:33;a:3:{i:0;s:12:"section_open";i:1;a:1:{i:0;i:2;}i:2;i:331;}i:34;a:3:{i:0;s:10:"listu_open";i:1;a:0:{}i:2;i:354;}i:35;a:3:{i:0;s:13:"listitem_open";i:1;a:1:{i:0;i:1;}i:2;i:354;}i:36;a:3:{i:0;s:16:"listcontent_open";i:1;a:0:{}i:2;i:354;}i:37;a:3:{i:0;s:5:"cdata";i:1;a:1:{i:0;s:9:" Sala 114";}i:2;i:358;}i:38;a:3:{i:0;s:17:"listcontent_close";i:1;a:0:{}i:2;i:367;}i:39;a:3:{i:0;s:14:"listitem_close";i:1;a:0:{}i:2;i:367;}i:40;a:3:{i:0;s:11:"listu_close";i:1;a:0:{}i:2;i:367;}i:41;a:3:{i:0;s:6:"p_open";i:1;a:0:{}i:2;i:367;}i:42;a:3:{i:0;s:5:"cdata";i:1;a:1:{i:0;s:202:"
Não podemos usar ela mais. Tentaremos arranjar outra sala. Proença e Portal falaram com o Heuser para ver se conseguimos uma sala no Ceitec, e ele levará isso para a próxima reunião do Instituto.
";}i:2;i:368;}i:43;a:3:{i:0;s:7:"p_close";i:1;a:0:{}i:2;i:570;}i:44;a:3:{i:0;s:10:"listu_open";i:1;a:0:{}i:2;i:570;}i:45;a:3:{i:0;s:13:"listitem_open";i:1;a:1:{i:0;i:1;}i:2;i:570;}i:46;a:3:{i:0;s:16:"listcontent_open";i:1;a:0:{}i:2;i:570;}i:47;a:3:{i:0;s:5:"cdata";i:1;a:1:{i:0;s:90:" Também veremos a possibilidade de conseguir algum lugar na ESEF para usar nos coletivos.";}i:2;i:574;}i:48;a:3:{i:0;s:17:"listcontent_close";i:1;a:0:{}i:2;i:664;}i:49;a:3:{i:0;s:14:"listitem_close";i:1;a:0:{}i:2;i:664;}i:50;a:3:{i:0;s:13:"listitem_open";i:1;a:1:{i:0;i:1;}i:2;i:664;}i:51;a:3:{i:0;s:16:"listcontent_open";i:1;a:0:{}i:2;i:664;}i:52;a:3:{i:0;s:5:"cdata";i:1;a:1:{i:0;s:82:" O Proença e o Portal procurarão um lugar que possa fazer o campo em compensado.";}i:2;i:668;}i:53;a:3:{i:0;s:17:"listcontent_close";i:1;a:0:{}i:2;i:750;}i:54;a:3:{i:0;s:14:"listitem_close";i:1;a:0:{}i:2;i:750;}i:55;a:3:{i:0;s:13:"listitem_open";i:1;a:1:{i:0;i:1;}i:2;i:750;}i:56;a:3:{i:0;s:16:"listcontent_open";i:1;a:0:{}i:2;i:750;}i:57;a:3:{i:0;s:5:"cdata";i:1;a:1:{i:0;s:140:" Lente: Leonardo e Fábio Cavinato vão conversar com o Manuel sobre lentes, já que é possivel que ele tenha conhecimento sobre o assunto.";}i:2;i:754;}i:58;a:3:{i:0;s:17:"listcontent_close";i:1;a:0:{}i:2;i:894;}i:59;a:3:{i:0;s:14:"listitem_close";i:1;a:0:{}i:2;i:894;}i:60;a:3:{i:0;s:13:"listitem_open";i:1;a:1:{i:0;i:1;}i:2;i:894;}i:61;a:3:{i:0;s:16:"listcontent_open";i:1;a:0:{}i:2;i:894;}i:62;a:3:{i:0;s:5:"cdata";i:1;a:1:{i:0;s:12:" Patrocinio:";}i:2;i:898;}i:63;a:3:{i:0;s:17:"listcontent_close";i:1;a:0:{}i:2;i:910;}i:64;a:3:{i:0;s:10:"listu_open";i:1;a:0:{}i:2;i:910;}i:65;a:3:{i:0;s:13:"listitem_open";i:1;a:1:{i:0;i:2;}i:2;i:910;}i:66;a:3:{i:0;s:16:"listcontent_open";i:1;a:0:{}i:2;i:910;}i:67;a:3:{i:0;s:5:"cdata";i:1;a:1:{i:0;s:33:" Mara: O Jurk irá falar com ela.";}i:2;i:916;}i:68;a:3:{i:0;s:17:"listcontent_close";i:1;a:0:{}i:2;i:949;}i:69;a:3:{i:0;s:14:"listitem_close";i:1;a:0:{}i:2;i:949;}i:70;a:3:{i:0;s:13:"listitem_open";i:1;a:1:{i:0;i:2;}i:2;i:949;}i:71;a:3:{i:0;s:16:"listcontent_open";i:1;a:0:{}i:2;i:949;}i:72;a:3:{i:0;s:5:"cdata";i:1;a:1:{i:0;s:41:" Pró-Reitor de Pesquisa e/ou Graduação";}i:2;i:955;}i:73;a:3:{i:0;s:17:"listcontent_close";i:1;a:0:{}i:2;i:996;}i:74;a:3:{i:0;s:14:"listitem_close";i:1;a:0:{}i:2;i:996;}i:75;a:3:{i:0;s:13:"listitem_open";i:1;a:1:{i:0;i:2;}i:2;i:996;}i:76;a:3:{i:0;s:16:"listcontent_open";i:1;a:0:{}i:2;i:996;}i:77;a:3:{i:0;s:5:"cdata";i:1;a:1:{i:0;s:31:" Diretor do Instituto: Proença";}i:2;i:1002;}i:78;a:3:{i:0;s:17:"listcontent_close";i:1;a:0:{}i:2;i:1033;}i:79;a:3:{i:0;s:14:"listitem_close";i:1;a:0:{}i:2;i:1033;}i:80;a:3:{i:0;s:11:"listu_close";i:1;a:0:{}i:2;i:1033;}i:81;a:3:{i:0;s:14:"listitem_close";i:1;a:0:{}i:2;i:1033;}i:82;a:3:{i:0;s:11:"listu_close";i:1;a:0:{}i:2;i:1033;}i:83;a:3:{i:0;s:6:"p_open";i:1;a:0:{}i:2;i:1033;}i:84;a:3:{i:0;s:5:"cdata";i:1;a:1:{i:0;s:13:"
* Objetivos
";}i:2;i:1034;}i:85;a:3:{i:0;s:7:"p_close";i:1;a:0:{}i:2;i:1047;}i:86;a:3:{i:0;s:10:"listu_open";i:1;a:0:{}i:2;i:1047;}i:87;a:3:{i:0;s:13:"listitem_open";i:1;a:1:{i:0;i:1;}i:2;i:1047;}i:88;a:3:{i:0;s:16:"listcontent_open";i:1;a:0:{}i:2;i:1047;}i:89;a:3:{i:0;s:5:"cdata";i:1;a:1:{i:0;s:12:" 9 de março";}i:2;i:1051;}i:90;a:3:{i:0;s:17:"listcontent_close";i:1;a:0:{}i:2;i:1063;}i:91;a:3:{i:0;s:10:"listu_open";i:1;a:0:{}i:2;i:1063;}i:92;a:3:{i:0;s:13:"listitem_open";i:1;a:1:{i:0;i:2;}i:2;i:1063;}i:93;a:3:{i:0;s:16:"listcontent_open";i:1;a:0:{}i:2;i:1063;}i:94;a:3:{i:0;s:5:"cdata";i:1;a:1:{i:0;s:25:" robos de 3 rodas prontos";}i:2;i:1069;}i:95;a:3:{i:0;s:17:"listcontent_close";i:1;a:0:{}i:2;i:1094;}i:96;a:3:{i:0;s:14:"listitem_close";i:1;a:0:{}i:2;i:1094;}i:97;a:3:{i:0;s:13:"listitem_open";i:1;a:1:{i:0;i:2;}i:2;i:1094;}i:98;a:3:{i:0;s:16:"listcontent_open";i:1;a:0:{}i:2;i:1094;}i:99;a:3:{i:0;s:5:"cdata";i:1;a:1:{i:0;s:14:" visão pronta";}i:2;i:1100;}i:100;a:3:{i:0;s:17:"listcontent_close";i:1;a:0:{}i:2;i:1114;}i:101;a:3:{i:0;s:14:"listitem_close";i:1;a:0:{}i:2;i:1114;}i:102;a:3:{i:0;s:11:"listu_close";i:1;a:0:{}i:2;i:1114;}i:103;a:3:{i:0;s:14:"listitem_close";i:1;a:0:{}i:2;i:1114;}i:104;a:3:{i:0;s:13:"listitem_open";i:1;a:1:{i:0;i:1;}i:2;i:1114;}i:105;a:3:{i:0;s:16:"listcontent_open";i:1;a:0:{}i:2;i:1114;}i:106;a:3:{i:0;s:5:"cdata";i:1;a:1:{i:0;s:12:" 10 de abril";}i:2;i:1118;}i:107;a:3:{i:0;s:17:"listcontent_close";i:1;a:0:{}i:2;i:1130;}i:108;a:3:{i:0;s:10:"listu_open";i:1;a:0:{}i:2;i:1130;}i:109;a:3:{i:0;s:13:"listitem_open";i:1;a:1:{i:0;i:2;}i:2;i:1130;}i:110;a:3:{i:0;s:16:"listcontent_open";i:1;a:0:{}i:2;i:1130;}i:111;a:3:{i:0;s:5:"cdata";i:1;a:1:{i:0;s:25:" robos de 4 rodas prontos";}i:2;i:1136;}i:112;a:3:{i:0;s:17:"listcontent_close";i:1;a:0:{}i:2;i:1161;}i:113;a:3:{i:0;s:14:"listitem_close";i:1;a:0:{}i:2;i:1161;}i:114;a:3:{i:0;s:11:"listu_close";i:1;a:0:{}i:2;i:1161;}i:115;a:3:{i:0;s:14:"listitem_close";i:1;a:0:{}i:2;i:1161;}i:116;a:3:{i:0;s:13:"listitem_open";i:1;a:1:{i:0;i:1;}i:2;i:1161;}i:117;a:3:{i:0;s:16:"listcontent_open";i:1;a:0:{}i:2;i:1161;}i:118;a:3:{i:0;s:5:"cdata";i:1;a:1:{i:0;s:11:" 25 de maio";}i:2;i:1165;}i:119;a:3:{i:0;s:17:"listcontent_close";i:1;a:0:{}i:2;i:1176;}i:120;a:3:{i:0;s:10:"listu_open";i:1;a:0:{}i:2;i:1176;}i:121;a:3:{i:0;s:13:"listitem_open";i:1;a:1:{i:0;i:2;}i:2;i:1176;}i:122;a:3:{i:0;s:16:"listcontent_open";i:1;a:0:{}i:2;i:1176;}i:123;a:3:{i:0;s:5:"cdata";i:1;a:1:{i:0;s:69:" tentaremos fazer um amistoso contra FURG durante a semana acadêmica";}i:2;i:1182;}i:124;a:3:{i:0;s:17:"listcontent_close";i:1;a:0:{}i:2;i:1251;}i:125;a:3:{i:0;s:14:"listitem_close";i:1;a:0:{}i:2;i:1251;}i:126;a:3:{i:0;s:11:"listu_close";i:1;a:0:{}i:2;i:1251;}i:127;a:3:{i:0;s:14:"listitem_close";i:1;a:0:{}i:2;i:1251;}i:128;a:3:{i:0;s:13:"listitem_open";i:1;a:1:{i:0;i:1;}i:2;i:1251;}i:129;a:3:{i:0;s:16:"listcontent_open";i:1;a:0:{}i:2;i:1251;}i:130;a:3:{i:0;s:5:"cdata";i:1;a:1:{i:0;s:12:" 29 de junho";}i:2;i:1255;}i:131;a:3:{i:0;s:17:"listcontent_close";i:1;a:0:{}i:2;i:1267;}i:132;a:3:{i:0;s:10:"listu_open";i:1;a:0:{}i:2;i:1267;}i:133;a:3:{i:0;s:13:"listitem_open";i:1;a:1:{i:0;i:2;}i:2;i:1267;}i:134;a:3:{i:0;s:16:"listcontent_open";i:1;a:0:{}i:2;i:1267;}i:135;a:3:{i:0;s:5:"cdata";i:1;a:1:{i:0;s:13:" competição";}i:2;i:1273;}i:136;a:3:{i:0;s:17:"listcontent_close";i:1;a:0:{}i:2;i:1286;}i:137;a:3:{i:0;s:14:"listitem_close";i:1;a:0:{}i:2;i:1286;}i:138;a:3:{i:0;s:11:"listu_close";i:1;a:0:{}i:2;i:1286;}i:139;a:3:{i:0;s:14:"listitem_close";i:1;a:0:{}i:2;i:1286;}i:140;a:3:{i:0;s:13:"listitem_open";i:1;a:1:{i:0;i:1;}i:2;i:1286;}i:141;a:3:{i:0;s:16:"listcontent_open";i:1;a:0:{}i:2;i:1286;}i:142;a:3:{i:0;s:5:"cdata";i:1;a:1:{i:0;s:20:" Felipe programa mal";}i:2;i:1290;}i:143;a:3:{i:0;s:17:"listcontent_close";i:1;a:0:{}i:2;i:1310;}i:144;a:3:{i:0;s:14:"listitem_close";i:1;a:0:{}i:2;i:1310;}i:145;a:3:{i:0;s:11:"listu_close";i:1;a:0:{}i:2;i:1310;}i:146;a:3:{i:0;s:13:"section_close";i:1;a:0:{}i:2;i:1312;}i:147;a:3:{i:0;s:12:"section_edit";i:1;a:4:{i:0;i:331;i:1;i:1311;i:2;i:2;i:3;s:10:"2. RoboPET";}i:2;i:1312;}i:148;a:3:{i:0;s:6:"header";i:1;a:3:{i:0;s:29:"3. Saída de PETianos (bruno)";i:1;i:2;i:2;i:1312;}i:2;i:1312;}i:149;a:3:{i:0;s:12:"section_open";i:1;a:1:{i:0;i:2;}i:2;i:1312;}i:150;a:3:{i:0;s:6:"p_open";i:1;a:0:{}i:2;i:1353;}i:151;a:3:{i:0;s:5:"cdata";i:1;a:1:{i:0;s:197:"
Cassiana saiu e não temos mais PETianas. Leonardo irá para Micro$oft e ele mesmo fará seu documento de saída. Procuraremos interessados bons que passem do meio do ano para dar continuidade no ";}i:2;i:1354;}i:152;a:3:{i:0;s:13:"camelcaselink";i:1;a:1:{i:0;s:7:"RoboPET";}i:2;i:1551;}i:153;a:3:{i:0;s:5:"cdata";i:1;a:1:{i:0;s:51:", senão deixaremos a seleção para o meio do ano.";}i:2;i:1558;}i:154;a:3:{i:0;s:7:"p_close";i:1;a:0:{}i:2;i:1609;}i:155;a:3:{i:0;s:13:"section_close";i:1;a:0:{}i:2;i:1611;}i:156;a:3:{i:0;s:12:"section_edit";i:1;a:4:{i:0;i:1312;i:1;i:1610;i:2;i:2;i:3;s:29:"3. Saída de PETianos (bruno)";}i:2;i:1611;}i:157;a:3:{i:0;s:6:"header";i:1;a:3:{i:0;s:34:"4. Documentos para serem assinados";i:1;i:2;i:2;i:1611;}i:2;i:1611;}i:158;a:3:{i:0;s:12:"section_open";i:1;a:1:{i:0;i:2;}i:2;i:1611;}i:159;a:3:{i:0;s:6:"p_open";i:1;a:0:{}i:2;i:1657;}i:160;a:3:{i:0;s:5:"cdata";i:1;a:1:{i:0;s:27:"
O Dante assinou-los-os-os.";}i:2;i:1658;}i:161;a:3:{i:0;s:7:"p_close";i:1;a:0:{}i:2;i:1685;}i:162;a:3:{i:0;s:13:"section_close";i:1;a:0:{}i:2;i:1687;}i:163;a:3:{i:0;s:12:"section_edit";i:1;a:4:{i:0;i:1611;i:1;i:1686;i:2;i:2;i:3;s:34:"4. Documentos para serem assinados";}i:2;i:1687;}i:164;a:3:{i:0;s:6:"header";i:1;a:3:{i:0;s:12:"5. Extensão";i:1;i:2;i:2;i:1687;}i:2;i:1687;}i:165;a:3:{i:0;s:12:"section_open";i:1;a:1:{i:0;i:2;}i:2;i:1687;}i:166;a:3:{i:0;s:6:"p_open";i:1;a:0:{}i:2;i:1711;}i:167;a:3:{i:0;s:5:"cdata";i:1;a:1:{i:0;s:212:"
Bruno A. precisa colocar informações sobre [8818] PROGRAMA DE EXTENSÃO EM ROBÓTICA EDUCATIVA II, Dante precisa colocar informações sobre SERIE DE SEMINÁRIOS DESAFIOS DE SOFTWARE E HARDWARE NAS INDÚSTRIAS";}i:2;i:1712;}i:168;a:3:{i:0;s:7:"p_close";i:1;a:0:{}i:2;i:1924;}i:169;a:3:{i:0;s:13:"section_close";i:1;a:0:{}i:2;i:1926;}i:170;a:3:{i:0;s:12:"section_edit";i:1;a:4:{i:0;i:1687;i:1;i:1925;i:2;i:2;i:3;s:12:"5. Extensão";}i:2;i:1926;}i:171;a:3:{i:0;s:6:"header";i:1;a:3:{i:0;s:28:"6. escolha de lider (portal)";i:1;i:2;i:2;i:1926;}i:2;i:1926;}i:172;a:3:{i:0;s:12:"section_open";i:1;a:1:{i:0;i:2;}i:2;i:1926;}i:173;a:3:{i:0;s:6:"p_open";i:1;a:0:{}i:2;i:1966;}i:174;a:3:{i:0;s:5:"cdata";i:1;a:1:{i:0;s:17:"
Próxima semana.";}i:2;i:1967;}i:175;a:3:{i:0;s:7:"p_close";i:1;a:0:{}i:2;i:1984;}i:176;a:3:{i:0;s:13:"section_close";i:1;a:0:{}i:2;i:1986;}i:177;a:3:{i:0;s:12:"section_edit";i:1;a:4:{i:0;i:1926;i:1;i:1985;i:2;i:2;i:3;s:28:"6. escolha de lider (portal)";}i:2;i:1986;}i:178;a:3:{i:0;s:6:"header";i:1;a:3:{i:0;s:23:"7. Horário da Reunião";i:1;i:2;i:2;i:1986;}i:2;i:1986;}i:179;a:3:{i:0;s:12:"section_open";i:1;a:1:{i:0;i:2;}i:2;i:1986;}i:180;a:3:{i:0;s:6:"p_open";i:1;a:0:{}i:2;i:2021;}i:181;a:3:{i:0;s:5:"cdata";i:1;a:1:{i:0;s:116:"
Próxima Reunião: 12 de março, quinta, 18:00 Talvez revezemos as reuniões entre quinta as 18:00 e sexta as 17:00";}i:2;i:2022;}i:182;a:3:{i:0;s:7:"p_close";i:1;a:0:{}i:2;i:2138;}i:183;a:3:{i:0;s:13:"section_close";i:1;a:0:{}i:2;i:2140;}i:184;a:3:{i:0;s:12:"section_edit";i:1;a:4:{i:0;i:1986;i:1;i:2139;i:2;i:2;i:3;s:23:"7. Horário da Reunião";}i:2;i:2140;}i:185;a:3:{i:0;s:6:"header";i:1;a:3:{i:0;s:8:"8. Semac";i:1;i:2;i:2;i:2140;}i:2;i:2140;}i:186;a:3:{i:0;s:12:"section_open";i:1;a:1:{i:0;i:2;}i:2;i:2140;}i:187;a:3:{i:0;s:6:"p_open";i:1;a:0:{}i:2;i:2160;}i:188;a:3:{i:0;s:5:"cdata";i:1;a:1:{i:0;s:8:"
Adiada.";}i:2;i:2161;}i:189;a:3:{i:0;s:7:"p_close";i:1;a:0:{}i:2;i:2169;}i:190;a:3:{i:0;s:13:"section_close";i:1;a:0:{}i:2;i:2171;}i:191;a:3:{i:0;s:12:"section_edit";i:1;a:4:{i:0;i:2140;i:1;i:2170;i:2;i:2;i:3;s:8:"8. Semac";}i:2;i:2171;}i:192;a:3:{i:0;s:6:"header";i:1;a:3:{i:0;s:15:"9. Reunião CLA";i:1;i:2;i:2;i:2171;}i:2;i:2171;}i:193;a:3:{i:0;s:12:"section_open";i:1;a:1:{i:0;i:2;}i:2;i:2171;}i:194;a:3:{i:0;s:6:"p_open";i:1;a:0:{}i:2;i:2198;}i:195;a:3:{i:0;s:5:"cdata";i:1;a:1:{i:0;s:35:"
Portal e Fialho irão na reunião.";}i:2;i:2199;}i:196;a:3:{i:0;s:7:"p_close";i:1;a:0:{}i:2;i:2234;}i:197;a:3:{i:0;s:13:"section_close";i:1;a:0:{}i:2;i:2236;}i:198;a:3:{i:0;s:12:"section_edit";i:1;a:4:{i:0;i:2171;i:1;i:2235;i:2;i:2;i:3;s:15:"9. Reunião CLA";}i:2;i:2236;}i:199;a:3:{i:0;s:6:"header";i:1;a:3:{i:0;s:14:"10. Tesouraria";i:1;i:2;i:2;i:2236;}i:2;i:2236;}i:200;a:3:{i:0;s:12:"section_open";i:1;a:1:{i:0;i:2;}i:2;i:2236;}i:201;a:3:{i:0;s:6:"p_open";i:1;a:0:{}i:2;i:2262;}i:202;a:3:{i:0;s:5:"cdata";i:1;a:1:{i:0;s:158:"
Portal viu com o Dante como ressarcir o caixa, já que foi muito dinheiro gasto nessas férias. Bruno vai falar com a Claudia sobre como pode ser ressarcido.";}i:2;i:2263;}i:203;a:3:{i:0;s:7:"p_close";i:1;a:0:{}i:2;i:2421;}i:204;a:3:{i:0;s:13:"section_close";i:1;a:0:{}i:2;i:2423;}i:205;a:3:{i:0;s:12:"section_edit";i:1;a:4:{i:0;i:2236;i:1;i:2422;i:2;i:2;i:3;s:14:"10. Tesouraria";}i:2;i:2423;}i:206;a:3:{i:0;s:6:"header";i:1;a:3:{i:0;s:11:"11. Férias";i:1;i:2;i:2;i:2423;}i:2;i:2423;}i:207;a:3:{i:0;s:12:"section_open";i:1;a:1:{i:0;i:2;}i:2;i:2423;}i:208;a:3:{i:0;s:10:"listu_open";i:1;a:0:{}i:2;i:2447;}i:209;a:3:{i:0;s:13:"listitem_open";i:1;a:1:{i:0;i:1;}i:2;i:2447;}i:210;a:3:{i:0;s:16:"listcontent_open";i:1;a:0:{}i:2;i:2447;}i:211;a:3:{i:0;s:5:"cdata";i:1;a:1:{i:0;s:141:" Portal, Proença, Jurk, Fábio e Fialho ganharão uma semana de férias para ser usada já que trabalharam uma semana das férias coletivas.";}i:2;i:2451;}i:212;a:3:{i:0;s:17:"listcontent_close";i:1;a:0:{}i:2;i:2592;}i:213;a:3:{i:0;s:14:"listitem_close";i:1;a:0:{}i:2;i:2592;}i:214;a:3:{i:0;s:13:"listitem_open";i:1;a:1:{i:0;i:1;}i:2;i:2592;}i:215;a:3:{i:0;s:16:"listcontent_open";i:1;a:0:{}i:2;i:2592;}i:216;a:3:{i:0;s:5:"cdata";i:1;a:1:{i:0;s:28:" O Proença ganhará um mês";}i:2;i:2596;}i:217;a:3:{i:0;s:17:"listcontent_close";i:1;a:0:{}i:2;i:2624;}i:218;a:3:{i:0;s:14:"listitem_close";i:1;a:0:{}i:2;i:2624;}i:219;a:3:{i:0;s:11:"listu_close";i:1;a:0:{}i:2;i:2624;}i:220;a:3:{i:0;s:13:"section_close";i:1;a:0:{}i:2;i:2626;}i:221;a:3:{i:0;s:12:"section_edit";i:1;a:4:{i:0;i:2423;i:1;i:2625;i:2;i:2;i:3;s:11:"11. Férias";}i:2;i:2626;}i:222;a:3:{i:0;s:6:"header";i:1;a:3:{i:0;s:11:"12. Mes PET";i:1;i:2;i:2;i:2626;}i:2;i:2626;}i:223;a:3:{i:0;s:12:"section_open";i:1;a:1:{i:0;i:2;}i:2;i:2626;}i:224;a:3:{i:0;s:10:"listu_open";i:1;a:0:{}i:2;i:2650;}i:225;a:3:{i:0;s:13:"listitem_open";i:1;a:1:{i:0;i:1;}i:2;i:2650;}i:226;a:3:{i:0;s:16:"listcontent_open";i:1;a:0:{}i:2;i:2650;}i:227;a:3:{i:0;s:5:"cdata";i:1;a:1:{i:0;s:97:" Todos deverão ter 36h no logador no fim do mes, exceto o Bruno e o Felipe que deverão ter 48h.";}i:2;i:2654;}i:228;a:3:{i:0;s:17:"listcontent_close";i:1;a:0:{}i:2;i:2751;}i:229;a:3:{i:0;s:14:"listitem_close";i:1;a:0:{}i:2;i:2751;}i:230;a:3:{i:0;s:11:"listu_close";i:1;a:0:{}i:2;i:2751;}i:231;a:3:{i:0;s:13:"section_close";i:1;a:0:{}i:2;i:2753;}i:232;a:3:{i:0;s:12:"section_edit";i:1;a:4:{i:0;i:2626;i:1;i:2752;i:2;i:2;i:3;s:11:"12. Mes PET";}i:2;i:2753;}i:233;a:3:{i:0;s:6:"header";i:1;a:3:{i:0;s:8:"13. Cubo";i:1;i:2;i:2;i:2753;}i:2;i:2753;}i:234;a:3:{i:0;s:12:"section_open";i:1;a:1:{i:0;i:2;}i:2;i:2753;}i:235;a:3:{i:0;s:6:"p_open";i:1;a:0:{}i:2;i:2773;}i:236;a:3:{i:0;s:5:"cdata";i:1;a:1:{i:0;s:47:"
O cubo será adiado para nos concentrarmos no ";}i:2;i:2774;}i:237;a:3:{i:0;s:13:"camelcaselink";i:1;a:1:{i:0;s:7:"RoboPET";}i:2;i:2821;}i:238;a:3:{i:0;s:5:"cdata";i:1;a:1:{i:0;s:1:".";}i:2;i:2828;}i:239;a:3:{i:0;s:7:"p_close";i:1;a:0:{}i:2;i:2829;}i:240;a:3:{i:0;s:13:"section_close";i:1;a:0:{}i:2;i:2831;}i:241;a:3:{i:0;s:12:"section_edit";i:1;a:4:{i:0;i:2753;i:1;i:2830;i:2;i:2;i:3;s:8:"13. Cubo";}i:2;i:2831;}i:242;a:3:{i:0;s:6:"header";i:1;a:3:{i:0;s:15:"14. Comgrad CIC";i:1;i:2;i:2;i:2831;}i:2;i:2831;}i:243;a:3:{i:0;s:12:"section_open";i:1;a:1:{i:0;i:2;}i:2;i:2831;}i:244;a:3:{i:0;s:6:"p_open";i:1;a:0:{}i:2;i:2858;}i:245;a:3:{i:0;s:5:"cdata";i:1;a:1:{i:0;s:47:"
Marcos e Bruno J são os representantes da CIC";}i:2;i:2859;}i:246;a:3:{i:0;s:7:"p_close";i:1;a:0:{}i:2;i:2906;}i:247;a:3:{i:0;s:13:"section_close";i:1;a:0:{}i:2;i:2908;}i:248;a:3:{i:0;s:12:"section_edit";i:1;a:4:{i:0;i:2831;i:1;i:2907;i:2;i:2;i:3;s:15:"14. Comgrad CIC";}i:2;i:2908;}i:249;a:3:{i:0;s:6:"header";i:1;a:3:{i:0;s:15:"15. PETPizzaria";i:1;i:2;i:2;i:2908;}i:2;i:2908;}i:250;a:3:{i:0;s:12:"section_open";i:1;a:1:{i:0;i:2;}i:2;i:2908;}i:251;a:3:{i:0;s:6:"p_open";i:1;a:0:{}i:2;i:2935;}i:252;a:3:{i:0;s:5:"cdata";i:1;a:1:{i:0;s:41:"
Sábado. Onde? Pallatos? Cia das Pizzas?";}i:2;i:2936;}i:253;a:3:{i:0;s:7:"p_close";i:1;a:0:{}i:2;i:2977;}i:254;a:3:{i:0;s:13:"section_close";i:1;a:0:{}i:2;i:2978;}i:255;a:3:{i:0;s:12:"section_edit";i:1;a:4:{i:0;i:2908;i:1;i:0;i:2;i:2;i:3;s:15:"15. PETPizzaria";}i:2;i:2978;}i:256;a:3:{i:0;s:12:"document_end";i:1;a:0:{}i:2;i:2978;}}