a:117:{i:0;a:3:{i:0;s:14:"document_start";i:1;a:0:{}i:2;i:0;}i:1;a:3:{i:0;s:6:"p_open";i:1;a:0:{}i:2;i:0;}i:2;a:3:{i:0;s:7:"p_close";i:1;a:0:{}i:2;i:1;}i:3;a:3:{i:0;s:12:"section_edit";i:1;a:4:{i:0;i:-1;i:1;i:0;i:2;i:1;i:3;s:0:"";}i:2;i:1;}i:4;a:3:{i:0;s:6:"header";i:1;a:3:{i:0;s:22:"Ata Reuniao 30/03/2006";i:1;i:1;i:2;i:1;}i:2;i:1;}i:5;a:3:{i:0;s:12:"section_open";i:1;a:1:{i:0;i:1;}i:2;i:1;}i:6;a:3:{i:0;s:13:"section_close";i:1;a:0:{}i:2;i:39;}i:7;a:3:{i:0;s:12:"section_edit";i:1;a:4:{i:0;i:1;i:1;i:38;i:2;i:1;i:3;s:22:"Ata Reuniao 30/03/2006";}i:2;i:39;}i:8;a:3:{i:0;s:6:"header";i:1;a:3:{i:0;s:25:"1. Apresentacao dos novos";i:1;i:2;i:2;i:39;}i:2;i:39;}i:9;a:3:{i:0;s:12:"section_open";i:1;a:1:{i:0;i:2;}i:2;i:39;}i:10;a:3:{i:0;s:6:"p_open";i:1;a:0:{}i:2;i:76;}i:11;a:3:{i:0;s:5:"cdata";i:1;a:1:{i:0;s:51:"
Houve uma apresentacao geral dos novos integrantes";}i:2;i:77;}i:12;a:3:{i:0;s:7:"p_close";i:1;a:0:{}i:2;i:128;}i:13;a:3:{i:0;s:13:"section_close";i:1;a:0:{}i:2;i:130;}i:14;a:3:{i:0;s:12:"section_edit";i:1;a:4:{i:0;i:39;i:1;i:129;i:2;i:2;i:3;s:25:"1. Apresentacao dos novos";}i:2;i:130;}i:15;a:3:{i:0;s:6:"header";i:1;a:3:{i:0;s:22:"2. Leitura do estatuto";i:1;i:2;i:2;i:130;}i:2;i:130;}i:16;a:3:{i:0;s:12:"section_open";i:1;a:1:{i:0;i:2;}i:2;i:130;}i:17;a:3:{i:0;s:13:"section_close";i:1;a:0:{}i:2;i:166;}i:18;a:3:{i:0;s:12:"section_edit";i:1;a:4:{i:0;i:130;i:1;i:165;i:2;i:2;i:3;s:22:"2. Leitura do estatuto";}i:2;i:166;}i:19;a:3:{i:0;s:6:"header";i:1;a:3:{i:0;s:17:"3. Apadrinhamento";i:1;i:2;i:2;i:166;}i:2;i:166;}i:20;a:3:{i:0;s:12:"section_open";i:1;a:1:{i:0;i:2;}i:2;i:166;}i:21;a:3:{i:0;s:6:"p_open";i:1;a:0:{}i:2;i:195;}i:22;a:3:{i:0;s:5:"cdata";i:1;a:1:{i:0;s:28:"
Thiago apadrinhara Zambiasi";}i:2;i:196;}i:23;a:3:{i:0;s:9:"linebreak";i:1;a:0:{}i:2;i:224;}i:24;a:3:{i:0;s:5:"cdata";i:1;a:1:{i:0;s:27:"  Marcos apadrinhara Gastal";}i:2;i:226;}i:25;a:3:{i:0;s:9:"linebreak";i:1;a:0:{}i:2;i:253;}i:26;a:3:{i:0;s:5:"cdata";i:1;a:1:{i:0;s:27:"  Estevao apadrinhara Lucas";}i:2;i:255;}i:27;a:3:{i:0;s:9:"linebreak";i:1;a:0:{}i:2;i:282;}i:28;a:3:{i:0;s:5:"cdata";i:1;a:1:{i:0;s:32:"  Nondillo apadrinhara Alexandre";}i:2;i:284;}i:29;a:3:{i:0;s:9:"linebreak";i:1;a:0:{}i:2;i:316;}i:30;a:3:{i:0;s:5:"cdata";i:1;a:1:{i:0;s:29:"  Fabiano apadrinhara Ricardo";}i:2;i:318;}i:31;a:3:{i:0;s:9:"linebreak";i:1;a:0:{}i:2;i:347;}i:32;a:3:{i:0;s:7:"p_close";i:1;a:0:{}i:2;i:349;}i:33;a:3:{i:0;s:13:"section_close";i:1;a:0:{}i:2;i:351;}i:34;a:3:{i:0;s:12:"section_edit";i:1;a:4:{i:0;i:166;i:1;i:350;i:2;i:2;i:3;s:17:"3. Apadrinhamento";}i:2;i:351;}i:35;a:3:{i:0;s:6:"header";i:1;a:3:{i:0;s:9:"4. SulPET";i:1;i:2;i:2;i:351;}i:2;i:351;}i:36;a:3:{i:0;s:12:"section_open";i:1;a:1:{i:0;i:2;}i:2;i:351;}i:37;a:3:{i:0;s:6:"p_open";i:1;a:0:{}i:2;i:372;}i:38;a:3:{i:0;s:5:"cdata";i:1;a:1:{i:0;s:39:"
Marcos, Felipe, Nondillo e Vinao irao.";}i:2;i:373;}i:39;a:3:{i:0;s:9:"linebreak";i:1;a:0:{}i:2;i:412;}i:40;a:3:{i:0;s:5:"cdata";i:1;a:1:{i:0;s:56:"  Novos devem escolher se vao ate sexta - PET pagara 60%";}i:2;i:414;}i:41;a:3:{i:0;s:9:"linebreak";i:1;a:0:{}i:2;i:470;}i:42;a:3:{i:0;s:5:"cdata";i:1;a:1:{i:0;s:41:"  Gringo ja pagou o antecipado para Tiago";}i:2;i:472;}i:43;a:3:{i:0;s:9:"linebreak";i:1;a:0:{}i:2;i:513;}i:44;a:3:{i:0;s:5:"cdata";i:1;a:1:{i:0;s:63:"  Lucas nao ira, pois seu aniversario ocorrera durante o evento";}i:2;i:515;}i:45;a:3:{i:0;s:9:"linebreak";i:1;a:0:{}i:2;i:578;}i:46;a:3:{i:0;s:5:"cdata";i:1;a:1:{i:0;s:116:"  Fabiano ja falou com Ezequiel sobre o adiantamento da verba do material de consumo em troca do dinheiro da PROGRAD";}i:2;i:580;}i:47;a:3:{i:0;s:9:"linebreak";i:1;a:0:{}i:2;i:696;}i:48;a:3:{i:0;s:5:"cdata";i:1;a:1:{i:0;s:103:"  Dante falou sobre remanejamento da verba para outros fins (devido a facilidade de aplicar o dinheiro)";}i:2;i:698;}i:49;a:3:{i:0;s:9:"linebreak";i:1;a:0:{}i:2;i:801;}i:50;a:3:{i:0;s:7:"p_close";i:1;a:0:{}i:2;i:803;}i:51;a:3:{i:0;s:13:"section_close";i:1;a:0:{}i:2;i:805;}i:52;a:3:{i:0;s:12:"section_edit";i:1;a:4:{i:0;i:351;i:1;i:804;i:2;i:2;i:3;s:9:"4. SulPET";}i:2;i:805;}i:53;a:3:{i:0;s:6:"header";i:1;a:3:{i:0;s:21:"5. Horario da Reuniao";i:1;i:2;i:2;i:805;}i:2;i:805;}i:54;a:3:{i:0;s:12:"section_open";i:1;a:1:{i:0;i:2;}i:2;i:805;}i:55;a:3:{i:0;s:6:"p_open";i:1;a:0:{}i:2;i:838;}i:56;a:3:{i:0;s:5:"cdata";i:1;a:1:{i:0;s:60:"
A reuniao continuara a acontecer as quartas-feiras as 16:00";}i:2;i:839;}i:57;a:3:{i:0;s:7:"p_close";i:1;a:0:{}i:2;i:899;}i:58;a:3:{i:0;s:13:"section_close";i:1;a:0:{}i:2;i:901;}i:59;a:3:{i:0;s:12:"section_edit";i:1;a:4:{i:0;i:805;i:1;i:900;i:2;i:2;i:3;s:21:"5. Horario da Reuniao";}i:2;i:901;}i:60;a:3:{i:0;s:6:"header";i:1;a:3:{i:0;s:21:"6. Atividade Cultural";i:1;i:2;i:2;i:901;}i:2;i:901;}i:61;a:3:{i:0;s:12:"section_open";i:1;a:1:{i:0;i:2;}i:2;i:901;}i:62;a:3:{i:0;s:6:"p_open";i:1;a:0:{}i:2;i:934;}i:63;a:3:{i:0;s:5:"cdata";i:1;a:1:{i:0;s:162:"
Dante sugeriu ida ao teatro do grupo Oi Nois Aqui Traveiz, na Usina do Gasometro no dia 10/04 as 18:45 (recomenda-se antecedencia devido a escassez de ingressos)";}i:2;i:935;}i:64;a:3:{i:0;s:9:"linebreak";i:1;a:0:{}i:2;i:1097;}i:65;a:3:{i:0;s:5:"cdata";i:1;a:1:{i:0;s:103:"  Dante sugeriu a elaboracao de atividades culturais baseadas na computacao para exibicao a comunidade ";}i:2;i:1099;}i:66;a:3:{i:0;s:9:"linebreak";i:1;a:0:{}i:2;i:1202;}i:67;a:3:{i:0;s:5:"cdata";i:1;a:1:{i:0;s:64:"  Felipe e Lucas formarao uma comissao para tratar deste assunto";}i:2;i:1204;}i:68;a:3:{i:0;s:9:"linebreak";i:1;a:0:{}i:2;i:1268;}i:69;a:3:{i:0;s:5:"cdata";i:1;a:1:{i:0;s:56:"  O Museu podera ajudar com o material do Portas Abertas";}i:2;i:1270;}i:70;a:3:{i:0;s:9:"linebreak";i:1;a:0:{}i:2;i:1326;}i:71;a:3:{i:0;s:7:"p_close";i:1;a:0:{}i:2;i:1328;}i:72;a:3:{i:0;s:13:"section_close";i:1;a:0:{}i:2;i:1330;}i:73;a:3:{i:0;s:12:"section_edit";i:1;a:4:{i:0;i:901;i:1;i:1329;i:2;i:2;i:3;s:21:"6. Atividade Cultural";}i:2;i:1330;}i:74;a:3:{i:0;s:6:"header";i:1;a:3:{i:0;s:13:"7. Seminarios";i:1;i:2;i:2;i:1330;}i:2;i:1330;}i:75;a:3:{i:0;s:12:"section_open";i:1;a:1:{i:0;i:2;}i:2;i:1330;}i:76;a:3:{i:0;s:6:"p_open";i:1;a:0:{}i:2;i:1355;}i:77;a:3:{i:0;s:5:"cdata";i:1;a:1:{i:0;s:83:"
Introducao ao Linux no PET: Thiago (para 05/04) Combustiveis: Fabiano (para 05/05)";}i:2;i:1356;}i:78;a:3:{i:0;s:7:"p_close";i:1;a:0:{}i:2;i:1439;}i:79;a:3:{i:0;s:13:"section_close";i:1;a:0:{}i:2;i:1441;}i:80;a:3:{i:0;s:12:"section_edit";i:1;a:4:{i:0;i:1330;i:1;i:1440;i:2;i:2;i:3;s:13:"7. Seminarios";}i:2;i:1441;}i:81;a:3:{i:0;s:6:"header";i:1;a:3:{i:0;s:23:"8. Museu de Informatica";i:1;i:2;i:2;i:1441;}i:2;i:1441;}i:82;a:3:{i:0;s:12:"section_open";i:1;a:1:{i:0;i:2;}i:2;i:1441;}i:83;a:3:{i:0;s:6:"p_open";i:1;a:0:{}i:2;i:1476;}i:84;a:3:{i:0;s:5:"cdata";i:1;a:1:{i:0;s:73:"
Estevao falara com Cabral sobre as atividades do museu no Portas Abertas";}i:2;i:1477;}i:85;a:3:{i:0;s:7:"p_close";i:1;a:0:{}i:2;i:1550;}i:86;a:3:{i:0;s:13:"section_close";i:1;a:0:{}i:2;i:1552;}i:87;a:3:{i:0;s:12:"section_edit";i:1;a:4:{i:0;i:1441;i:1;i:1551;i:2;i:2;i:3;s:23:"8. Museu de Informatica";}i:2;i:1552;}i:88;a:3:{i:0;s:6:"header";i:1;a:3:{i:0;s:22:"9. Nova Invasao do PET";i:1;i:2;i:2;i:1552;}i:2;i:1552;}i:89;a:3:{i:0;s:12:"section_open";i:1;a:1:{i:0;i:2;}i:2;i:1552;}i:90;a:3:{i:0;s:6:"p_open";i:1;a:0:{}i:2;i:1586;}i:91;a:3:{i:0;s:5:"cdata";i:1;a:1:{i:0;s:95:"
Fabiano relatou o encontro do multimetro no laboratorio da graduacao pela equipe de manutencao";}i:2;i:1587;}i:92;a:3:{i:0;s:9:"linebreak";i:1;a:0:{}i:2;i:1682;}i:93;a:3:{i:0;s:5:"cdata";i:1;a:1:{i:0;s:78:"  Fabiano tambem entrara em contato para que sejam tomadas as medidas cabiveis";}i:2;i:1684;}i:94;a:3:{i:0;s:9:"linebreak";i:1;a:0:{}i:2;i:1762;}i:95;a:3:{i:0;s:5:"cdata";i:1;a:1:{i:0;s:93:"  Dante levantou a possibilidade de colocarmos trancas autenticadas pela digital ou por senha";}i:2;i:1764;}i:96;a:3:{i:0;s:9:"linebreak";i:1;a:0:{}i:2;i:1857;}i:97;a:3:{i:0;s:5:"cdata";i:1;a:1:{i:0;s:107:"  Zambiasi ficou responsavel de levantar o patrimonio do PET e registrar para conferencia e futuras compras";}i:2;i:1859;}i:98;a:3:{i:0;s:7:"p_close";i:1;a:0:{}i:2;i:1966;}i:99;a:3:{i:0;s:13:"section_close";i:1;a:0:{}i:2;i:1968;}i:100;a:3:{i:0;s:12:"section_edit";i:1;a:4:{i:0;i:1552;i:1;i:1967;i:2;i:2;i:3;s:22:"9. Nova Invasao do PET";}i:2;i:1968;}i:101;a:3:{i:0;s:6:"header";i:1;a:3:{i:0;s:24:"10. Orcamento das Pilhas";i:1;i:2;i:2;i:1968;}i:2;i:1968;}i:102;a:3:{i:0;s:12:"section_open";i:1;a:1:{i:0;i:2;}i:2;i:1968;}i:103;a:3:{i:0;s:6:"p_open";i:1;a:0:{}i:2;i:2004;}i:104;a:3:{i:0;s:5:"cdata";i:1;a:1:{i:0;s:94:"
Foi decidido que o dinheiro das pilhas saira do caixa do PET, e sera reembolsado pela FAUFRGS";}i:2;i:2005;}i:105;a:3:{i:0;s:9:"linebreak";i:1;a:0:{}i:2;i:2099;}i:106;a:3:{i:0;s:7:"p_close";i:1;a:0:{}i:2;i:2101;}i:107;a:3:{i:0;s:13:"section_close";i:1;a:0:{}i:2;i:2103;}i:108;a:3:{i:0;s:12:"section_edit";i:1;a:4:{i:0;i:1968;i:1;i:2102;i:2;i:2;i:3;s:24:"10. Orcamento das Pilhas";}i:2;i:2103;}i:109;a:3:{i:0;s:6:"header";i:1;a:3:{i:0;s:25:"11. Artigo sobre robotica";i:1;i:2;i:2;i:2103;}i:2;i:2103;}i:110;a:3:{i:0;s:12:"section_open";i:1;a:1:{i:0;i:2;}i:2;i:2103;}i:111;a:3:{i:0;s:6:"p_open";i:1;a:0:{}i:2;i:2140;}i:112;a:3:{i:0;s:5:"cdata";i:1;a:1:{i:0;s:97:"
Estevao trouxe um artigo sobre robotica que esta afixado no mural para que outros petianos leiam";}i:2;i:2141;}i:113;a:3:{i:0;s:7:"p_close";i:1;a:0:{}i:2;i:2238;}i:114;a:3:{i:0;s:13:"section_close";i:1;a:0:{}i:2;i:2239;}i:115;a:3:{i:0;s:12:"section_edit";i:1;a:4:{i:0;i:2103;i:1;i:0;i:2;i:2;i:3;s:25:"11. Artigo sobre robotica";}i:2;i:2239;}i:116;a:3:{i:0;s:12:"document_end";i:1;a:0:{}i:2;i:2239;}}