a:237:{i:0;a:3:{i:0;s:14:"document_start";i:1;a:0:{}i:2;i:0;}i:1;a:3:{i:0;s:6:"p_open";i:1;a:0:{}i:2;i:0;}i:2;a:3:{i:0;s:7:"p_close";i:1;a:0:{}i:2;i:1;}i:3;a:3:{i:0;s:12:"section_edit";i:1;a:4:{i:0;i:-1;i:1;i:0;i:2;i:1;i:3;s:0:"";}i:2;i:1;}i:4;a:3:{i:0;s:6:"header";i:1;a:3:{i:0;s:29:"Ata da Reunião de 22/03/2006";i:1;i:1;i:2;i:1;}i:2;i:1;}i:5;a:3:{i:0;s:12:"section_open";i:1;a:1:{i:0;i:1;}i:2;i:1;}i:6;a:3:{i:0;s:6:"p_open";i:1;a:0:{}i:2;i:44;}i:7;a:3:{i:0;s:5:"cdata";i:1;a:1:{i:0;s:71:"
Presentes: Dante, Estevão, Fabiano, Marcos, Nondillo, Thiago, Vicente";}i:2;i:45;}i:8;a:3:{i:0;s:7:"p_close";i:1;a:0:{}i:2;i:116;}i:9;a:3:{i:0;s:6:"p_open";i:1;a:0:{}i:2;i:116;}i:10;a:3:{i:0;s:5:"cdata";i:1;a:1:{i:0;s:31:"Ausentes : Felipe (justificado)";}i:2;i:118;}i:11;a:3:{i:0;s:7:"p_close";i:1;a:0:{}i:2;i:149;}i:12;a:3:{i:0;s:6:"p_open";i:1;a:0:{}i:2;i:149;}i:13;a:3:{i:0;s:5:"cdata";i:1;a:1:{i:0;s:17:"Relator: Estevão";}i:2;i:151;}i:14;a:3:{i:0;s:7:"p_close";i:1;a:0:{}i:2;i:168;}i:15;a:3:{i:0;s:13:"section_close";i:1;a:0:{}i:2;i:170;}i:16;a:3:{i:0;s:12:"section_edit";i:1;a:4:{i:0;i:1;i:1;i:169;i:2;i:1;i:3;s:29:"Ata da Reunião de 22/03/2006";}i:2;i:170;}i:17;a:3:{i:0;s:6:"header";i:1;a:3:{i:0;s:39:"1. Seleção dos novos Bolsistas do PET";i:1;i:2;i:2;i:170;}i:2;i:170;}i:18;a:3:{i:0;s:12:"section_open";i:1;a:1:{i:0;i:2;}i:2;i:170;}i:19;a:3:{i:0;s:6:"p_open";i:1;a:0:{}i:2;i:221;}i:20;a:3:{i:0;s:5:"cdata";i:1;a:1:{i:0;s:184:"
Ao todo, irão ser entrevistadas 17 pessoas. Foram excluídos 3 candidatos (uma caloura e duas pessoas com muitas reprovações). Fabiano sugeriu dividir os candidatos em dois grupos.";}i:2;i:222;}i:21;a:3:{i:0;s:7:"p_close";i:1;a:0:{}i:2;i:406;}i:22;a:3:{i:0;s:13:"section_close";i:1;a:0:{}i:2;i:408;}i:23;a:3:{i:0;s:12:"section_edit";i:1;a:4:{i:0;i:170;i:1;i:407;i:2;i:2;i:3;s:39:"1. Seleção dos novos Bolsistas do PET";}i:2;i:408;}i:24;a:3:{i:0;s:6:"header";i:1;a:3:{i:0;s:32:"2.Planejamento Semestral e Anual";i:1;i:2;i:2;i:408;}i:2;i:408;}i:25;a:3:{i:0;s:12:"section_open";i:1;a:1:{i:0;i:2;}i:2;i:408;}i:26;a:3:{i:0;s:6:"p_open";i:1;a:0:{}i:2;i:452;}i:27;a:3:{i:0;s:5:"cdata";i:1;a:1:{i:0;s:117:"
Nondillo expõe as atividades de ensino, pesquisa e extensão a serem realizadas e pede confirmação dos petianos.
";}i:2;i:453;}i:28;a:3:{i:0;s:7:"p_close";i:1;a:0:{}i:2;i:570;}i:29;a:3:{i:0;s:10:"quote_open";i:1;a:0:{}i:2;i:570;}i:30;a:3:{i:0;s:5:"cdata";i:1;a:1:{i:0;s:12:" EXTENSÃO :";}i:2;i:572;}i:31;a:3:{i:0;s:11:"quote_close";i:1;a:0:{}i:2;i:584;}i:32;a:3:{i:0;s:10:"listu_open";i:1;a:0:{}i:2;i:585;}i:33;a:3:{i:0;s:13:"listitem_open";i:1;a:1:{i:0;i:1;}i:2;i:585;}i:34;a:3:{i:0;s:16:"listcontent_open";i:1;a:0:{}i:2;i:585;}i:35;a:3:{i:0;s:5:"cdata";i:1;a:1:{i:0;s:50:" Catalogação de peças do museu de informática.";}i:2;i:589;}i:36;a:3:{i:0;s:17:"listcontent_close";i:1;a:0:{}i:2;i:639;}i:37;a:3:{i:0;s:14:"listitem_close";i:1;a:0:{}i:2;i:639;}i:38;a:3:{i:0;s:13:"listitem_open";i:1;a:1:{i:0;i:1;}i:2;i:639;}i:39;a:3:{i:0;s:16:"listcontent_open";i:1;a:0:{}i:2;i:639;}i:40;a:3:{i:0;s:5:"cdata";i:1;a:1:{i:0;s:34:" Participação no Portas Abertas.";}i:2;i:643;}i:41;a:3:{i:0;s:17:"listcontent_close";i:1;a:0:{}i:2;i:677;}i:42;a:3:{i:0;s:14:"listitem_close";i:1;a:0:{}i:2;i:677;}i:43;a:3:{i:0;s:11:"listu_close";i:1;a:0:{}i:2;i:677;}i:44;a:3:{i:0;s:10:"quote_open";i:1;a:0:{}i:2;i:678;}i:45;a:3:{i:0;s:10:"quote_open";i:1;a:0:{}i:2;i:678;}i:46;a:3:{i:0;s:5:"cdata";i:1;a:1:{i:0;s:11:" PESQUISA :";}i:2;i:681;}i:47;a:3:{i:0;s:11:"quote_close";i:1;a:0:{}i:2;i:692;}i:48;a:3:{i:0;s:11:"quote_close";i:1;a:0:{}i:2;i:692;}i:49;a:3:{i:0;s:10:"listu_open";i:1;a:0:{}i:2;i:693;}i:50;a:3:{i:0;s:13:"listitem_open";i:1;a:1:{i:0;i:1;}i:2;i:693;}i:51;a:3:{i:0;s:16:"listcontent_open";i:1;a:0:{}i:2;i:693;}i:52;a:3:{i:0;s:5:"cdata";i:1;a:1:{i:0;s:17:" Modelo 3D do II.";}i:2;i:697;}i:53;a:3:{i:0;s:17:"listcontent_close";i:1;a:0:{}i:2;i:714;}i:54;a:3:{i:0;s:14:"listitem_close";i:1;a:0:{}i:2;i:714;}i:55;a:3:{i:0;s:13:"listitem_open";i:1;a:1:{i:0;i:1;}i:2;i:714;}i:56;a:3:{i:0;s:16:"listcontent_open";i:1;a:0:{}i:2;i:714;}i:57;a:3:{i:0;s:5:"cdata";i:1;a:1:{i:0;s:46:" Pesquisa histórica do Museu de Informática.";}i:2;i:718;}i:58;a:3:{i:0;s:17:"listcontent_close";i:1;a:0:{}i:2;i:764;}i:59;a:3:{i:0;s:14:"listitem_close";i:1;a:0:{}i:2;i:764;}i:60;a:3:{i:0;s:13:"listitem_open";i:1;a:1:{i:0;i:1;}i:2;i:764;}i:61;a:3:{i:0;s:16:"listcontent_open";i:1;a:0:{}i:2;i:764;}i:62;a:3:{i:0;s:5:"cdata";i:1;a:1:{i:0;s:19:" RoboEDU e RoboPET.";}i:2;i:768;}i:63;a:3:{i:0;s:17:"listcontent_close";i:1;a:0:{}i:2;i:787;}i:64;a:3:{i:0;s:14:"listitem_close";i:1;a:0:{}i:2;i:787;}i:65;a:3:{i:0;s:13:"listitem_open";i:1;a:1:{i:0;i:1;}i:2;i:787;}i:66;a:3:{i:0;s:16:"listcontent_open";i:1;a:0:{}i:2;i:787;}i:67;a:3:{i:0;s:5:"cdata";i:1;a:1:{i:0;s:22:" Visão computacional.";}i:2;i:791;}i:68;a:3:{i:0;s:17:"listcontent_close";i:1;a:0:{}i:2;i:813;}i:69;a:3:{i:0;s:14:"listitem_close";i:1;a:0:{}i:2;i:813;}i:70;a:3:{i:0;s:13:"listitem_open";i:1;a:1:{i:0;i:1;}i:2;i:813;}i:71;a:3:{i:0;s:16:"listcontent_open";i:1;a:0:{}i:2;i:813;}i:72;a:3:{i:0;s:5:"cdata";i:1;a:1:{i:0;s:28:" Simuladores de Arquitetura.";}i:2;i:817;}i:73;a:3:{i:0;s:17:"listcontent_close";i:1;a:0:{}i:2;i:845;}i:74;a:3:{i:0;s:14:"listitem_close";i:1;a:0:{}i:2;i:845;}i:75;a:3:{i:0;s:13:"listitem_open";i:1;a:1:{i:0;i:1;}i:2;i:845;}i:76;a:3:{i:0;s:16:"listcontent_open";i:1;a:0:{}i:2;i:845;}i:77;a:3:{i:0;s:5:"cdata";i:1;a:1:{i:0;s:22:" Seminários internos;";}i:2;i:849;}i:78;a:3:{i:0;s:17:"listcontent_close";i:1;a:0:{}i:2;i:871;}i:79;a:3:{i:0;s:14:"listitem_close";i:1;a:0:{}i:2;i:871;}i:80;a:3:{i:0;s:11:"listu_close";i:1;a:0:{}i:2;i:871;}i:81;a:3:{i:0;s:10:"quote_open";i:1;a:0:{}i:2;i:872;}i:82;a:3:{i:0;s:10:"quote_open";i:1;a:0:{}i:2;i:872;}i:83;a:3:{i:0;s:5:"cdata";i:1;a:1:{i:0;s:9:" ENSINO :";}i:2;i:875;}i:84;a:3:{i:0;s:11:"quote_close";i:1;a:0:{}i:2;i:884;}i:85;a:3:{i:0;s:11:"quote_close";i:1;a:0:{}i:2;i:884;}i:86;a:3:{i:0;s:10:"listu_open";i:1;a:0:{}i:2;i:885;}i:87;a:3:{i:0;s:13:"listitem_open";i:1;a:1:{i:0;i:1;}i:2;i:885;}i:88;a:3:{i:0;s:16:"listcontent_open";i:1;a:0:{}i:2;i:885;}i:89;a:3:{i:0;s:5:"cdata";i:1;a:1:{i:0;s:32:" Sofware para Arquitetura 0 e 1.";}i:2;i:889;}i:90;a:3:{i:0;s:17:"listcontent_close";i:1;a:0:{}i:2;i:921;}i:91;a:3:{i:0;s:14:"listitem_close";i:1;a:0:{}i:2;i:921;}i:92;a:3:{i:0;s:13:"listitem_open";i:1;a:1:{i:0;i:1;}i:2;i:921;}i:93;a:3:{i:0;s:16:"listcontent_open";i:1;a:0:{}i:2;i:921;}i:94;a:3:{i:0;s:5:"cdata";i:1;a:1:{i:0;s:45:" Workshop com alunos que voltaram da França;";}i:2;i:925;}i:95;a:3:{i:0;s:17:"listcontent_close";i:1;a:0:{}i:2;i:970;}i:96;a:3:{i:0;s:14:"listitem_close";i:1;a:0:{}i:2;i:970;}i:97;a:3:{i:0;s:13:"listitem_open";i:1;a:1:{i:0;i:1;}i:2;i:970;}i:98;a:3:{i:0;s:16:"listcontent_open";i:1;a:0:{}i:2;i:970;}i:99;a:3:{i:0;s:5:"cdata";i:1;a:1:{i:0;s:19:" Mini-Curso de GTK.";}i:2;i:974;}i:100;a:3:{i:0;s:17:"listcontent_close";i:1;a:0:{}i:2;i:993;}i:101;a:3:{i:0;s:14:"listitem_close";i:1;a:0:{}i:2;i:993;}i:102;a:3:{i:0;s:11:"listu_close";i:1;a:0:{}i:2;i:993;}i:103;a:3:{i:0;s:6:"p_open";i:1;a:0:{}i:2;i:993;}i:104;a:3:{i:0;s:5:"cdata";i:1;a:1:{i:0;s:70:"
Novos bolsistas serão encorajados a entrar no museu de informática.";}i:2;i:994;}i:105;a:3:{i:0;s:7:"p_close";i:1;a:0:{}i:2;i:1064;}i:106;a:3:{i:0;s:13:"section_close";i:1;a:0:{}i:2;i:1066;}i:107;a:3:{i:0;s:12:"section_edit";i:1;a:4:{i:0;i:408;i:1;i:1065;i:2;i:2;i:3;s:32:"2.Planejamento Semestral e Anual";}i:2;i:1066;}i:108;a:3:{i:0;s:6:"header";i:1;a:3:{i:0;s:17:"3. Robos da Bahia";i:1;i:2;i:2;i:1066;}i:2;i:1066;}i:109;a:3:{i:0;s:12:"section_open";i:1;a:1:{i:0;i:2;}i:2;i:1066;}i:110;a:3:{i:0;s:6:"p_open";i:1;a:0:{}i:2;i:1095;}i:111;a:3:{i:0;s:5:"cdata";i:1;a:1:{i:0;s:128:"
Thiago comenta sobre o seu contato da Bahia, que realizou projetos educacionais através de Robos. libertas.pbh.gov.br/~danilo/";}i:2;i:1096;}i:112;a:3:{i:0;s:7:"p_close";i:1;a:0:{}i:2;i:1224;}i:113;a:3:{i:0;s:13:"section_close";i:1;a:0:{}i:2;i:1226;}i:114;a:3:{i:0;s:12:"section_edit";i:1;a:4:{i:0;i:1066;i:1;i:1225;i:2;i:2;i:3;s:17:"3. Robos da Bahia";}i:2;i:1226;}i:115;a:3:{i:0;s:6:"header";i:1;a:3:{i:0;s:25:"4. Devolvimento de Bolsas";i:1;i:2;i:2;i:1226;}i:2;i:1226;}i:116;a:3:{i:0;s:12:"section_open";i:1;a:1:{i:0;i:2;}i:2;i:1226;}i:117;a:3:{i:0;s:6:"p_open";i:1;a:0:{}i:2;i:1263;}i:118;a:3:{i:0;s:5:"cdata";i:1;a:1:{i:0;s:127:"
Robert, Paula, Diego e Paulo serão contactados (pelo Nondillo) à fim de devolverem suas bolsas referentes ao mês de março.";}i:2;i:1264;}i:119;a:3:{i:0;s:7:"p_close";i:1;a:0:{}i:2;i:1391;}i:120;a:3:{i:0;s:13:"section_close";i:1;a:0:{}i:2;i:1393;}i:121;a:3:{i:0;s:12:"section_edit";i:1;a:4:{i:0;i:1226;i:1;i:1392;i:2;i:2;i:3;s:25:"4. Devolvimento de Bolsas";}i:2;i:1393;}i:122;a:3:{i:0;s:6:"header";i:1;a:3:{i:0;s:14:"5. Seminários";i:1;i:2;i:2;i:1393;}i:2;i:1393;}i:123;a:3:{i:0;s:12:"section_open";i:1;a:1:{i:0;i:2;}i:2;i:1393;}i:124;a:3:{i:0;s:6:"p_open";i:1;a:0:{}i:2;i:1419;}i:125;a:3:{i:0;s:5:"cdata";i:1;a:1:{i:0;s:271:"
Fabiano propõe um semináio sobre a discrepância entre os preços da gasolina e do álcool entre os países da América Latina. Dante propõe um seminário sobre a história da informática (museu). Nondillo porpõe fazer seminário sobre seu trabalho de diplomação.";}i:2;i:1420;}i:126;a:3:{i:0;s:7:"p_close";i:1;a:0:{}i:2;i:1691;}i:127;a:3:{i:0;s:13:"section_close";i:1;a:0:{}i:2;i:1693;}i:128;a:3:{i:0;s:12:"section_edit";i:1;a:4:{i:0;i:1393;i:1;i:1692;i:2;i:2;i:3;s:14:"5. Seminários";}i:2;i:1693;}i:129;a:3:{i:0;s:6:"header";i:1;a:3:{i:0;s:9:"6. SulPET";i:1;i:2;i:2;i:1693;}i:2;i:1693;}i:130;a:3:{i:0;s:12:"section_open";i:1;a:1:{i:0;i:2;}i:2;i:1693;}i:131;a:3:{i:0;s:6:"p_open";i:1;a:0:{}i:2;i:1714;}i:132;a:3:{i:0;s:5:"cdata";i:1;a:1:{i:0;s:270:"
Fabiano comenta sobre o problema dos atrasos das Bolsas. Psico e Esef pensam em não ir ao SulPET devido ao atraso das bolsas. O grupo decide pesquisar até semana que vem, alternativas para ir ao SULPET, tais como ônibus fretado, carro ou comprar passagem individual.";}i:2;i:1715;}i:133;a:3:{i:0;s:7:"p_close";i:1;a:0:{}i:2;i:1985;}i:134;a:3:{i:0;s:13:"section_close";i:1;a:0:{}i:2;i:1987;}i:135;a:3:{i:0;s:12:"section_edit";i:1;a:4:{i:0;i:1693;i:1;i:1986;i:2;i:2;i:3;s:9:"6. SulPET";}i:2;i:1987;}i:136;a:3:{i:0;s:6:"header";i:1;a:3:{i:0;s:25:"7.Clareza nos Relatórios";i:1;i:2;i:2;i:1987;}i:2;i:1987;}i:137;a:3:{i:0;s:12:"section_open";i:1;a:1:{i:0;i:2;}i:2;i:1987;}i:138;a:3:{i:0;s:6:"p_open";i:1;a:0:{}i:2;i:2024;}i:139;a:3:{i:0;s:5:"cdata";i:1;a:1:{i:0;s:124:"
Fabiano pede maior clareza nos relatórios feitos pelos petianos em relação aos estudos de C, JAVA, CG, OPENGL e Blender.";}i:2;i:2025;}i:140;a:3:{i:0;s:7:"p_close";i:1;a:0:{}i:2;i:2149;}i:141;a:3:{i:0;s:13:"section_close";i:1;a:0:{}i:2;i:2151;}i:142;a:3:{i:0;s:12:"section_edit";i:1;a:4:{i:0;i:1987;i:1;i:2150;i:2;i:2;i:3;s:25:"7.Clareza nos Relatórios";}i:2;i:2151;}i:143;a:3:{i:0;s:6:"header";i:1;a:3:{i:0;s:29:"8.Relatório do Curso de JAVA";i:1;i:2;i:2;i:2151;}i:2;i:2151;}i:144;a:3:{i:0;s:12:"section_open";i:1;a:1:{i:0;i:2;}i:2;i:2151;}i:145;a:3:{i:0;s:6:"p_open";i:1;a:0:{}i:2;i:2192;}i:146;a:3:{i:0;s:5:"cdata";i:1;a:1:{i:0;s:193:"
Estevão e Tiago ficam de falar com o João (dinheiro e dados) e com Gustavo (dados) a fim de obter os dados necessários e o dinherio para encaminhar o mais rápido possível os certificados.";}i:2;i:2193;}i:147;a:3:{i:0;s:7:"p_close";i:1;a:0:{}i:2;i:2386;}i:148;a:3:{i:0;s:13:"section_close";i:1;a:0:{}i:2;i:2388;}i:149;a:3:{i:0;s:12:"section_edit";i:1;a:4:{i:0;i:2151;i:1;i:2387;i:2;i:2;i:3;s:29:"8.Relatório do Curso de JAVA";}i:2;i:2388;}i:150;a:3:{i:0;s:6:"header";i:1;a:3:{i:0;s:10:"9.PC Velho";i:1;i:2;i:2;i:2388;}i:2;i:2388;}i:151;a:3:{i:0;s:12:"section_open";i:1;a:1:{i:0;i:2;}i:2;i:2388;}i:152;a:3:{i:0;s:6:"p_open";i:1;a:0:{}i:2;i:2410;}i:153;a:3:{i:0;s:5:"cdata";i:1;a:1:{i:0;s:107:"
Estevão fica a cargo de falar com André e Luiz Otavio sobre o que fazer com a carcaça do PC roubado na ";}i:2;i:2411;}i:154;a:3:{i:0;s:12:"internallink";i:1;a:2:{i:0;s:21:"/trac/wiki/GlobalTech";i:1;s:11:"GlobalTech?";}i:2;i:2518;}i:155;a:3:{i:0;s:5:"cdata";i:1;a:1:{i:0;s:2:".]";}i:2;i:2555;}i:156;a:3:{i:0;s:7:"p_close";i:1;a:0:{}i:2;i:2557;}i:157;a:3:{i:0;s:13:"section_close";i:1;a:0:{}i:2;i:2559;}i:158;a:3:{i:0;s:12:"section_edit";i:1;a:4:{i:0;i:2388;i:1;i:2558;i:2;i:2;i:3;s:10:"9.PC Velho";}i:2;i:2559;}i:159;a:3:{i:0;s:6:"header";i:1;a:3:{i:0;s:32:"10. Jornada Portas Abertas 13/05";i:1;i:2;i:2;i:2559;}i:2;i:2559;}i:160;a:3:{i:0;s:12:"section_open";i:1;a:1:{i:0;i:2;}i:2;i:2559;}i:161;a:3:{i:0;s:6:"p_open";i:1;a:0:{}i:2;i:2603;}i:162;a:3:{i:0;s:5:"cdata";i:1;a:1:{i:0;s:16:"
Foi sugerido :
";}i:2;i:2604;}i:163;a:3:{i:0;s:7:"p_close";i:1;a:0:{}i:2;i:2620;}i:164;a:3:{i:0;s:10:"listu_open";i:1;a:0:{}i:2;i:2620;}i:165;a:3:{i:0;s:13:"listitem_open";i:1;a:1:{i:0;i:1;}i:2;i:2620;}i:166;a:3:{i:0;s:16:"listcontent_open";i:1;a:0:{}i:2;i:2620;}i:167;a:3:{i:0;s:5:"cdata";i:1;a:1:{i:0;s:22:" Plantão de dúvidas.";}i:2;i:2624;}i:168;a:3:{i:0;s:17:"listcontent_close";i:1;a:0:{}i:2;i:2646;}i:169;a:3:{i:0;s:14:"listitem_close";i:1;a:0:{}i:2;i:2646;}i:170;a:3:{i:0;s:13:"listitem_open";i:1;a:1:{i:0;i:1;}i:2;i:2646;}i:171;a:3:{i:0;s:16:"listcontent_open";i:1;a:0:{}i:2;i:2646;}i:172;a:3:{i:0;s:5:"cdata";i:1;a:1:{i:0;s:28:" Tentar apresentar o RoboPET";}i:2;i:2650;}i:173;a:3:{i:0;s:17:"listcontent_close";i:1;a:0:{}i:2;i:2678;}i:174;a:3:{i:0;s:14:"listitem_close";i:1;a:0:{}i:2;i:2678;}i:175;a:3:{i:0;s:13:"listitem_open";i:1;a:1:{i:0;i:1;}i:2;i:2678;}i:176;a:3:{i:0;s:16:"listcontent_open";i:1;a:0:{}i:2;i:2678;}i:177;a:3:{i:0;s:5:"cdata";i:1;a:1:{i:0;s:41:" Cartazes em referências sobre o ROBOEDU";}i:2;i:2682;}i:178;a:3:{i:0;s:17:"listcontent_close";i:1;a:0:{}i:2;i:2723;}i:179;a:3:{i:0;s:14:"listitem_close";i:1;a:0:{}i:2;i:2723;}i:180;a:3:{i:0;s:13:"listitem_open";i:1;a:1:{i:0;i:1;}i:2;i:2723;}i:181;a:3:{i:0;s:16:"listcontent_open";i:1;a:0:{}i:2;i:2723;}i:182;a:3:{i:0;s:5:"cdata";i:1;a:1:{i:0;s:59:" Folder (novo folder, com novas fotos e infs. atualizadas).";}i:2;i:2727;}i:183;a:3:{i:0;s:17:"listcontent_close";i:1;a:0:{}i:2;i:2786;}i:184;a:3:{i:0;s:14:"listitem_close";i:1;a:0:{}i:2;i:2786;}i:185;a:3:{i:0;s:13:"listitem_open";i:1;a:1:{i:0;i:1;}i:2;i:2786;}i:186;a:3:{i:0;s:16:"listcontent_open";i:1;a:0:{}i:2;i:2786;}i:187;a:3:{i:0;s:5:"cdata";i:1;a:1:{i:0;s:26:" Confecção de camisetas.";}i:2;i:2790;}i:188;a:3:{i:0;s:17:"listcontent_close";i:1;a:0:{}i:2;i:2816;}i:189;a:3:{i:0;s:14:"listitem_close";i:1;a:0:{}i:2;i:2816;}i:190;a:3:{i:0;s:11:"listu_close";i:1;a:0:{}i:2;i:2816;}i:191;a:3:{i:0;s:6:"p_open";i:1;a:0:{}i:2;i:2816;}i:192;a:3:{i:0;s:5:"cdata";i:1;a:1:{i:0;s:62:"
Uma comissão foi criada a fim de tratar do Portas Abertas :
";}i:2;i:2817;}i:193;a:3:{i:0;s:7:"p_close";i:1;a:0:{}i:2;i:2879;}i:194;a:3:{i:0;s:10:"listu_open";i:1;a:0:{}i:2;i:2879;}i:195;a:3:{i:0;s:13:"listitem_open";i:1;a:1:{i:0;i:1;}i:2;i:2879;}i:196;a:3:{i:0;s:16:"listcontent_open";i:1;a:0:{}i:2;i:2879;}i:197;a:3:{i:0;s:5:"cdata";i:1;a:1:{i:0;s:17:" MUSEU = Estevão";}i:2;i:2883;}i:198;a:3:{i:0;s:17:"listcontent_close";i:1;a:0:{}i:2;i:2900;}i:199;a:3:{i:0;s:14:"listitem_close";i:1;a:0:{}i:2;i:2900;}i:200;a:3:{i:0;s:13:"listitem_open";i:1;a:1:{i:0;i:1;}i:2;i:2900;}i:201;a:3:{i:0;s:16:"listcontent_open";i:1;a:0:{}i:2;i:2900;}i:202;a:3:{i:0;s:5:"cdata";i:1;a:1:{i:0;s:18:" RoboPET = Fabiano";}i:2;i:2904;}i:203;a:3:{i:0;s:17:"listcontent_close";i:1;a:0:{}i:2;i:2922;}i:204;a:3:{i:0;s:14:"listitem_close";i:1;a:0:{}i:2;i:2922;}i:205;a:3:{i:0;s:13:"listitem_open";i:1;a:1:{i:0;i:1;}i:2;i:2922;}i:206;a:3:{i:0;s:16:"listcontent_open";i:1;a:0:{}i:2;i:2922;}i:207;a:3:{i:0;s:5:"cdata";i:1;a:1:{i:0;s:18:" Quiosques = Tiago";}i:2;i:2926;}i:208;a:3:{i:0;s:17:"listcontent_close";i:1;a:0:{}i:2;i:2944;}i:209;a:3:{i:0;s:14:"listitem_close";i:1;a:0:{}i:2;i:2944;}i:210;a:3:{i:0;s:11:"listu_close";i:1;a:0:{}i:2;i:2944;}i:211;a:3:{i:0;s:6:"p_open";i:1;a:0:{}i:2;i:2944;}i:212;a:3:{i:0;s:5:"cdata";i:1;a:1:{i:0;s:85:"
É importante salientar que todos os Petianos deverão comparecer ao Portas Abertas.";}i:2;i:2945;}i:213;a:3:{i:0;s:7:"p_close";i:1;a:0:{}i:2;i:3030;}i:214;a:3:{i:0;s:13:"section_close";i:1;a:0:{}i:2;i:3032;}i:215;a:3:{i:0;s:12:"section_edit";i:1;a:4:{i:0;i:2559;i:1;i:3031;i:2;i:2;i:3;s:32:"10. Jornada Portas Abertas 13/05";}i:2;i:3032;}i:216;a:3:{i:0;s:6:"header";i:1;a:3:{i:0;s:9:"11. Museu";i:1;i:2;i:2;i:3032;}i:2;i:3032;}i:217;a:3:{i:0;s:12:"section_open";i:1;a:1:{i:0;i:2;}i:2;i:3032;}i:218;a:3:{i:0;s:6:"p_open";i:1;a:0:{}i:2;i:3053;}i:219;a:3:{i:0;s:5:"cdata";i:1;a:1:{i:0;s:21:"
Dante pede que a se ";}i:2;i:3054;}i:220;a:3:{i:0;s:18:"doublequoteopening";i:1;a:0:{}i:2;i:3075;}i:221;a:3:{i:0;s:5:"cdata";i:1;a:1:{i:0;s:6:"retome";}i:2;i:3076;}i:222;a:3:{i:0;s:18:"doublequoteclosing";i:1;a:0:{}i:2;i:3082;}i:223;a:3:{i:0;s:5:"cdata";i:1;a:1:{i:0;s:183:" o museu de informática, continuando a catalogação. Pede-se organização, planejamento e conteúdo para o museu de informática. Na próxima reunião será decidio o responsável.";}i:2;i:3083;}i:224;a:3:{i:0;s:7:"p_close";i:1;a:0:{}i:2;i:3266;}i:225;a:3:{i:0;s:13:"section_close";i:1;a:0:{}i:2;i:3268;}i:226;a:3:{i:0;s:12:"section_edit";i:1;a:4:{i:0;i:3032;i:1;i:3267;i:2;i:2;i:3;s:9:"11. Museu";}i:2;i:3268;}i:227;a:3:{i:0;s:6:"header";i:1;a:3:{i:0;s:19:"12. Moça de Manaus";i:1;i:2;i:2;i:3268;}i:2;i:3268;}i:228;a:3:{i:0;s:12:"section_open";i:1;a:1:{i:0;i:2;}i:2;i:3268;}i:229;a:3:{i:0;s:6:"p_open";i:1;a:0:{}i:2;i:3299;}i:230;a:3:{i:0;s:5:"cdata";i:1;a:1:{i:0;s:176:"
Tutora de Manaus encaminha e-mail a Dante que re-encaminha a Fabiano sobre uma aluna de 2 grau que pede informações sobre a UFRGS (Casa de Estudante ,Bolsas oferecidas ,SAE ";}i:2;i:3300;}i:231;a:3:{i:0;s:6:"entity";i:1;a:1:{i:0;s:3:"...";}i:2;i:3476;}i:232;a:3:{i:0;s:5:"cdata";i:1;a:1:{i:0;s:97:") Estevão e Tiago Ficam responsável por juntar este material para enviar a estudante de 2 grau.";}i:2;i:3479;}i:233;a:3:{i:0;s:7:"p_close";i:1;a:0:{}i:2;i:3576;}i:234;a:3:{i:0;s:13:"section_close";i:1;a:0:{}i:2;i:3577;}i:235;a:3:{i:0;s:12:"section_edit";i:1;a:4:{i:0;i:3268;i:1;i:0;i:2;i:2;i:3;s:19:"12. Moça de Manaus";}i:2;i:3577;}i:236;a:3:{i:0;s:12:"document_end";i:1;a:0:{}i:2;i:3577;}}