a:156:{i:0;a:3:{i:0;s:14:"document_start";i:1;a:0:{}i:2;i:0;}i:1;a:3:{i:0;s:6:"p_open";i:1;a:0:{}i:2;i:0;}i:2;a:3:{i:0;s:7:"p_close";i:1;a:0:{}i:2;i:1;}i:3;a:3:{i:0;s:12:"section_edit";i:1;a:4:{i:0;i:-1;i:1;i:0;i:2;i:1;i:3;s:0:"";}i:2;i:1;}i:4;a:3:{i:0;s:6:"header";i:1;a:3:{i:0;s:28:"Ata da Reunião de 10/09/06/";i:1;i:1;i:2;i:1;}i:2;i:1;}i:5;a:3:{i:0;s:12:"section_open";i:1;a:1:{i:0;i:1;}i:2;i:1;}i:6;a:3:{i:0;s:6:"p_open";i:1;a:0:{}i:2;i:43;}i:7;a:3:{i:0;s:5:"cdata";i:1;a:1:{i:0;s:16:"
Todos presentes";}i:2;i:44;}i:8;a:3:{i:0;s:7:"p_close";i:1;a:0:{}i:2;i:60;}i:9;a:3:{i:0;s:6:"p_open";i:1;a:0:{}i:2;i:60;}i:10;a:3:{i:0;s:5:"cdata";i:1;a:1:{i:0;s:15:"Relator: Thiago";}i:2;i:62;}i:11;a:3:{i:0;s:7:"p_close";i:1;a:0:{}i:2;i:77;}i:12;a:3:{i:0;s:13:"section_close";i:1;a:0:{}i:2;i:79;}i:13;a:3:{i:0;s:12:"section_edit";i:1;a:4:{i:0;i:1;i:1;i:78;i:2;i:1;i:3;s:28:"Ata da Reunião de 10/09/06/";}i:2;i:79;}i:14;a:3:{i:0;s:6:"header";i:1;a:3:{i:0;s:24:"1. Desligamento Estevão";i:1;i:2;i:2;i:79;}i:2;i:79;}i:15;a:3:{i:0;s:12:"section_open";i:1;a:1:{i:0;i:2;}i:2;i:79;}i:16;a:3:{i:0;s:6:"p_open";i:1;a:0:{}i:2;i:115;}i:17;a:3:{i:0;s:5:"cdata";i:1;a:1:{i:0;s:366:"
Estevão pediu seu desligamento em virtude de ter sido aceito no programa de treinamento em microeletrônica da Nangate. Estevão mencionou também a necessidade de uma seleção e de uma comissão responsável. Dante falou da reunião da Prograd e a situação do cavalheiro e do Pablo. Fabiano falou da importância de uma apresentação do pet para a graduação";}i:2;i:116;}i:18;a:3:{i:0;s:7:"p_close";i:1;a:0:{}i:2;i:482;}i:19;a:3:{i:0;s:13:"section_close";i:1;a:0:{}i:2;i:484;}i:20;a:3:{i:0;s:12:"section_edit";i:1;a:4:{i:0;i:79;i:1;i:483;i:2;i:2;i:3;s:24:"1. Desligamento Estevão";}i:2;i:484;}i:21;a:3:{i:0;s:6:"header";i:1;a:3:{i:0;s:42:"2. Cumprimento de horarios no mês passado";i:1;i:2;i:2;i:484;}i:2;i:484;}i:22;a:3:{i:0;s:12:"section_open";i:1;a:1:{i:0;i:2;}i:2;i:484;}i:23;a:3:{i:0;s:6:"p_open";i:1;a:0:{}i:2;i:538;}i:24;a:3:{i:0;s:5:"cdata";i:1;a:1:{i:0;s:168:"
Gabi, Thiago e Mizusaki cumpriram menos horas que o pre-determinado. Tal ocorrido foi registrado no histórico, e os bolsistas deverão recuperar o horário neste mês";}i:2;i:539;}i:25;a:3:{i:0;s:7:"p_close";i:1;a:0:{}i:2;i:707;}i:26;a:3:{i:0;s:13:"section_close";i:1;a:0:{}i:2;i:709;}i:27;a:3:{i:0;s:12:"section_edit";i:1;a:4:{i:0;i:484;i:1;i:708;i:2;i:2;i:3;s:42:"2. Cumprimento de horarios no mês passado";}i:2;i:709;}i:28;a:3:{i:0;s:6:"header";i:1;a:3:{i:0;s:53:"3. Horario da reunião de avaliação dos relatórios";i:1;i:2;i:2;i:709;}i:2;i:709;}i:29;a:3:{i:0;s:12:"section_open";i:1;a:1:{i:0;i:2;}i:2;i:709;}i:30;a:3:{i:0;s:6:"p_open";i:1;a:0:{}i:2;i:774;}i:31;a:3:{i:0;s:5:"cdata";i:1;a:1:{i:0;s:47:"
Será depois da reunião do dia 19 de setembro";}i:2;i:775;}i:32;a:3:{i:0;s:7:"p_close";i:1;a:0:{}i:2;i:822;}i:33;a:3:{i:0;s:13:"section_close";i:1;a:0:{}i:2;i:824;}i:34;a:3:{i:0;s:12:"section_edit";i:1;a:4:{i:0;i:709;i:1;i:823;i:2;i:2;i:3;s:53:"3. Horario da reunião de avaliação dos relatórios";}i:2;i:824;}i:35;a:3:{i:0;s:6:"header";i:1;a:3:{i:0;s:45:"4. Confraternização – Comentários Gerais";i:1;i:2;i:2;i:824;}i:2;i:824;}i:36;a:3:{i:0;s:12:"section_open";i:1;a:1:{i:0;i:2;}i:2;i:824;}i:37;a:3:{i:0;s:6:"p_open";i:1;a:0:{}i:2;i:881;}i:38;a:3:{i:0;s:5:"cdata";i:1;a:1:{i:0;s:50:"
Os franceses sugeriram vôlei para a próxima vez";}i:2;i:882;}i:39;a:3:{i:0;s:7:"p_close";i:1;a:0:{}i:2;i:932;}i:40;a:3:{i:0;s:13:"section_close";i:1;a:0:{}i:2;i:934;}i:41;a:3:{i:0;s:12:"section_edit";i:1;a:4:{i:0;i:824;i:1;i:933;i:2;i:2;i:3;s:45:"4. Confraternização – Comentários Gerais";}i:2;i:934;}i:42;a:3:{i:0;s:6:"header";i:1;a:3:{i:0;s:19:"5. Reunião Manuela";i:1;i:2;i:2;i:934;}i:2;i:934;}i:43;a:3:{i:0;s:12:"section_open";i:1;a:1:{i:0;i:2;}i:2;i:934;}i:44;a:3:{i:0;s:6:"p_open";i:1;a:0:{}i:2;i:965;}i:45;a:3:{i:0;s:5:"cdata";i:1;a:1:{i:0;s:29:"
Confirmado amanhã às 16:00";}i:2;i:966;}i:46;a:3:{i:0;s:7:"p_close";i:1;a:0:{}i:2;i:995;}i:47;a:3:{i:0;s:13:"section_close";i:1;a:0:{}i:2;i:997;}i:48;a:3:{i:0;s:12:"section_edit";i:1;a:4:{i:0;i:934;i:1;i:996;i:2;i:2;i:3;s:19:"5. Reunião Manuela";}i:2;i:997;}i:49;a:3:{i:0;s:6:"header";i:1;a:3:{i:0;s:24:"6. Discussão Eleições";i:1;i:2;i:2;i:997;}i:2;i:997;}i:50;a:3:{i:0;s:12:"section_open";i:1;a:1:{i:0;i:2;}i:2;i:997;}i:51;a:3:{i:0;s:6:"p_open";i:1;a:0:{}i:2;i:1033;}i:52;a:3:{i:0;s:5:"cdata";i:1;a:1:{i:0;s:41:"
Adiado para a reunião de 26 de setembro";}i:2;i:1034;}i:53;a:3:{i:0;s:7:"p_close";i:1;a:0:{}i:2;i:1075;}i:54;a:3:{i:0;s:13:"section_close";i:1;a:0:{}i:2;i:1077;}i:55;a:3:{i:0;s:12:"section_edit";i:1;a:4:{i:0;i:997;i:1;i:1076;i:2;i:2;i:3;s:24:"6. Discussão Eleições";}i:2;i:1077;}i:56;a:3:{i:0;s:6:"header";i:1;a:3:{i:0;s:26:"7. Expo Estude no Exterior";i:1;i:2;i:2;i:1077;}i:2;i:1077;}i:57;a:3:{i:0;s:12:"section_open";i:1;a:1:{i:0;i:2;}i:2;i:1077;}i:58;a:3:{i:0;s:6:"p_open";i:1;a:0:{}i:2;i:1115;}i:59;a:3:{i:0;s:5:"cdata";i:1;a:1:{i:0;s:159:"
Evento no Sheraton, sexta das 16:00 21:00, onde instituições de ensino, empresas se apresentam, bem como há sorteio de bolsas para o Canadá e Buenos Aires";}i:2;i:1116;}i:60;a:3:{i:0;s:7:"p_close";i:1;a:0:{}i:2;i:1275;}i:61;a:3:{i:0;s:13:"section_close";i:1;a:0:{}i:2;i:1277;}i:62;a:3:{i:0;s:12:"section_edit";i:1;a:4:{i:0;i:1077;i:1;i:1276;i:2;i:2;i:3;s:26:"7. Expo Estude no Exterior";}i:2;i:1277;}i:63;a:3:{i:0;s:6:"header";i:1;a:3:{i:0;s:19:"8. Avaliações MEC";i:1;i:2;i:2;i:1277;}i:2;i:1277;}i:64;a:3:{i:0;s:12:"section_open";i:1;a:1:{i:0;i:2;}i:2;i:1277;}i:65;a:3:{i:0;s:6:"p_open";i:1;a:0:{}i:2;i:1308;}i:66;a:3:{i:0;s:5:"cdata";i:1;a:1:{i:0;s:60:"
Serão enviadas após a reunião. Cada um deve enviar o seu";}i:2;i:1309;}i:67;a:3:{i:0;s:7:"p_close";i:1;a:0:{}i:2;i:1369;}i:68;a:3:{i:0;s:13:"section_close";i:1;a:0:{}i:2;i:1371;}i:69;a:3:{i:0;s:12:"section_edit";i:1;a:4:{i:0;i:1277;i:1;i:1370;i:2;i:2;i:3;s:19:"8. Avaliações MEC";}i:2;i:1371;}i:70;a:3:{i:0;s:6:"header";i:1;a:3:{i:0;s:43:"9. Seminário Fotografia Digital Cavalheiro";i:1;i:2;i:2;i:1371;}i:2;i:1371;}i:71;a:3:{i:0;s:12:"section_open";i:1;a:1:{i:0;i:2;}i:2;i:1371;}i:72;a:3:{i:0;s:6:"p_open";i:1;a:0:{}i:2;i:1426;}i:73;a:3:{i:0;s:5:"cdata";i:1;a:1:{i:0;s:7:"
Adiado";}i:2;i:1427;}i:74;a:3:{i:0;s:7:"p_close";i:1;a:0:{}i:2;i:1434;}i:75;a:3:{i:0;s:13:"section_close";i:1;a:0:{}i:2;i:1436;}i:76;a:3:{i:0;s:12:"section_edit";i:1;a:4:{i:0;i:1371;i:1;i:1435;i:2;i:2;i:3;s:43:"9. Seminário Fotografia Digital Cavalheiro";}i:2;i:1436;}i:77;a:3:{i:0;s:6:"header";i:1;a:3:{i:0;s:44:"10. Reunião [[/trac/wiki/RoboEdu|RoboEdu?]]";i:1;i:2;i:2;i:1436;}i:2;i:1436;}i:78;a:3:{i:0;s:12:"section_open";i:1;a:1:{i:0;i:2;}i:2;i:1436;}i:79;a:3:{i:0;s:6:"p_open";i:1;a:0:{}i:2;i:1492;}i:80;a:3:{i:0;s:5:"cdata";i:1;a:1:{i:0;s:21:"
Haverá reunião do ";}i:2;i:1493;}i:81;a:3:{i:0;s:12:"internallink";i:1;a:2:{i:0;s:18:"/trac/wiki/RoboEdu";i:1;s:8:"RoboEdu?";}i:2;i:1514;}i:82;a:3:{i:0;s:5:"cdata";i:1;a:1:{i:0;s:25:" após a reunião regular";}i:2;i:1545;}i:83;a:3:{i:0;s:7:"p_close";i:1;a:0:{}i:2;i:1570;}i:84;a:3:{i:0;s:13:"section_close";i:1;a:0:{}i:2;i:1572;}i:85;a:3:{i:0;s:12:"section_edit";i:1;a:4:{i:0;i:1436;i:1;i:1571;i:2;i:2;i:3;s:44:"10. Reunião [[/trac/wiki/RoboEdu|RoboEdu?]]";}i:2;i:1572;}i:86;a:3:{i:0;s:6:"header";i:1;a:3:{i:0;s:44:"11. Software [[/trac/wiki/RoboEdu|RoboEdu?]]";i:1;i:2;i:2;i:1572;}i:2;i:1572;}i:87;a:3:{i:0;s:12:"section_open";i:1;a:1:{i:0;i:2;}i:2;i:1572;}i:88;a:3:{i:0;s:6:"p_open";i:1;a:0:{}i:2;i:1628;}i:89;a:3:{i:0;s:5:"cdata";i:1;a:1:{i:0;s:69:"
Marcos, Felipe, Cavalheiro, Thiago, Mizusaki e Ricardo podem ajudar.";}i:2;i:1629;}i:90;a:3:{i:0;s:7:"p_close";i:1;a:0:{}i:2;i:1698;}i:91;a:3:{i:0;s:13:"section_close";i:1;a:0:{}i:2;i:1700;}i:92;a:3:{i:0;s:12:"section_edit";i:1;a:4:{i:0;i:1572;i:1;i:1699;i:2;i:2;i:3;s:44:"11. Software [[/trac/wiki/RoboEdu|RoboEdu?]]";}i:2;i:1700;}i:93;a:3:{i:0;s:6:"header";i:1;a:3:{i:0;s:24:"12. Ações de Extensão";i:1;i:2;i:2;i:1700;}i:2;i:1700;}i:94;a:3:{i:0;s:12:"section_open";i:1;a:1:{i:0;i:2;}i:2;i:1700;}i:95;a:3:{i:0;s:6:"p_open";i:1;a:0:{}i:2;i:1736;}i:96;a:3:{i:0;s:5:"cdata";i:1;a:1:{i:0;s:83:"
Verificou-se o andamento dos cadastros no sistema de extensão. Pediu-se agilidade";}i:2;i:1737;}i:97;a:3:{i:0;s:7:"p_close";i:1;a:0:{}i:2;i:1820;}i:98;a:3:{i:0;s:13:"section_close";i:1;a:0:{}i:2;i:1822;}i:99;a:3:{i:0;s:12:"section_edit";i:1;a:4:{i:0;i:1700;i:1;i:1821;i:2;i:2;i:3;s:24:"12. Ações de Extensão";}i:2;i:1822;}i:100;a:3:{i:0;s:6:"header";i:1;a:3:{i:0;s:33:"13. Ações museu de informática";i:1;i:2;i:2;i:1822;}i:2;i:1822;}i:101;a:3:{i:0;s:12:"section_open";i:1;a:1:{i:0;i:2;}i:2;i:1822;}i:102;a:3:{i:0;s:6:"p_open";i:1;a:0:{}i:2;i:1867;}i:103;a:3:{i:0;s:5:"cdata";i:1;a:1:{i:0;s:27:"
Visita – Quinta à tarde";}i:2;i:1868;}i:104;a:3:{i:0;s:9:"linebreak";i:1;a:0:{}i:2;i:1895;}i:105;a:3:{i:0;s:5:"cdata";i:1;a:1:{i:0;s:59:"  Responsáveis: Zambiasi, Floers, Ricardo, Mizusaki, Pablo";}i:2;i:1897;}i:106;a:3:{i:0;s:7:"p_close";i:1;a:0:{}i:2;i:1956;}i:107;a:3:{i:0;s:6:"p_open";i:1;a:0:{}i:2;i:1956;}i:108;a:3:{i:0;s:5:"cdata";i:1;a:1:{i:0;s:80:"Para Arrumar: Quarta 13/09 Resp: Estevão, Ricardo, Capra, Cavalheiro e Mizusaki";}i:2;i:1958;}i:109;a:3:{i:0;s:9:"linebreak";i:1;a:0:{}i:2;i:2038;}i:110;a:3:{i:0;s:5:"cdata";i:1;a:1:{i:0;s:67:"  TV Ulbra, Sexta às 11:00 Resp: Marcos, Felipe, Zambiasi e Thiago";}i:2;i:2040;}i:111;a:3:{i:0;s:7:"p_close";i:1;a:0:{}i:2;i:2107;}i:112;a:3:{i:0;s:13:"section_close";i:1;a:0:{}i:2;i:2109;}i:113;a:3:{i:0;s:12:"section_edit";i:1;a:4:{i:0;i:1822;i:1;i:2108;i:2;i:2;i:3;s:33:"13. Ações museu de informática";}i:2;i:2109;}i:114;a:3:{i:0;s:6:"header";i:1;a:3:{i:0;s:21:"14. Cartas p/ CENAPET";i:1;i:2;i:2;i:2109;}i:2;i:2109;}i:115;a:3:{i:0;s:12:"section_open";i:1;a:1:{i:0;i:2;}i:2;i:2109;}i:116;a:3:{i:0;s:6:"p_open";i:1;a:0:{}i:2;i:2142;}i:117;a:3:{i:0;s:5:"cdata";i:1;a:1:{i:0;s:93:"
Cenapet se reunirá dia 3 e 4 de Outubro em Brasília. Pablo ficou responsável pela tarefa.";}i:2;i:2143;}i:118;a:3:{i:0;s:7:"p_close";i:1;a:0:{}i:2;i:2236;}i:119;a:3:{i:0;s:13:"section_close";i:1;a:0:{}i:2;i:2238;}i:120;a:3:{i:0;s:12:"section_edit";i:1;a:4:{i:0;i:2109;i:1;i:2237;i:2;i:2;i:3;s:21:"14. Cartas p/ CENAPET";}i:2;i:2238;}i:121;a:3:{i:0;s:6:"header";i:1;a:3:{i:0;s:71:"15. Projeto [[/trac/wiki/RoboEdu|RoboEdu?]] [[/trac/wiki/SeTec|SeTec?]]";i:1;i:2;i:2;i:2238;}i:2;i:2238;}i:122;a:3:{i:0;s:12:"section_open";i:1;a:1:{i:0;i:2;}i:2;i:2238;}i:123;a:3:{i:0;s:6:"p_open";i:1;a:0:{}i:2;i:2321;}i:124;a:3:{i:0;s:5:"cdata";i:1;a:1:{i:0;s:24:"
Dante falou do projeto ";}i:2;i:2322;}i:125;a:3:{i:0;s:12:"internallink";i:1;a:2:{i:0;s:18:"/trac/wiki/RoboEdu";i:1;s:8:"RoboEdu?";}i:2;i:2346;}i:126;a:3:{i:0;s:5:"cdata";i:1;a:1:{i:0;s:142:" para escolas técnicas. Dante também falou que a verba deve ser gasta até o fim do ano. Thiago ficou responsável de compilar as sugestões";}i:2;i:2377;}i:127;a:3:{i:0;s:7:"p_close";i:1;a:0:{}i:2;i:2519;}i:128;a:3:{i:0;s:13:"section_close";i:1;a:0:{}i:2;i:2521;}i:129;a:3:{i:0;s:12:"section_edit";i:1;a:4:{i:0;i:2238;i:1;i:2520;i:2;i:2;i:3;s:71:"15. Projeto [[/trac/wiki/RoboEdu|RoboEdu?]] [[/trac/wiki/SeTec|SeTec?]]";}i:2;i:2521;}i:130;a:3:{i:0;s:6:"header";i:1;a:3:{i:0;s:23:"16. Salão de Extensão";i:1;i:2;i:2;i:2521;}i:2;i:2521;}i:131;a:3:{i:0;s:12:"section_open";i:1;a:1:{i:0;i:2;}i:2;i:2521;}i:132;a:3:{i:0;s:6:"p_open";i:1;a:0:{}i:2;i:2556;}i:133;a:3:{i:0;s:5:"cdata";i:1;a:1:{i:0;s:24:"
Dante publicou o evento";}i:2;i:2557;}i:134;a:3:{i:0;s:7:"p_close";i:1;a:0:{}i:2;i:2581;}i:135;a:3:{i:0;s:13:"section_close";i:1;a:0:{}i:2;i:2583;}i:136;a:3:{i:0;s:12:"section_edit";i:1;a:4:{i:0;i:2521;i:1;i:2582;i:2;i:2;i:3;s:23:"16. Salão de Extensão";}i:2;i:2583;}i:137;a:3:{i:0;s:6:"header";i:1;a:3:{i:0;s:32:"17. Programação dos Minicursos";i:1;i:2;i:2;i:2583;}i:2;i:2583;}i:138;a:3:{i:0;s:12:"section_open";i:1;a:1:{i:0;i:2;}i:2;i:2583;}i:139;a:3:{i:0;s:6:"p_open";i:1;a:0:{}i:2;i:2627;}i:140;a:3:{i:0;s:5:"cdata";i:1;a:1:{i:0;s:69:"
Pablo fará pesquisa de possíveis minicursos no salão de extensão";}i:2;i:2628;}i:141;a:3:{i:0;s:7:"p_close";i:1;a:0:{}i:2;i:2697;}i:142;a:3:{i:0;s:13:"section_close";i:1;a:0:{}i:2;i:2699;}i:143;a:3:{i:0;s:12:"section_edit";i:1;a:4:{i:0;i:2583;i:1;i:2698;i:2;i:2;i:3;s:32:"17. Programação dos Minicursos";}i:2;i:2699;}i:144;a:3:{i:0;s:6:"header";i:1;a:3:{i:0;s:52:"18. Ações afirmativas - Visto em reunião anterior";i:1;i:2;i:2;i:2699;}i:2;i:2699;}i:145;a:3:{i:0;s:12:"section_open";i:1;a:1:{i:0;i:2;}i:2;i:2699;}i:146;a:3:{i:0;s:13:"section_close";i:1;a:0:{}i:2;i:2765;}i:147;a:3:{i:0;s:12:"section_edit";i:1;a:4:{i:0;i:2699;i:1;i:2764;i:2;i:2;i:3;s:52:"18. Ações afirmativas - Visto em reunião anterior";}i:2;i:2765;}i:148;a:3:{i:0;s:6:"header";i:1;a:3:{i:0;s:30:"19. Mudanças curriculares ECP";i:1;i:2;i:2;i:2765;}i:2;i:2765;}i:149;a:3:{i:0;s:12:"section_open";i:1;a:1:{i:0;i:2;}i:2;i:2765;}i:150;a:3:{i:0;s:6:"p_open";i:1;a:0:{}i:2;i:2807;}i:151;a:3:{i:0;s:5:"cdata";i:1;a:1:{i:0;s:135:"
Fabiano relatou a situação da Representação Discente e das alterações. Cavalheiro e Fabiano farão parecer sobre as alterações";}i:2;i:2808;}i:152;a:3:{i:0;s:7:"p_close";i:1;a:0:{}i:2;i:2943;}i:153;a:3:{i:0;s:13:"section_close";i:1;a:0:{}i:2;i:2944;}i:154;a:3:{i:0;s:12:"section_edit";i:1;a:4:{i:0;i:2765;i:1;i:0;i:2;i:2;i:3;s:30:"19. Mudanças curriculares ECP";}i:2;i:2944;}i:155;a:3:{i:0;s:12:"document_end";i:1;a:0:{}i:2;i:2944;}}