a:150:{i:0;a:3:{i:0;s:14:"document_start";i:1;a:0:{}i:2;i:0;}i:1;a:3:{i:0;s:6:"p_open";i:1;a:0:{}i:2;i:0;}i:2;a:3:{i:0;s:7:"p_close";i:1;a:0:{}i:2;i:1;}i:3;a:3:{i:0;s:12:"section_edit";i:1;a:4:{i:0;i:-1;i:1;i:0;i:2;i:1;i:3;s:0:"";}i:2;i:1;}i:4;a:3:{i:0;s:6:"header";i:1;a:3:{i:0;s:29:"Ata da Reunião de 22/08/2006";i:1;i:1;i:2;i:1;}i:2;i:1;}i:5;a:3:{i:0;s:12:"section_open";i:1;a:1:{i:0;i:1;}i:2;i:1;}i:6;a:3:{i:0;s:6:"p_open";i:1;a:0:{}i:2;i:44;}i:7;a:3:{i:0;s:5:"cdata";i:1;a:1:{i:0;s:108:"
Presentes: Alexandre, Dante, Estevão, Fabiano, Gabriela, Lucas Cavalheiro, Lucas Mizusaki, Marcos, Ricardo";}i:2;i:45;}i:8;a:3:{i:0;s:7:"p_close";i:1;a:0:{}i:2;i:153;}i:9;a:3:{i:0;s:6:"p_open";i:1;a:0:{}i:2;i:153;}i:10;a:3:{i:0;s:5:"cdata";i:1;a:1:{i:0;s:61:"Ausentes: Pablo, Felipe e Marcelo (justificadas – curso de ";}i:2;i:155;}i:11;a:3:{i:0;s:7:"acronym";i:1;a:1:{i:0;s:4:"HTML";}i:2;i:216;}i:12;a:3:{i:0;s:5:"cdata";i:1;a:1:{i:0;s:1:"/";}i:2;i:220;}i:13;a:3:{i:0;s:7:"acronym";i:1;a:1:{i:0;s:3:"PHP";}i:2;i:221;}i:14;a:3:{i:0;s:5:"cdata";i:1;a:1:{i:0;s:1:")";}i:2;i:224;}i:15;a:3:{i:0;s:7:"p_close";i:1;a:0:{}i:2;i:225;}i:16;a:3:{i:0;s:6:"p_open";i:1;a:0:{}i:2;i:225;}i:17;a:3:{i:0;s:5:"cdata";i:1;a:1:{i:0;s:15:"Relator: Marcos";}i:2;i:227;}i:18;a:3:{i:0;s:7:"p_close";i:1;a:0:{}i:2;i:242;}i:19;a:3:{i:0;s:13:"section_close";i:1;a:0:{}i:2;i:244;}i:20;a:3:{i:0;s:12:"section_edit";i:1;a:4:{i:0;i:1;i:1;i:243;i:2;i:1;i:3;s:29:"Ata da Reunião de 22/08/2006";}i:2;i:244;}i:21;a:3:{i:0;s:6:"header";i:1;a:3:{i:0;s:23:"1. Visita ao museu ARQ2";i:1;i:2;i:2;i:244;}i:2;i:244;}i:22;a:3:{i:0;s:12:"section_open";i:1;a:1:{i:0;i:2;}i:2;i:244;}i:23;a:3:{i:0;s:6:"p_open";i:1;a:0:{}i:2;i:279;}i:24;a:3:{i:0;s:5:"cdata";i:1;a:1:{i:0;s:432:"
Marcos falou com o professor Weber a fim de combinar uma visita dos alunos de ARQ2 ao museu. O professor comentou que esse semestre ele não é o professor da cadeira ( nesse semestre é o professor Netto). Porém, da conversa, foi possível estabelecer alguns pontos: a visita teria que ser em horário de aula, mais para o final da cadeira e mais no final do semestre a fim de permitir que petianos possam comparecer para ajudar.";}i:2;i:280;}i:25;a:3:{i:0;s:7:"p_close";i:1;a:0:{}i:2;i:712;}i:26;a:3:{i:0;s:13:"section_close";i:1;a:0:{}i:2;i:714;}i:27;a:3:{i:0;s:12:"section_edit";i:1;a:4:{i:0;i:244;i:1;i:713;i:2;i:2;i:3;s:23:"1. Visita ao museu ARQ2";}i:2;i:714;}i:28;a:3:{i:0;s:6:"header";i:1;a:3:{i:0;s:38:"2. Falta do Thiago na última reunião";i:1;i:2;i:2;i:714;}i:2;i:714;}i:29;a:3:{i:0;s:12:"section_open";i:1;a:1:{i:0;i:2;}i:2;i:714;}i:30;a:3:{i:0;s:6:"p_open";i:1;a:0:{}i:2;i:764;}i:31;a:3:{i:0;s:5:"cdata";i:1;a:1:{i:0;s:104:"
Thiago relata que teve que pagar uma conta no Praia de Belas e como houve atraso, não pode comparecer.";}i:2;i:765;}i:32;a:3:{i:0;s:7:"p_close";i:1;a:0:{}i:2;i:869;}i:33;a:3:{i:0;s:13:"section_close";i:1;a:0:{}i:2;i:871;}i:34;a:3:{i:0;s:12:"section_edit";i:1;a:4:{i:0;i:714;i:1;i:870;i:2;i:2;i:3;s:38:"2. Falta do Thiago na última reunião";}i:2;i:871;}i:35;a:3:{i:0;s:6:"header";i:1;a:3:{i:0;s:39:"3. Reunião do Cavalheiro com a Andréa";i:1;i:2;i:2;i:871;}i:2;i:871;}i:36;a:3:{i:0;s:12:"section_open";i:1;a:1:{i:0;i:2;}i:2;i:871;}i:37;a:3:{i:0;s:6:"p_open";i:1;a:0:{}i:2;i:922;}i:38;a:3:{i:0;s:5:"cdata";i:1;a:1:{i:0;s:242:"
Cavalheiro reuniu-se com a Andréa a fim de esclarecer a sua situação no PET após o semestre passado (duas reprovações). Andréa disse que não possua conhecimento de qual procedimento tomar, e que levaria a situação ao Comitê Local.";}i:2;i:923;}i:39;a:3:{i:0;s:7:"p_close";i:1;a:0:{}i:2;i:1165;}i:40;a:3:{i:0;s:13:"section_close";i:1;a:0:{}i:2;i:1167;}i:41;a:3:{i:0;s:12:"section_edit";i:1;a:4:{i:0;i:871;i:1;i:1166;i:2;i:2;i:3;s:39:"3. Reunião do Cavalheiro com a Andréa";}i:2;i:1167;}i:42;a:3:{i:0;s:6:"header";i:1;a:3:{i:0;s:31:"4. Reunião PET-Heuser e Kaizen";i:1;i:2;i:2;i:1167;}i:2;i:1167;}i:43;a:3:{i:0;s:12:"section_open";i:1;a:1:{i:0;i:2;}i:2;i:1167;}i:44;a:3:{i:0;s:6:"p_open";i:1;a:0:{}i:2;i:1210;}i:45;a:3:{i:0;s:5:"cdata";i:1;a:1:{i:0;s:666:"
No dia 18/08 os CIC's tiveram uma reunião com o professor Heuser e a professora Viviane para discutir propostas de projetos na área de Banco de Dados e Recuperação de Informações. Thiago, Felipe e Marcos se interessaram pelo projeto proposto por Heuser (banco de dados e sistemas distribuídos) e Pablo se interessou pelo projeot proposto por Viviane ( junto com a Luciana Buriol, rrelacionado à webgraph e RD). Marcelo ainda está por decidir o seu projeto. Haverá uma reunião na quinta com o Heuser e o grupo interessado. Foi comentado para o Heuser sobre a palestra da Kaizen, porém ele constatouq eu não era sua área, que seria Tolerância a Falhas.";}i:2;i:1211;}i:46;a:3:{i:0;s:7:"p_close";i:1;a:0:{}i:2;i:1877;}i:47;a:3:{i:0;s:13:"section_close";i:1;a:0:{}i:2;i:1879;}i:48;a:3:{i:0;s:12:"section_edit";i:1;a:4:{i:0;i:1167;i:1;i:1878;i:2;i:2;i:3;s:31:"4. Reunião PET-Heuser e Kaizen";}i:2;i:1879;}i:49;a:3:{i:0;s:6:"header";i:1;a:3:{i:0;s:40:"5. Sobre [[/trac/wiki/RoboEdu|RoboEdu?]]";i:1;i:2;i:2;i:1879;}i:2;i:1879;}i:50;a:3:{i:0;s:12:"section_open";i:1;a:1:{i:0;i:2;}i:2;i:1879;}i:51;a:3:{i:0;s:6:"p_open";i:1;a:0:{}i:2;i:1931;}i:52;a:3:{i:0;s:5:"cdata";i:1;a:1:{i:0;s:583:"
Fabiano relata sobre a reunião ocorrida na sexta anterior, a qual Alessandro não compareceu: foi decidido entre os petianos que o robô lançador iria lançar algum tipo de projétil e que seria movido por controle remoto. Fabiano encontrou-se também com o consultor Marcelo e foi decidido que no próximo encontro na escola Tubino haverá uma parte inicial de explicação do projeto e depois uma explicação sobre o grupo PET. A próxima reunião do grupo será 01/09. O amigo do Capra, estudante de Eng. Mecânica, compareceu e ofereceu sua ajuda como colaborador no projeto.";}i:2;i:1932;}i:53;a:3:{i:0;s:7:"p_close";i:1;a:0:{}i:2;i:2515;}i:54;a:3:{i:0;s:13:"section_close";i:1;a:0:{}i:2;i:2517;}i:55;a:3:{i:0;s:12:"section_edit";i:1;a:4:{i:0;i:1879;i:1;i:2516;i:2;i:2;i:3;s:40:"5. Sobre [[/trac/wiki/RoboEdu|RoboEdu?]]";}i:2;i:2517;}i:56;a:3:{i:0;s:6:"header";i:1;a:3:{i:0;s:16:"6. Sobre Artigos";i:1;i:2;i:2;i:2517;}i:2;i:2517;}i:57;a:3:{i:0;s:12:"section_open";i:1;a:1:{i:0;i:2;}i:2;i:2517;}i:58;a:3:{i:0;s:6:"p_open";i:1;a:0:{}i:2;i:2545;}i:59;a:3:{i:0;s:5:"cdata";i:1;a:1:{i:0;s:231:"
Thiago relata que conversou com o Alessandro sobre publicação de artigos e como arranjar meios para publicar.Cavalheiro relata que o artigo sobre o museu está bem encaminhado e bem estruturado.Os petianos trabalhando no artigo ";}i:2;i:2546;}i:60;a:3:{i:0;s:12:"internallink";i:1;a:2:{i:0;s:18:"/trac/wiki/RoboEdu";i:1;s:8:"RoboEdu?";}i:2;i:2777;}i:61;a:3:{i:0;s:5:"cdata";i:1;a:1:{i:0;s:250:" se organizam para finalizar o artigo. Foram discutidos também erros ocorridos na hora de mandar para o SBIE e novas motivações foram definidas.Dante relata a apresentação do artigo no SEURS, recomenda para todo o grupo ler o artigo apresentado.";}i:2;i:2808;}i:62;a:3:{i:0;s:7:"p_close";i:1;a:0:{}i:2;i:3058;}i:63;a:3:{i:0;s:13:"section_close";i:1;a:0:{}i:2;i:3060;}i:64;a:3:{i:0;s:12:"section_edit";i:1;a:4:{i:0;i:2517;i:1;i:3059;i:2;i:2;i:3;s:16:"6. Sobre Artigos";}i:2;i:3060;}i:65;a:3:{i:0;s:6:"header";i:1;a:3:{i:0;s:45:"7. Gravação dos documentários para o museu";i:1;i:2;i:2;i:3060;}i:2;i:3060;}i:66;a:3:{i:0;s:12:"section_open";i:1;a:1:{i:0;i:2;}i:2;i:3060;}i:67;a:3:{i:0;s:6:"p_open";i:1;a:0:{}i:2;i:3117;}i:68;a:3:{i:0;s:5:"cdata";i:1;a:1:{i:0;s:282:"
Para a apresentação na Semana Nacional de Ciência e Tecnologia foi pensado em se fazer documentários sobre figuras importantes na informática no RS. Um colega de Fabiano tem algumas aulas na FABICO e poderia ajudar com acesso à material para a criação desses documentários";}i:2;i:3118;}i:69;a:3:{i:0;s:7:"p_close";i:1;a:0:{}i:2;i:3400;}i:70;a:3:{i:0;s:13:"section_close";i:1;a:0:{}i:2;i:3402;}i:71;a:3:{i:0;s:12:"section_edit";i:1;a:4:{i:0;i:3060;i:1;i:3401;i:2;i:2;i:3;s:45:"7. Gravação dos documentários para o museu";}i:2;i:3402;}i:72;a:3:{i:0;s:6:"header";i:1;a:3:{i:0;s:17:"8.Curso C# na PUC";i:1;i:2;i:2;i:3402;}i:2;i:3402;}i:73;a:3:{i:0;s:12:"section_open";i:1;a:1:{i:0;i:2;}i:2;i:3402;}i:74;a:3:{i:0;s:6:"p_open";i:1;a:0:{}i:2;i:3431;}i:75;a:3:{i:0;s:5:"cdata";i:1;a:1:{i:0;s:171:"
Cavalheiro relata que Pablo o comunicou que mandou um email verificando a possibilidade de dois horários possíveis para o curso, e propõem que seja depois das 18h30min";}i:2;i:3432;}i:76;a:3:{i:0;s:7:"p_close";i:1;a:0:{}i:2;i:3603;}i:77;a:3:{i:0;s:13:"section_close";i:1;a:0:{}i:2;i:3605;}i:78;a:3:{i:0;s:12:"section_edit";i:1;a:4:{i:0;i:3402;i:1;i:3604;i:2;i:2;i:3;s:17:"8.Curso C# na PUC";}i:2;i:3605;}i:79;a:3:{i:0;s:6:"header";i:1;a:3:{i:0;s:18:"9. Palestra Kaizen";i:1;i:2;i:2;i:3605;}i:2;i:3605;}i:80;a:3:{i:0;s:12:"section_open";i:1;a:1:{i:0;i:2;}i:2;i:3605;}i:81;a:3:{i:0;s:6:"p_open";i:1;a:0:{}i:2;i:3635;}i:82;a:3:{i:0;s:5:"cdata";i:1;a:1:{i:0;s:282:"
Zambiasi deixa o recado de que a palestra é amanhã, e solicita que todos que puderem comparecer prestigiem. Dante sugere que Zambiasi, por estar mais em contato com o representante da Kaizen, possa citar a participação do PET na organização do evento, no início da palestra.";}i:2;i:3636;}i:83;a:3:{i:0;s:7:"p_close";i:1;a:0:{}i:2;i:3918;}i:84;a:3:{i:0;s:13:"section_close";i:1;a:0:{}i:2;i:3920;}i:85;a:3:{i:0;s:12:"section_edit";i:1;a:4:{i:0;i:3605;i:1;i:3919;i:2;i:2;i:3;s:18:"9. Palestra Kaizen";}i:2;i:3920;}i:86;a:3:{i:0;s:6:"header";i:1;a:3:{i:0;s:45:"10. Projeto do Thiago com o professor Roberto";i:1;i:2;i:2;i:3920;}i:2;i:3920;}i:87;a:3:{i:0;s:12:"section_open";i:1;a:1:{i:0;i:2;}i:2;i:3920;}i:88;a:3:{i:0;s:6:"p_open";i:1;a:0:{}i:2;i:3977;}i:89;a:3:{i:0;s:5:"cdata";i:1;a:1:{i:0;s:105:"
Thiago relata que o seu projeto com o professor Roberto evoluiu bastante e que pode render publicação.";}i:2;i:3978;}i:90;a:3:{i:0;s:7:"p_close";i:1;a:0:{}i:2;i:4083;}i:91;a:3:{i:0;s:13:"section_close";i:1;a:0:{}i:2;i:4085;}i:92;a:3:{i:0;s:12:"section_edit";i:1;a:4:{i:0;i:3920;i:1;i:4084;i:2;i:2;i:3;s:45:"10. Projeto do Thiago com o professor Roberto";}i:2;i:4085;}i:93;a:3:{i:0;s:6:"header";i:1;a:3:{i:0;s:17:"11. Livros do PET";i:1;i:2;i:2;i:4085;}i:2;i:4085;}i:94;a:3:{i:0;s:12:"section_open";i:1;a:1:{i:0;i:2;}i:2;i:4085;}i:95;a:3:{i:0;s:6:"p_open";i:1;a:0:{}i:2;i:4114;}i:96;a:3:{i:0;s:5:"cdata";i:1;a:1:{i:0;s:161:"
Foi constatado que utilizar o sistema Safári é inviável. Fabiano diz que o caixa do PET tem dinheiro para se comprar um livro de Java recomendado por Thiago.";}i:2;i:4115;}i:97;a:3:{i:0;s:7:"p_close";i:1;a:0:{}i:2;i:4276;}i:98;a:3:{i:0;s:13:"section_close";i:1;a:0:{}i:2;i:4278;}i:99;a:3:{i:0;s:12:"section_edit";i:1;a:4:{i:0;i:4085;i:1;i:4277;i:2;i:2;i:3;s:17:"11. Livros do PET";}i:2;i:4278;}i:100;a:3:{i:0;s:6:"header";i:1;a:3:{i:0;s:30:"12. Relatórios de Avaliação";i:1;i:2;i:2;i:4278;}i:2;i:4278;}i:101;a:3:{i:0;s:12:"section_open";i:1;a:1:{i:0;i:2;}i:2;i:4278;}i:102;a:3:{i:0;s:6:"p_open";i:1;a:0:{}i:2;i:4320;}i:103;a:3:{i:0;s:5:"cdata";i:1;a:1:{i:0;s:582:"
Felipe avisa para todos fazerem a auto-avaliação até o final da semana. Fabiano mostra o que a comissão encarregada já fez e mostra as propostas da comissão para pesquisa, ensino e extensão. O grupo propõem modificações, porém maior parte confere. É decidido que semana que vem o grupo finalizará o relatório e fará a avaliação do tutor pelo grupo. O coeficiente acadêmico utilizado será uma média ponderada pelo créditos dos conceitos do último semestre (os conceitos são quantificados baseados na pontuação da própria UFRGS – A:10,B:8,C:6,D:3 e FF:1).";}i:2;i:4321;}i:104;a:3:{i:0;s:7:"p_close";i:1;a:0:{}i:2;i:4903;}i:105;a:3:{i:0;s:13:"section_close";i:1;a:0:{}i:2;i:4905;}i:106;a:3:{i:0;s:12:"section_edit";i:1;a:4:{i:0;i:4278;i:1;i:4904;i:2;i:2;i:3;s:30:"12. Relatórios de Avaliação";}i:2;i:4905;}i:107;a:3:{i:0;s:6:"header";i:1;a:3:{i:0;s:36:"13. Apresentação do TC do Nondillo";i:1;i:2;i:2;i:4905;}i:2;i:4905;}i:108;a:3:{i:0;s:12:"section_open";i:1;a:1:{i:0;i:2;}i:2;i:4905;}i:109;a:3:{i:0;s:6:"p_open";i:1;a:0:{}i:2;i:4953;}i:110;a:3:{i:0;s:5:"cdata";i:1;a:1:{i:0;s:319:"
Marcos comenta que foi uma apresentação completa e objetiva, discutindo bem o planejamento, o desenvolvimento e os problemas enfrentados no seu TC. Dante comenta sobre a qualidade dos egressos da CIC e ECP. Antes da apresentação Nondillo transfere a tesouraria para o Fabiano, e transfere os dados do caixa do PET.";}i:2;i:4954;}i:111;a:3:{i:0;s:7:"p_close";i:1;a:0:{}i:2;i:5273;}i:112;a:3:{i:0;s:13:"section_close";i:1;a:0:{}i:2;i:5275;}i:113;a:3:{i:0;s:12:"section_edit";i:1;a:4:{i:0;i:4905;i:1;i:5274;i:2;i:2;i:3;s:36:"13. Apresentação do TC do Nondillo";}i:2;i:5275;}i:114;a:3:{i:0;s:6:"header";i:1;a:3:{i:0;s:20:"14. Desktops Windows";i:1;i:2;i:2;i:5275;}i:2;i:5275;}i:115;a:3:{i:0;s:12:"section_open";i:1;a:1:{i:0;i:2;}i:2;i:5275;}i:116;a:3:{i:0;s:6:"p_open";i:1;a:0:{}i:2;i:5307;}i:117;a:3:{i:0;s:5:"cdata";i:1;a:1:{i:0;s:120:"
Cavalheiro comenta que os desktops dos Windows estão lotados e que todos devem criar pastas e organizar o que puderem.";}i:2;i:5308;}i:118;a:3:{i:0;s:7:"p_close";i:1;a:0:{}i:2;i:5428;}i:119;a:3:{i:0;s:13:"section_close";i:1;a:0:{}i:2;i:5430;}i:120;a:3:{i:0;s:12:"section_edit";i:1;a:4:{i:0;i:5275;i:1;i:5429;i:2;i:2;i:3;s:20:"14. Desktops Windows";}i:2;i:5430;}i:121;a:3:{i:0;s:6:"header";i:1;a:3:{i:0;s:23:"15. Ações Afirmativas";i:1;i:2;i:2;i:5430;}i:2;i:5430;}i:122;a:3:{i:0;s:12:"section_open";i:1;a:1:{i:0;i:2;}i:2;i:5430;}i:123;a:3:{i:0;s:6:"p_open";i:1;a:0:{}i:2;i:5465;}i:124;a:3:{i:0;s:5:"cdata";i:1;a:1:{i:0;s:131:"
14/09 a Ufrgs terá um dia para discutir ações afirmativas. Dante propõem que algum petiano possa comparecer no turno da tarde.";}i:2;i:5466;}i:125;a:3:{i:0;s:7:"p_close";i:1;a:0:{}i:2;i:5597;}i:126;a:3:{i:0;s:13:"section_close";i:1;a:0:{}i:2;i:5599;}i:127;a:3:{i:0;s:12:"section_edit";i:1;a:4:{i:0;i:5430;i:1;i:5598;i:2;i:2;i:3;s:23:"15. Ações Afirmativas";}i:2;i:5599;}i:128;a:3:{i:0;s:6:"header";i:1;a:3:{i:0;s:32:"16. Representação Discente ECP";i:1;i:2;i:2;i:5599;}i:2;i:5599;}i:129;a:3:{i:0;s:12:"section_open";i:1;a:1:{i:0;i:2;}i:2;i:5599;}i:130;a:3:{i:0;s:6:"p_open";i:1;a:0:{}i:2;i:5643;}i:131;a:3:{i:0;s:5:"cdata";i:1;a:1:{i:0;s:192:"
A atual representante discente da ECP deverá ir para a França e propõem para Fabiano que ele se torne representante. Fabiano relata que está estudando a proposta e os encargos envolvidos.";}i:2;i:5644;}i:132;a:3:{i:0;s:7:"p_close";i:1;a:0:{}i:2;i:5836;}i:133;a:3:{i:0;s:13:"section_close";i:1;a:0:{}i:2;i:5838;}i:134;a:3:{i:0;s:12:"section_edit";i:1;a:4:{i:0;i:5599;i:1;i:5837;i:2;i:2;i:3;s:32:"16. Representação Discente ECP";}i:2;i:5838;}i:135;a:3:{i:0;s:6:"header";i:1;a:3:{i:0;s:10:"17. Livros";i:1;i:2;i:2;i:5838;}i:2;i:5838;}i:136;a:3:{i:0;s:12:"section_open";i:1;a:1:{i:0;i:2;}i:2;i:5838;}i:137;a:3:{i:0;s:6:"p_open";i:1;a:0:{}i:2;i:5860;}i:138;a:3:{i:0;s:5:"cdata";i:1;a:1:{i:0;s:306:"
Thiago comenta que Dante poderia transmitir ao professores do II uma lista de livros a serem aprovados e comprados pela biblioteca. Estevão comenta que uma lista pode ser mandada direto para a coordenadora da biblioteca, que então repassaria por professores. Dante sugere que o grupo PET crie uma lista.";}i:2;i:5861;}i:139;a:3:{i:0;s:7:"p_close";i:1;a:0:{}i:2;i:6167;}i:140;a:3:{i:0;s:13:"section_close";i:1;a:0:{}i:2;i:6169;}i:141;a:3:{i:0;s:12:"section_edit";i:1;a:4:{i:0;i:5838;i:1;i:6168;i:2;i:2;i:3;s:10:"17. Livros";}i:2;i:6169;}i:142;a:3:{i:0;s:6:"header";i:1;a:3:{i:0;s:22:"18. Confraternização";i:1;i:2;i:2;i:6169;}i:2;i:6169;}i:143;a:3:{i:0;s:12:"section_open";i:1;a:1:{i:0;i:2;}i:2;i:6169;}i:144;a:3:{i:0;s:6:"p_open";i:1;a:0:{}i:2;i:6203;}i:145;a:3:{i:0;s:5:"cdata";i:1;a:1:{i:0;s:107:"
Cavalheiro deverá reservar uma quadra para o dia 05/09, 19h. A confirmação deverá sair semana que vem.";}i:2;i:6204;}i:146;a:3:{i:0;s:7:"p_close";i:1;a:0:{}i:2;i:6311;}i:147;a:3:{i:0;s:13:"section_close";i:1;a:0:{}i:2;i:6312;}i:148;a:3:{i:0;s:12:"section_edit";i:1;a:4:{i:0;i:6169;i:1;i:0;i:2;i:2;i:3;s:22:"18. Confraternização";}i:2;i:6312;}i:149;a:3:{i:0;s:12:"document_end";i:1;a:0:{}i:2;i:6312;}}