a:374:{i:0;a:3:{i:0;s:14:"document_start";i:1;a:0:{}i:2;i:0;}i:1;a:3:{i:0;s:6:"p_open";i:1;a:0:{}i:2;i:0;}i:2;a:3:{i:0;s:11:"strong_open";i:1;a:0:{}i:2;i:1;}i:3;a:3:{i:0;s:5:"cdata";i:1;a:1:{i:0;s:44:"== Ata da Reunião de 15 de abril de 2008 ==";}i:2;i:3;}i:4;a:3:{i:0;s:12:"strong_close";i:1;a:0:{}i:2;i:47;}i:5;a:3:{i:0;s:7:"p_close";i:1;a:0:{}i:2;i:49;}i:6;a:3:{i:0;s:6:"p_open";i:1;a:0:{}i:2;i:49;}i:7;a:3:{i:0;s:5:"cdata";i:1;a:1:{i:0;s:176:"Presentes: Antônio, Arthur, Bruno, Portal, Matheus, Kauê, Cassiana, Zambiasi, Rosália, Marcela e Leonardo. Ausentes: Dante (viagem), Felipe (curso de C), Lucas (curso de C).";}i:2;i:51;}i:8;a:3:{i:0;s:7:"p_close";i:1;a:0:{}i:2;i:227;}i:9;a:3:{i:0;s:6:"p_open";i:1;a:0:{}i:2;i:227;}i:10;a:3:{i:0;s:5:"cdata";i:1;a:1:{i:0;s:14:"Relator: Kauê";}i:2;i:229;}i:11;a:3:{i:0;s:7:"p_close";i:1;a:0:{}i:2;i:243;}i:12;a:3:{i:0;s:6:"p_open";i:1;a:0:{}i:2;i:243;}i:13;a:3:{i:0;s:11:"strong_open";i:1;a:0:{}i:2;i:245;}i:14;a:3:{i:0;s:5:"cdata";i:1;a:1:{i:0;s:41:"1) Discussão das Regras Internas - TRAC:";}i:2;i:247;}i:15;a:3:{i:0;s:12:"strong_close";i:1;a:0:{}i:2;i:288;}i:16;a:3:{i:0;s:5:"cdata";i:1;a:1:{i:0;s:1:"
";}i:2;i:290;}i:17;a:3:{i:0;s:7:"p_close";i:1;a:0:{}i:2;i:291;}i:18;a:3:{i:0;s:10:"listu_open";i:1;a:0:{}i:2;i:291;}i:19;a:3:{i:0;s:13:"listitem_open";i:1;a:1:{i:0;i:1;}i:2;i:291;}i:20;a:3:{i:0;s:16:"listcontent_open";i:1;a:0:{}i:2;i:291;}i:21;a:3:{i:0;s:5:"cdata";i:1;a:1:{i:0;s:49:" RI - 105: modificada de 3 horas para 15 minutos.";}i:2;i:295;}i:22;a:3:{i:0;s:17:"listcontent_close";i:1;a:0:{}i:2;i:344;}i:23;a:3:{i:0;s:14:"listitem_close";i:1;a:0:{}i:2;i:344;}i:24;a:3:{i:0;s:13:"listitem_open";i:1;a:1:{i:0;i:1;}i:2;i:344;}i:25;a:3:{i:0;s:16:"listcontent_open";i:1;a:0:{}i:2;i:344;}i:26;a:3:{i:0;s:5:"cdata";i:1;a:1:{i:0;s:8:" Atual: ";}i:2;i:348;}i:27;a:3:{i:0;s:18:"doublequoteopening";i:1;a:0:{}i:2;i:356;}i:28;a:3:{i:0;s:5:"cdata";i:1;a:1:{i:0;s:86:"A pauta da reunião deve estar no TRAC até 15 minutos antes do início da mesma, para";}i:2;i:357;}i:29;a:3:{i:0;s:17:"listcontent_close";i:1;a:0:{}i:2;i:443;}i:30;a:3:{i:0;s:14:"listitem_close";i:1;a:0:{}i:2;i:443;}i:31;a:3:{i:0;s:11:"listu_close";i:1;a:0:{}i:2;i:443;}i:32;a:3:{i:0;s:6:"p_open";i:1;a:0:{}i:2;i:443;}i:33;a:3:{i:0;s:5:"cdata";i:1;a:1:{i:0;s:104:"
que todos possam tomar conhecimento dos assuntos a serem debatidos, tornando a reunião mais produtiva.";}i:2;i:444;}i:34;a:3:{i:0;s:18:"doublequoteclosing";i:1;a:0:{}i:2;i:548;}i:35;a:3:{i:0;s:5:"cdata";i:1;a:1:{i:0;s:1:"
";}i:2;i:549;}i:36;a:3:{i:0;s:7:"p_close";i:1;a:0:{}i:2;i:550;}i:37;a:3:{i:0;s:10:"listu_open";i:1;a:0:{}i:2;i:550;}i:38;a:3:{i:0;s:13:"listitem_open";i:1;a:1:{i:0;i:1;}i:2;i:550;}i:39;a:3:{i:0;s:16:"listcontent_open";i:1;a:0:{}i:2;i:550;}i:40;a:3:{i:0;s:5:"cdata";i:1;a:1:{i:0;s:22:" RI - 107: adicionado ";}i:2;i:554;}i:41;a:3:{i:0;s:18:"doublequoteclosing";i:1;a:0:{}i:2;i:576;}i:42;a:3:{i:0;s:5:"cdata";i:1;a:1:{i:0;s:118:", ficando a cargo de quem coloca o assunto na pauta fazê-lo na posição apropriada em relação aos outros assuntos.";}i:2;i:577;}i:43;a:3:{i:0;s:18:"doublequoteclosing";i:1;a:0:{}i:2;i:695;}i:44;a:3:{i:0;s:5:"cdata";i:1;a:1:{i:0;s:1:".";}i:2;i:696;}i:45;a:3:{i:0;s:17:"listcontent_close";i:1;a:0:{}i:2;i:697;}i:46;a:3:{i:0;s:14:"listitem_close";i:1;a:0:{}i:2;i:697;}i:47;a:3:{i:0;s:13:"listitem_open";i:1;a:1:{i:0;i:1;}i:2;i:697;}i:48;a:3:{i:0;s:16:"listcontent_open";i:1;a:0:{}i:2;i:697;}i:49;a:3:{i:0;s:5:"cdata";i:1;a:1:{i:0;s:8:" Atual: ";}i:2;i:701;}i:50;a:3:{i:0;s:18:"doublequoteopening";i:1;a:0:{}i:2;i:709;}i:51;a:3:{i:0;s:5:"cdata";i:1;a:1:{i:0;s:180:"Os assuntos devem ser debatidos sempre por ordem de prioridade, ficando a cargo de quem coloca o assunto na pauta fazê-lo na posição apropriada em relação aos outros assuntos.";}i:2;i:710;}i:52;a:3:{i:0;s:18:"doublequoteclosing";i:1;a:0:{}i:2;i:890;}i:53;a:3:{i:0;s:17:"listcontent_close";i:1;a:0:{}i:2;i:891;}i:54;a:3:{i:0;s:14:"listitem_close";i:1;a:0:{}i:2;i:891;}i:55;a:3:{i:0;s:11:"listu_close";i:1;a:0:{}i:2;i:891;}i:56;a:3:{i:0;s:10:"listu_open";i:1;a:0:{}i:2;i:892;}i:57;a:3:{i:0;s:13:"listitem_open";i:1;a:1:{i:0;i:1;}i:2;i:892;}i:58;a:3:{i:0;s:16:"listcontent_open";i:1;a:0:{}i:2;i:892;}i:59;a:3:{i:0;s:5:"cdata";i:1;a:1:{i:0;s:25:" RI - 205: modificada de ";}i:2;i:896;}i:60;a:3:{i:0;s:18:"doublequoteopening";i:1;a:0:{}i:2;i:921;}i:61;a:3:{i:0;s:5:"cdata";i:1;a:1:{i:0;s:67:"no arquivo do PET (um pequeno gaveteiro localizado atrás do sofá)";}i:2;i:922;}i:62;a:3:{i:0;s:18:"doublequoteclosing";i:1;a:0:{}i:2;i:989;}i:63;a:3:{i:0;s:5:"cdata";i:1;a:1:{i:0;s:6:" para ";}i:2;i:990;}i:64;a:3:{i:0;s:18:"doublequoteclosing";i:1;a:0:{}i:2;i:996;}i:65;a:3:{i:0;s:18:"doublequoteclosing";i:1;a:0:{}i:2;i:997;}i:66;a:3:{i:0;s:5:"cdata";i:1;a:1:{i:0;s:1:".";}i:2;i:998;}i:67;a:3:{i:0;s:17:"listcontent_close";i:1;a:0:{}i:2;i:999;}i:68;a:3:{i:0;s:14:"listitem_close";i:1;a:0:{}i:2;i:999;}i:69;a:3:{i:0;s:13:"listitem_open";i:1;a:1:{i:0;i:1;}i:2;i:999;}i:70;a:3:{i:0;s:16:"listcontent_open";i:1;a:0:{}i:2;i:999;}i:71;a:3:{i:0;s:5:"cdata";i:1;a:1:{i:0;s:8:" Atual: ";}i:2;i:1003;}i:72;a:3:{i:0;s:18:"doublequoteopening";i:1;a:0:{}i:2;i:1011;}i:73;a:3:{i:0;s:5:"cdata";i:1;a:1:{i:0;s:86:"Deve-se evitar o acúmulo de materiais nas prateleiras, mesas e sobre os computadores.";}i:2;i:1012;}i:74;a:3:{i:0;s:17:"listcontent_close";i:1;a:0:{}i:2;i:1098;}i:75;a:3:{i:0;s:14:"listitem_close";i:1;a:0:{}i:2;i:1098;}i:76;a:3:{i:0;s:11:"listu_close";i:1;a:0:{}i:2;i:1098;}i:77;a:3:{i:0;s:6:"p_open";i:1;a:0:{}i:2;i:1098;}i:78;a:3:{i:0;s:5:"cdata";i:1;a:1:{i:0;s:195:"
Se necessário deve-se manter esses objetos de maneira organizada na estante. Papéis antigos e documentos importantes devem ser guardados para não serem perdidos e não ocuparem espaço útil.";}i:2;i:1099;}i:79;a:3:{i:0;s:18:"doublequoteclosing";i:1;a:0:{}i:2;i:1294;}i:80;a:3:{i:0;s:5:"cdata";i:1;a:1:{i:0;s:1:"
";}i:2;i:1295;}i:81;a:3:{i:0;s:7:"p_close";i:1;a:0:{}i:2;i:1296;}i:82;a:3:{i:0;s:10:"listu_open";i:1;a:0:{}i:2;i:1296;}i:83;a:3:{i:0;s:13:"listitem_open";i:1;a:1:{i:0;i:1;}i:2;i:1296;}i:84;a:3:{i:0;s:16:"listcontent_open";i:1;a:0:{}i:2;i:1296;}i:85;a:3:{i:0;s:5:"cdata";i:1;a:1:{i:0;s:21:" RI - 206: adcionado ";}i:2;i:1300;}i:86;a:3:{i:0;s:18:"doublequoteopening";i:1;a:0:{}i:2;i:1321;}i:87;a:3:{i:0;s:5:"cdata";i:1;a:1:{i:0;s:99:"Manter uma caixa de papéis renegados, a qual será esvaziada todas as segundas-feiras pela manhã.";}i:2;i:1322;}i:88;a:3:{i:0;s:18:"doublequoteclosing";i:1;a:0:{}i:2;i:1421;}i:89;a:3:{i:0;s:5:"cdata";i:1;a:1:{i:0;s:32:", que ficará a cargo de Arthur.";}i:2;i:1422;}i:90;a:3:{i:0;s:17:"listcontent_close";i:1;a:0:{}i:2;i:1454;}i:91;a:3:{i:0;s:14:"listitem_close";i:1;a:0:{}i:2;i:1454;}i:92;a:3:{i:0;s:13:"listitem_open";i:1;a:1:{i:0;i:1;}i:2;i:1454;}i:93;a:3:{i:0;s:16:"listcontent_open";i:1;a:0:{}i:2;i:1454;}i:94;a:3:{i:0;s:5:"cdata";i:1;a:1:{i:0;s:8:" Atual: ";}i:2;i:1458;}i:95;a:3:{i:0;s:18:"doublequoteopening";i:1;a:0:{}i:2;i:1466;}i:96;a:3:{i:0;s:5:"cdata";i:1;a:1:{i:0;s:84:"Deve-se evitar o acúmulo de lixo e rascunhos. Cabe ao bolsista controlar jogar fora";}i:2;i:1467;}i:97;a:3:{i:0;s:17:"listcontent_close";i:1;a:0:{}i:2;i:1551;}i:98;a:3:{i:0;s:14:"listitem_close";i:1;a:0:{}i:2;i:1551;}i:99;a:3:{i:0;s:11:"listu_close";i:1;a:0:{}i:2;i:1551;}i:100;a:3:{i:0;s:6:"p_open";i:1;a:0:{}i:2;i:1551;}i:101;a:3:{i:0;s:5:"cdata";i:1;a:1:{i:0;s:35:"
seus papéis antigos, copos usados";}i:2;i:1552;}i:102;a:3:{i:0;s:6:"entity";i:1;a:1:{i:0;s:3:"...";}i:2;i:1587;}i:103;a:3:{i:0;s:5:"cdata";i:1;a:1:{i:0;s:176:" O líder pode pedir uma limpeza da sala e se livrar do material em excesso. Manter uma caixa de papéis renegados, a qual será esvaziada todas as segundas-feiras pela manhã.";}i:2;i:1590;}i:104;a:3:{i:0;s:18:"doublequoteclosing";i:1;a:0:{}i:2;i:1766;}i:105;a:3:{i:0;s:5:"cdata";i:1;a:1:{i:0;s:1:"
";}i:2;i:1767;}i:106;a:3:{i:0;s:7:"p_close";i:1;a:0:{}i:2;i:1768;}i:107;a:3:{i:0;s:10:"listu_open";i:1;a:0:{}i:2;i:1768;}i:108;a:3:{i:0;s:13:"listitem_open";i:1;a:1:{i:0;i:1;}i:2;i:1768;}i:109;a:3:{i:0;s:16:"listcontent_open";i:1;a:0:{}i:2;i:1768;}i:110;a:3:{i:0;s:5:"cdata";i:1;a:1:{i:0;s:22:" RI - 207: adicionado ";}i:2;i:1772;}i:111;a:3:{i:0;s:18:"doublequoteopening";i:1;a:0:{}i:2;i:1794;}i:112;a:3:{i:0;s:5:"cdata";i:1;a:1:{i:0;s:229:"Pede-se que haja bom senso em relação ao lugar em que são colocados os objetos pessoais (mochilas, bolsas, sacolas, etc.). Fica permitido (e encorajado) aos membros do grupo trocar de lugar os objetos que estejam atrapalhando.";}i:2;i:1795;}i:113;a:3:{i:0;s:18:"doublequoteclosing";i:1;a:0:{}i:2;i:2024;}i:114;a:3:{i:0;s:17:"listcontent_close";i:1;a:0:{}i:2;i:2025;}i:115;a:3:{i:0;s:14:"listitem_close";i:1;a:0:{}i:2;i:2025;}i:116;a:3:{i:0;s:13:"listitem_open";i:1;a:1:{i:0;i:1;}i:2;i:2025;}i:117;a:3:{i:0;s:16:"listcontent_open";i:1;a:0:{}i:2;i:2025;}i:118;a:3:{i:0;s:5:"cdata";i:1;a:1:{i:0;s:8:" Atual: ";}i:2;i:2029;}i:119;a:3:{i:0;s:18:"doublequoteopening";i:1;a:0:{}i:2;i:2037;}i:120;a:3:{i:0;s:5:"cdata";i:1;a:1:{i:0;s:25:"Mochilas, pastas, sacolas";}i:2;i:2038;}i:121;a:3:{i:0;s:6:"entity";i:1;a:1:{i:0;s:3:"...";}i:2;i:2063;}i:122;a:3:{i:0;s:5:"cdata";i:1;a:1:{i:0;s:53:" Devem ser colocadas nas prateleiras, e não sobre as";}i:2;i:2066;}i:123;a:3:{i:0;s:17:"listcontent_close";i:1;a:0:{}i:2;i:2119;}i:124;a:3:{i:0;s:14:"listitem_close";i:1;a:0:{}i:2;i:2119;}i:125;a:3:{i:0;s:11:"listu_close";i:1;a:0:{}i:2;i:2119;}i:126;a:3:{i:0;s:6:"p_open";i:1;a:0:{}i:2;i:2119;}i:127;a:3:{i:0;s:5:"cdata";i:1;a:1:{i:0;s:270:"
cadeiras, mesas ou sofás, para evitar o desperdício de espaço útil da sala. Pede-se que haja bom senso em relação ao lugar em que são colocados estes objetos. Fica permitido (e encorajado) aos membros do grupo trocar de lugar os objetos que estejam atrapalhando.";}i:2;i:2120;}i:128;a:3:{i:0;s:18:"doublequoteclosing";i:1;a:0:{}i:2;i:2390;}i:129;a:3:{i:0;s:5:"cdata";i:1;a:1:{i:0;s:1:"
";}i:2;i:2391;}i:130;a:3:{i:0;s:7:"p_close";i:1;a:0:{}i:2;i:2392;}i:131;a:3:{i:0;s:10:"listu_open";i:1;a:0:{}i:2;i:2392;}i:132;a:3:{i:0;s:13:"listitem_open";i:1;a:1:{i:0;i:1;}i:2;i:2392;}i:133;a:3:{i:0;s:16:"listcontent_open";i:1;a:0:{}i:2;i:2392;}i:134;a:3:{i:0;s:5:"cdata";i:1;a:1:{i:0;s:20:" RI - 501: Apagada (";}i:2;i:2396;}i:135;a:3:{i:0;s:18:"doublequoteopening";i:1;a:0:{}i:2;i:2416;}i:136;a:3:{i:0;s:5:"cdata";i:1;a:1:{i:0;s:96:"Um planejamento trimestral deve ser feito por cada petiano e este deve ser aprovado em reunião.";}i:2;i:2417;}i:137;a:3:{i:0;s:18:"doublequoteclosing";i:1;a:0:{}i:2;i:2513;}i:138;a:3:{i:0;s:5:"cdata";i:1;a:1:{i:0;s:2:").";}i:2;i:2514;}i:139;a:3:{i:0;s:17:"listcontent_close";i:1;a:0:{}i:2;i:2516;}i:140;a:3:{i:0;s:14:"listitem_close";i:1;a:0:{}i:2;i:2516;}i:141;a:3:{i:0;s:11:"listu_close";i:1;a:0:{}i:2;i:2516;}i:142;a:3:{i:0;s:10:"listu_open";i:1;a:0:{}i:2;i:2517;}i:143;a:3:{i:0;s:13:"listitem_open";i:1;a:1:{i:0;i:1;}i:2;i:2517;}i:144;a:3:{i:0;s:16:"listcontent_open";i:1;a:0:{}i:2;i:2517;}i:145;a:3:{i:0;s:5:"cdata";i:1;a:1:{i:0;s:20:" RI - 502: Apagada (";}i:2;i:2521;}i:146;a:3:{i:0;s:18:"doublequoteopening";i:1;a:0:{}i:2;i:2541;}i:147;a:3:{i:0;s:5:"cdata";i:1;a:1:{i:0;s:216:"Cada planejamento trimestral deve ser avaliado, em reunião, após término de sua vigência. Deve-se determinar o porquê do eventual não cumprimento das atividades, visando a adequação dos futuros planejamentos.";}i:2;i:2542;}i:148;a:3:{i:0;s:18:"doublequoteclosing";i:1;a:0:{}i:2;i:2758;}i:149;a:3:{i:0;s:5:"cdata";i:1;a:1:{i:0;s:2:").";}i:2;i:2759;}i:150;a:3:{i:0;s:17:"listcontent_close";i:1;a:0:{}i:2;i:2761;}i:151;a:3:{i:0;s:14:"listitem_close";i:1;a:0:{}i:2;i:2761;}i:152;a:3:{i:0;s:11:"listu_close";i:1;a:0:{}i:2;i:2761;}i:153;a:3:{i:0;s:10:"listu_open";i:1;a:0:{}i:2;i:2762;}i:154;a:3:{i:0;s:13:"listitem_open";i:1;a:1:{i:0;i:1;}i:2;i:2762;}i:155;a:3:{i:0;s:16:"listcontent_open";i:1;a:0:{}i:2;i:2762;}i:156;a:3:{i:0;s:5:"cdata";i:1;a:1:{i:0;s:25:" RI - 504: modificada de ";}i:2;i:2766;}i:157;a:3:{i:0;s:18:"doublequoteopening";i:1;a:0:{}i:2;i:2791;}i:158;a:3:{i:0;s:5:"cdata";i:1;a:1:{i:0;s:24:"quatro em quatro semanas";}i:2;i:2792;}i:159;a:3:{i:0;s:18:"doublequoteclosing";i:1;a:0:{}i:2;i:2816;}i:160;a:3:{i:0;s:5:"cdata";i:1;a:1:{i:0;s:6:" para ";}i:2;i:2817;}i:161;a:3:{i:0;s:18:"doublequoteopening";i:1;a:0:{}i:2;i:2823;}i:162;a:3:{i:0;s:5:"cdata";i:1;a:1:{i:0;s:20:"duas em duas semanas";}i:2;i:2824;}i:163;a:3:{i:0;s:18:"doublequoteclosing";i:1;a:0:{}i:2;i:2844;}i:164;a:3:{i:0;s:5:"cdata";i:1;a:1:{i:0;s:1:".";}i:2;i:2845;}i:165;a:3:{i:0;s:17:"listcontent_close";i:1;a:0:{}i:2;i:2846;}i:166;a:3:{i:0;s:14:"listitem_close";i:1;a:0:{}i:2;i:2846;}i:167;a:3:{i:0;s:13:"listitem_open";i:1;a:1:{i:0;i:1;}i:2;i:2846;}i:168;a:3:{i:0;s:16:"listcontent_open";i:1;a:0:{}i:2;i:2846;}i:169;a:3:{i:0;s:5:"cdata";i:1;a:1:{i:0;s:8:" Atual: ";}i:2;i:2850;}i:170;a:3:{i:0;s:18:"doublequoteopening";i:1;a:0:{}i:2;i:2858;}i:171;a:3:{i:0;s:5:"cdata";i:1;a:1:{i:0;s:76:"De duas em duas semanas esses relatórios devem ser rapidamente avaliados em";}i:2;i:2859;}i:172;a:3:{i:0;s:17:"listcontent_close";i:1;a:0:{}i:2;i:2935;}i:173;a:3:{i:0;s:14:"listitem_close";i:1;a:0:{}i:2;i:2935;}i:174;a:3:{i:0;s:11:"listu_close";i:1;a:0:{}i:2;i:2935;}i:175;a:3:{i:0;s:6:"p_open";i:1;a:0:{}i:2;i:2935;}i:176;a:3:{i:0;s:5:"cdata";i:1;a:1:{i:0;s:75:"
reunião. Deve-se observar os porquês de eventuais baixas produtividades.";}i:2;i:2936;}i:177;a:3:{i:0;s:18:"doublequoteclosing";i:1;a:0:{}i:2;i:3011;}i:178;a:3:{i:0;s:5:"cdata";i:1;a:1:{i:0;s:1:"
";}i:2;i:3012;}i:179;a:3:{i:0;s:7:"p_close";i:1;a:0:{}i:2;i:3013;}i:180;a:3:{i:0;s:10:"listu_open";i:1;a:0:{}i:2;i:3013;}i:181;a:3:{i:0;s:13:"listitem_open";i:1;a:1:{i:0;i:1;}i:2;i:3013;}i:182;a:3:{i:0;s:16:"listcontent_open";i:1;a:0:{}i:2;i:3013;}i:183;a:3:{i:0;s:5:"cdata";i:1;a:1:{i:0;s:25:" RI - 505: modificada de ";}i:2;i:3017;}i:184;a:3:{i:0;s:18:"doublequoteopening";i:1;a:0:{}i:2;i:3042;}i:185;a:3:{i:0;s:5:"cdata";i:1;a:1:{i:0;s:101:"Deve-se especificar o tempo aproximado de duração de cada tarefa descrita nos relatórios semanais.";}i:2;i:3043;}i:186;a:3:{i:0;s:18:"doublequoteclosing";i:1;a:0:{}i:2;i:3144;}i:187;a:3:{i:0;s:5:"cdata";i:1;a:1:{i:0;s:6:" para ";}i:2;i:3145;}i:188;a:3:{i:0;s:18:"doublequoteopening";i:1;a:0:{}i:2;i:3151;}i:189;a:3:{i:0;s:5:"cdata";i:1;a:1:{i:0;s:83:"Deve-se especificar o(s) dia(s) da semana no(s) qual(is) foi realizada cada tarefa.";}i:2;i:3152;}i:190;a:3:{i:0;s:18:"doublequoteclosing";i:1;a:0:{}i:2;i:3235;}i:191;a:3:{i:0;s:5:"cdata";i:1;a:1:{i:0;s:1:".";}i:2;i:3236;}i:192;a:3:{i:0;s:17:"listcontent_close";i:1;a:0:{}i:2;i:3237;}i:193;a:3:{i:0;s:14:"listitem_close";i:1;a:0:{}i:2;i:3237;}i:194;a:3:{i:0;s:13:"listitem_open";i:1;a:1:{i:0;i:1;}i:2;i:3237;}i:195;a:3:{i:0;s:16:"listcontent_open";i:1;a:0:{}i:2;i:3237;}i:196;a:3:{i:0;s:5:"cdata";i:1;a:1:{i:0;s:8:" Atual: ";}i:2;i:3241;}i:197;a:3:{i:0;s:18:"doublequoteopening";i:1;a:0:{}i:2;i:3249;}i:198;a:3:{i:0;s:5:"cdata";i:1;a:1:{i:0;s:83:"Deve-se especificar o(s) dia(s) da semana no(s) qual(is) foi realizada cada tarefa.";}i:2;i:3250;}i:199;a:3:{i:0;s:18:"doublequoteclosing";i:1;a:0:{}i:2;i:3333;}i:200;a:3:{i:0;s:17:"listcontent_close";i:1;a:0:{}i:2;i:3334;}i:201;a:3:{i:0;s:14:"listitem_close";i:1;a:0:{}i:2;i:3334;}i:202;a:3:{i:0;s:11:"listu_close";i:1;a:0:{}i:2;i:3334;}i:203;a:3:{i:0;s:10:"listu_open";i:1;a:0:{}i:2;i:3335;}i:204;a:3:{i:0;s:13:"listitem_open";i:1;a:1:{i:0;i:1;}i:2;i:3335;}i:205;a:3:{i:0;s:16:"listcontent_open";i:1;a:0:{}i:2;i:3335;}i:206;a:3:{i:0;s:5:"cdata";i:1;a:1:{i:0;s:73:" RI - 600 à RI - 606: voltarão a ser obedecidas quando houver servidor.";}i:2;i:3339;}i:207;a:3:{i:0;s:17:"listcontent_close";i:1;a:0:{}i:2;i:3412;}i:208;a:3:{i:0;s:14:"listitem_close";i:1;a:0:{}i:2;i:3412;}i:209;a:3:{i:0;s:11:"listu_close";i:1;a:0:{}i:2;i:3412;}i:210;a:3:{i:0;s:6:"p_open";i:1;a:0:{}i:2;i:3412;}i:211;a:3:{i:0;s:5:"cdata";i:1;a:1:{i:0;s:1:"
";}i:2;i:3413;}i:212;a:3:{i:0;s:11:"strong_open";i:1;a:0:{}i:2;i:3414;}i:213;a:3:{i:0;s:5:"cdata";i:1;a:1:{i:0;s:17:"2) Volta do TRAC:";}i:2;i:3416;}i:214;a:3:{i:0;s:12:"strong_close";i:1;a:0:{}i:2;i:3433;}i:215;a:3:{i:0;s:5:"cdata";i:1;a:1:{i:0;s:1:"
";}i:2;i:3435;}i:216;a:3:{i:0;s:7:"p_close";i:1;a:0:{}i:2;i:3436;}i:217;a:3:{i:0;s:10:"listu_open";i:1;a:0:{}i:2;i:3436;}i:218;a:3:{i:0;s:13:"listitem_open";i:1;a:1:{i:0;i:1;}i:2;i:3436;}i:219;a:3:{i:0;s:16:"listcontent_open";i:1;a:0:{}i:2;i:3436;}i:220;a:3:{i:0;s:5:"cdata";i:1;a:1:{i:0;s:132:" Os membros do grupo devem colocar suas informações atualizadas no TRAC e que os relatórios devem voltar a ser escritos no mesmo.";}i:2;i:3440;}i:221;a:3:{i:0;s:17:"listcontent_close";i:1;a:0:{}i:2;i:3572;}i:222;a:3:{i:0;s:14:"listitem_close";i:1;a:0:{}i:2;i:3572;}i:223;a:3:{i:0;s:11:"listu_close";i:1;a:0:{}i:2;i:3572;}i:224;a:3:{i:0;s:6:"p_open";i:1;a:0:{}i:2;i:3572;}i:225;a:3:{i:0;s:5:"cdata";i:1;a:1:{i:0;s:1:"
";}i:2;i:3573;}i:226;a:3:{i:0;s:11:"strong_open";i:1;a:0:{}i:2;i:3574;}i:227;a:3:{i:0;s:5:"cdata";i:1;a:1:{i:0;s:21:"3) Semana Acadêmica:";}i:2;i:3576;}i:228;a:3:{i:0;s:12:"strong_close";i:1;a:0:{}i:2;i:3597;}i:229;a:3:{i:0;s:5:"cdata";i:1;a:1:{i:0;s:1:"
";}i:2;i:3599;}i:230;a:3:{i:0;s:7:"p_close";i:1;a:0:{}i:2;i:3600;}i:231;a:3:{i:0;s:10:"listu_open";i:1;a:0:{}i:2;i:3600;}i:232;a:3:{i:0;s:13:"listitem_open";i:1;a:1:{i:0;i:1;}i:2;i:3600;}i:233;a:3:{i:0;s:16:"listcontent_open";i:1;a:0:{}i:2;i:3600;}i:234;a:3:{i:0;s:5:"cdata";i:1;a:1:{i:0;s:73:" Atividades que serão realizadas pelo grupo: Maratona de Programação, ";}i:2;i:3604;}i:235;a:3:{i:0;s:18:"doublequoteopening";i:1;a:0:{}i:2;i:3677;}i:236;a:3:{i:0;s:5:"cdata";i:1;a:1:{i:0;s:15:"curso de Python";}i:2;i:3678;}i:237;a:3:{i:0;s:18:"doublequoteclosing";i:1;a:0:{}i:2;i:3693;}i:238;a:3:{i:0;s:5:"cdata";i:1;a:1:{i:0;s:55:", oficina de Robótica, (talvez) palestra de Robótica.";}i:2;i:3694;}i:239;a:3:{i:0;s:17:"listcontent_close";i:1;a:0:{}i:2;i:3749;}i:240;a:3:{i:0;s:14:"listitem_close";i:1;a:0:{}i:2;i:3749;}i:241;a:3:{i:0;s:13:"listitem_open";i:1;a:1:{i:0;i:1;}i:2;i:3749;}i:242;a:3:{i:0;s:16:"listcontent_open";i:1;a:0:{}i:2;i:3749;}i:243;a:3:{i:0;s:5:"cdata";i:1;a:1:{i:0;s:50:" Portas Abertas: banca, museu, nômade e seguidor.";}i:2;i:3753;}i:244;a:3:{i:0;s:17:"listcontent_close";i:1;a:0:{}i:2;i:3803;}i:245;a:3:{i:0;s:14:"listitem_close";i:1;a:0:{}i:2;i:3803;}i:246;a:3:{i:0;s:11:"listu_close";i:1;a:0:{}i:2;i:3803;}i:247;a:3:{i:0;s:6:"p_open";i:1;a:0:{}i:2;i:3803;}i:248;a:3:{i:0;s:5:"cdata";i:1;a:1:{i:0;s:1:"
";}i:2;i:3804;}i:249;a:3:{i:0;s:11:"strong_open";i:1;a:0:{}i:2;i:3805;}i:250;a:3:{i:0;s:5:"cdata";i:1;a:1:{i:0;s:16:"4) Curso de C++:";}i:2;i:3807;}i:251;a:3:{i:0;s:12:"strong_close";i:1;a:0:{}i:2;i:3823;}i:252;a:3:{i:0;s:5:"cdata";i:1;a:1:{i:0;s:1:"
";}i:2;i:3825;}i:253;a:3:{i:0;s:7:"p_close";i:1;a:0:{}i:2;i:3826;}i:254;a:3:{i:0;s:10:"listu_open";i:1;a:0:{}i:2;i:3826;}i:255;a:3:{i:0;s:13:"listitem_open";i:1;a:1:{i:0;i:1;}i:2;i:3826;}i:256;a:3:{i:0;s:16:"listcontent_open";i:1;a:0:{}i:2;i:3826;}i:257;a:3:{i:0;s:5:"cdata";i:1;a:1:{i:0;s:100:" Será realizado na Semana Acadêmica ou após. A apostila deverá ser terminada até o fim do mês.";}i:2;i:3830;}i:258;a:3:{i:0;s:17:"listcontent_close";i:1;a:0:{}i:2;i:3930;}i:259;a:3:{i:0;s:14:"listitem_close";i:1;a:0:{}i:2;i:3930;}i:260;a:3:{i:0;s:11:"listu_close";i:1;a:0:{}i:2;i:3930;}i:261;a:3:{i:0;s:6:"p_open";i:1;a:0:{}i:2;i:3930;}i:262;a:3:{i:0;s:5:"cdata";i:1;a:1:{i:0;s:1:"
";}i:2;i:3931;}i:263;a:3:{i:0;s:11:"strong_open";i:1;a:0:{}i:2;i:3932;}i:264;a:3:{i:0;s:5:"cdata";i:1;a:1:{i:0;s:18:"5) Reunião da IA:";}i:2;i:3934;}i:265;a:3:{i:0;s:12:"strong_close";i:1;a:0:{}i:2;i:3952;}i:266;a:3:{i:0;s:5:"cdata";i:1;a:1:{i:0;s:1:"
";}i:2;i:3954;}i:267;a:3:{i:0;s:7:"p_close";i:1;a:0:{}i:2;i:3955;}i:268;a:3:{i:0;s:10:"listu_open";i:1;a:0:{}i:2;i:3955;}i:269;a:3:{i:0;s:13:"listitem_open";i:1;a:1:{i:0;i:1;}i:2;i:3955;}i:270;a:3:{i:0;s:16:"listcontent_open";i:1;a:0:{}i:2;i:3955;}i:271;a:3:{i:0;s:5:"cdata";i:1;a:1:{i:0;s:64:" Será realizada terça-feira (22/04) ás 15 horas e 30 minutos.";}i:2;i:3959;}i:272;a:3:{i:0;s:17:"listcontent_close";i:1;a:0:{}i:2;i:4023;}i:273;a:3:{i:0;s:14:"listitem_close";i:1;a:0:{}i:2;i:4023;}i:274;a:3:{i:0;s:11:"listu_close";i:1;a:0:{}i:2;i:4023;}i:275;a:3:{i:0;s:6:"p_open";i:1;a:0:{}i:2;i:4023;}i:276;a:3:{i:0;s:5:"cdata";i:1;a:1:{i:0;s:1:"
";}i:2;i:4024;}i:277;a:3:{i:0;s:11:"strong_open";i:1;a:0:{}i:2;i:4025;}i:278;a:3:{i:0;s:5:"cdata";i:1;a:1:{i:0;s:20:"6) Churrasco do PET:";}i:2;i:4027;}i:279;a:3:{i:0;s:12:"strong_close";i:1;a:0:{}i:2;i:4047;}i:280;a:3:{i:0;s:5:"cdata";i:1;a:1:{i:0;s:1:"
";}i:2;i:4049;}i:281;a:3:{i:0;s:7:"p_close";i:1;a:0:{}i:2;i:4050;}i:282;a:3:{i:0;s:10:"listu_open";i:1;a:0:{}i:2;i:4050;}i:283;a:3:{i:0;s:13:"listitem_open";i:1;a:1:{i:0;i:1;}i:2;i:4050;}i:284;a:3:{i:0;s:16:"listcontent_open";i:1;a:0:{}i:2;i:4050;}i:285;a:3:{i:0;s:5:"cdata";i:1;a:1:{i:0;s:78:" Fica marcado para o dia 09/05. Marcela fica responsável de falar com Flores.";}i:2;i:4054;}i:286;a:3:{i:0;s:17:"listcontent_close";i:1;a:0:{}i:2;i:4132;}i:287;a:3:{i:0;s:14:"listitem_close";i:1;a:0:{}i:2;i:4132;}i:288;a:3:{i:0;s:11:"listu_close";i:1;a:0:{}i:2;i:4132;}i:289;a:3:{i:0;s:6:"p_open";i:1;a:0:{}i:2;i:4132;}i:290;a:3:{i:0;s:5:"cdata";i:1;a:1:{i:0;s:1:"
";}i:2;i:4133;}i:291;a:3:{i:0;s:11:"strong_open";i:1;a:0:{}i:2;i:4134;}i:292;a:3:{i:0;s:5:"cdata";i:1;a:1:{i:0;s:62:"7) Reunião do projeto RoboEDU com a professora Extráuzaluas:";}i:2;i:4136;}i:293;a:3:{i:0;s:12:"strong_close";i:1;a:0:{}i:2;i:4198;}i:294;a:3:{i:0;s:5:"cdata";i:1;a:1:{i:0;s:1:"
";}i:2;i:4200;}i:295;a:3:{i:0;s:7:"p_close";i:1;a:0:{}i:2;i:4201;}i:296;a:3:{i:0;s:10:"listu_open";i:1;a:0:{}i:2;i:4201;}i:297;a:3:{i:0;s:13:"listitem_open";i:1;a:1:{i:0;i:1;}i:2;i:4201;}i:298;a:3:{i:0;s:16:"listcontent_open";i:1;a:0:{}i:2;i:4201;}i:299;a:3:{i:0;s:5:"cdata";i:1;a:1:{i:0;s:70:" Tópico adiado para a próxima reunião devido à ausência do Lucas.";}i:2;i:4205;}i:300;a:3:{i:0;s:17:"listcontent_close";i:1;a:0:{}i:2;i:4275;}i:301;a:3:{i:0;s:14:"listitem_close";i:1;a:0:{}i:2;i:4275;}i:302;a:3:{i:0;s:11:"listu_close";i:1;a:0:{}i:2;i:4275;}i:303;a:3:{i:0;s:6:"p_open";i:1;a:0:{}i:2;i:4275;}i:304;a:3:{i:0;s:5:"cdata";i:1;a:1:{i:0;s:1:"
";}i:2;i:4276;}i:305;a:3:{i:0;s:11:"strong_open";i:1;a:0:{}i:2;i:4277;}i:306;a:3:{i:0;s:5:"cdata";i:1;a:1:{i:0;s:20:"8) Sobre o servidor:";}i:2;i:4279;}i:307;a:3:{i:0;s:12:"strong_close";i:1;a:0:{}i:2;i:4299;}i:308;a:3:{i:0;s:5:"cdata";i:1;a:1:{i:0;s:1:"
";}i:2;i:4301;}i:309;a:3:{i:0;s:7:"p_close";i:1;a:0:{}i:2;i:4302;}i:310;a:3:{i:0;s:10:"listu_open";i:1;a:0:{}i:2;i:4302;}i:311;a:3:{i:0;s:13:"listitem_open";i:1;a:1:{i:0;i:1;}i:2;i:4302;}i:312;a:3:{i:0;s:16:"listcontent_open";i:1;a:0:{}i:2;i:4302;}i:313;a:3:{i:0;s:5:"cdata";i:1;a:1:{i:0;s:121:" A placa mãe do servidor teve que ser trocada, portanto os orçamentos terão que ser refeitos. Bruno está encarregado.";}i:2;i:4306;}i:314;a:3:{i:0;s:17:"listcontent_close";i:1;a:0:{}i:2;i:4427;}i:315;a:3:{i:0;s:14:"listitem_close";i:1;a:0:{}i:2;i:4427;}i:316;a:3:{i:0;s:11:"listu_close";i:1;a:0:{}i:2;i:4427;}i:317;a:3:{i:0;s:6:"p_open";i:1;a:0:{}i:2;i:4427;}i:318;a:3:{i:0;s:5:"cdata";i:1;a:1:{i:0;s:1:"
";}i:2;i:4428;}i:319;a:3:{i:0;s:11:"strong_open";i:1;a:0:{}i:2;i:4429;}i:320;a:3:{i:0;s:5:"cdata";i:1;a:1:{i:0;s:10:"9) SulPet:";}i:2;i:4431;}i:321;a:3:{i:0;s:12:"strong_close";i:1;a:0:{}i:2;i:4441;}i:322;a:3:{i:0;s:5:"cdata";i:1;a:1:{i:0;s:1:"
";}i:2;i:4443;}i:323;a:3:{i:0;s:7:"p_close";i:1;a:0:{}i:2;i:4444;}i:324;a:3:{i:0;s:10:"listu_open";i:1;a:0:{}i:2;i:4444;}i:325;a:3:{i:0;s:13:"listitem_open";i:1;a:1:{i:0;i:1;}i:2;i:4444;}i:326;a:3:{i:0;s:16:"listcontent_open";i:1;a:0:{}i:2;i:4444;}i:327;a:3:{i:0;s:5:"cdata";i:1;a:1:{i:0;s:92:" Inscrição até dia 18 por R$ 70.00, após será mais caro. O auxília será de R$ 160.00.";}i:2;i:4448;}i:328;a:3:{i:0;s:17:"listcontent_close";i:1;a:0:{}i:2;i:4540;}i:329;a:3:{i:0;s:14:"listitem_close";i:1;a:0:{}i:2;i:4540;}i:330;a:3:{i:0;s:11:"listu_close";i:1;a:0:{}i:2;i:4540;}i:331;a:3:{i:0;s:6:"p_open";i:1;a:0:{}i:2;i:4540;}i:332;a:3:{i:0;s:5:"cdata";i:1;a:1:{i:0;s:1:"
";}i:2;i:4541;}i:333;a:3:{i:0;s:11:"strong_open";i:1;a:0:{}i:2;i:4542;}i:334;a:3:{i:0;s:5:"cdata";i:1;a:1:{i:0;s:29:"10) Aniversário da Cassiana:";}i:2;i:4544;}i:335;a:3:{i:0;s:12:"strong_close";i:1;a:0:{}i:2;i:4573;}i:336;a:3:{i:0;s:5:"cdata";i:1;a:1:{i:0;s:1:"
";}i:2;i:4575;}i:337;a:3:{i:0;s:7:"p_close";i:1;a:0:{}i:2;i:4576;}i:338;a:3:{i:0;s:10:"listu_open";i:1;a:0:{}i:2;i:4576;}i:339;a:3:{i:0;s:13:"listitem_open";i:1;a:1:{i:0;i:1;}i:2;i:4576;}i:340;a:3:{i:0;s:16:"listcontent_open";i:1;a:0:{}i:2;i:4576;}i:341;a:3:{i:0;s:5:"cdata";i:1;a:1:{i:0;s:44:" O grupo a parabeniza pelo seu aniversário.";}i:2;i:4580;}i:342;a:3:{i:0;s:17:"listcontent_close";i:1;a:0:{}i:2;i:4624;}i:343;a:3:{i:0;s:14:"listitem_close";i:1;a:0:{}i:2;i:4624;}i:344;a:3:{i:0;s:11:"listu_close";i:1;a:0:{}i:2;i:4624;}i:345;a:3:{i:0;s:6:"p_open";i:1;a:0:{}i:2;i:4624;}i:346;a:3:{i:0;s:5:"cdata";i:1;a:1:{i:0;s:1:"
";}i:2;i:4625;}i:347;a:3:{i:0;s:11:"strong_open";i:1;a:0:{}i:2;i:4626;}i:348;a:3:{i:0;s:5:"cdata";i:1;a:1:{i:0;s:26:"11) Contribuição Felipe:";}i:2;i:4628;}i:349;a:3:{i:0;s:12:"strong_close";i:1;a:0:{}i:2;i:4654;}i:350;a:3:{i:0;s:5:"cdata";i:1;a:1:{i:0;s:1:"
";}i:2;i:4656;}i:351;a:3:{i:0;s:7:"p_close";i:1;a:0:{}i:2;i:4657;}i:352;a:3:{i:0;s:10:"listu_open";i:1;a:0:{}i:2;i:4657;}i:353;a:3:{i:0;s:13:"listitem_open";i:1;a:1:{i:0;i:1;}i:2;i:4657;}i:354;a:3:{i:0;s:16:"listcontent_open";i:1;a:0:{}i:2;i:4657;}i:355;a:3:{i:0;s:5:"cdata";i:1;a:1:{i:0;s:76:" Felipe trouxe sua contribuição para a geladeira do PET. O grupo agradece.";}i:2;i:4661;}i:356;a:3:{i:0;s:17:"listcontent_close";i:1;a:0:{}i:2;i:4737;}i:357;a:3:{i:0;s:14:"listitem_close";i:1;a:0:{}i:2;i:4737;}i:358;a:3:{i:0;s:11:"listu_close";i:1;a:0:{}i:2;i:4737;}i:359;a:3:{i:0;s:6:"p_open";i:1;a:0:{}i:2;i:4737;}i:360;a:3:{i:0;s:5:"cdata";i:1;a:1:{i:0;s:1:"
";}i:2;i:4738;}i:361;a:3:{i:0;s:11:"strong_open";i:1;a:0:{}i:2;i:4739;}i:362;a:3:{i:0;s:5:"cdata";i:1;a:1:{i:0;s:54:"12) Discussão de Relatórios (últimas duas semanas):";}i:2;i:4741;}i:363;a:3:{i:0;s:12:"strong_close";i:1;a:0:{}i:2;i:4795;}i:364;a:3:{i:0;s:5:"cdata";i:1;a:1:{i:0;s:1:"
";}i:2;i:4797;}i:365;a:3:{i:0;s:7:"p_close";i:1;a:0:{}i:2;i:4798;}i:366;a:3:{i:0;s:10:"listu_open";i:1;a:0:{}i:2;i:4798;}i:367;a:3:{i:0;s:13:"listitem_open";i:1;a:1:{i:0;i:1;}i:2;i:4798;}i:368;a:3:{i:0;s:16:"listcontent_open";i:1;a:0:{}i:2;i:4798;}i:369;a:3:{i:0;s:5:"cdata";i:1;a:1:{i:0;s:18:" Foram discutidos.";}i:2;i:4802;}i:370;a:3:{i:0;s:17:"listcontent_close";i:1;a:0:{}i:2;i:4820;}i:371;a:3:{i:0;s:14:"listitem_close";i:1;a:0:{}i:2;i:4820;}i:372;a:3:{i:0;s:11:"listu_close";i:1;a:0:{}i:2;i:4820;}i:373;a:3:{i:0;s:12:"document_end";i:1;a:0:{}i:2;i:4820;}}