a:309:{i:0;a:3:{i:0;s:14:"document_start";i:1;a:0:{}i:2;i:0;}i:1;a:3:{i:0;s:6:"p_open";i:1;a:0:{}i:2;i:0;}i:2;a:3:{i:0;s:7:"p_close";i:1;a:0:{}i:2;i:1;}i:3;a:3:{i:0;s:12:"section_edit";i:1;a:4:{i:0;i:-1;i:1;i:0;i:2;i:1;i:3;s:0:"";}i:2;i:1;}i:4;a:3:{i:0;s:6:"header";i:1;a:3:{i:0;s:24:"Ata da reunião de 02/12";i:1;i:1;i:2;i:1;}i:2;i:1;}i:5;a:3:{i:0;s:12:"section_open";i:1;a:1:{i:0;i:1;}i:2;i:1;}i:6;a:3:{i:0;s:10:"listu_open";i:1;a:0:{}i:2;i:40;}i:7;a:3:{i:0;s:13:"listitem_open";i:1;a:1:{i:0;i:1;}i:2;i:40;}i:8;a:3:{i:0;s:16:"listcontent_open";i:1;a:0:{}i:2;i:40;}i:9;a:3:{i:0;s:5:"cdata";i:1;a:1:{i:0;s:153:" Presentes: Bruno A., Fábio, Matheus, Matheus Proença, Lucas Fialho, Tyron, Antônio, Portal, Leonardo, Bruno Jurkovski, Kauê, Bruno Guedes, Cassiana.";}i:2;i:44;}i:10;a:3:{i:0;s:17:"listcontent_close";i:1;a:0:{}i:2;i:197;}i:11;a:3:{i:0;s:14:"listitem_close";i:1;a:0:{}i:2;i:197;}i:12;a:3:{i:0;s:13:"listitem_open";i:1;a:1:{i:0;i:1;}i:2;i:197;}i:13;a:3:{i:0;s:16:"listcontent_open";i:1;a:0:{}i:2;i:197;}i:14;a:3:{i:0;s:5:"cdata";i:1;a:1:{i:0;s:33:" Ausentes: Dante, Marcos, Felipe.";}i:2;i:201;}i:15;a:3:{i:0;s:17:"listcontent_close";i:1;a:0:{}i:2;i:234;}i:16;a:3:{i:0;s:14:"listitem_close";i:1;a:0:{}i:2;i:234;}i:17;a:3:{i:0;s:13:"listitem_open";i:1;a:1:{i:0;i:1;}i:2;i:234;}i:18;a:3:{i:0;s:16:"listcontent_open";i:1;a:0:{}i:2;i:234;}i:19;a:3:{i:0;s:5:"cdata";i:1;a:1:{i:0;s:20:" Relatora: Cassiana.";}i:2;i:238;}i:20;a:3:{i:0;s:17:"listcontent_close";i:1;a:0:{}i:2;i:258;}i:21;a:3:{i:0;s:14:"listitem_close";i:1;a:0:{}i:2;i:258;}i:22;a:3:{i:0;s:11:"listu_close";i:1;a:0:{}i:2;i:258;}i:23;a:3:{i:0;s:13:"section_close";i:1;a:0:{}i:2;i:260;}i:24;a:3:{i:0;s:12:"section_edit";i:1;a:4:{i:0;i:1;i:1;i:259;i:2;i:1;i:3;s:24:"Ata da reunião de 02/12";}i:2;i:260;}i:25;a:3:{i:0;s:6:"header";i:1;a:3:{i:0;s:67:"1) Semana de férias da Cassiana e do Tyron (não avisaram) (Bruno)";i:1;i:2;i:2;i:260;}i:2;i:260;}i:26;a:3:{i:0;s:12:"section_open";i:1;a:1:{i:0;i:2;}i:2;i:260;}i:27;a:3:{i:0;s:10:"listu_open";i:1;a:0:{}i:2;i:340;}i:28;a:3:{i:0;s:13:"listitem_open";i:1;a:1:{i:0;i:1;}i:2;i:340;}i:29;a:3:{i:0;s:16:"listcontent_open";i:1;a:0:{}i:2;i:340;}i:30;a:3:{i:0;s:5:"cdata";i:1;a:1:{i:0;s:82:" Cassiana e Tyron disseram que tinham avisado na semana passada. Alguns membros do";}i:2;i:344;}i:31;a:3:{i:0;s:17:"listcontent_close";i:1;a:0:{}i:2;i:426;}i:32;a:3:{i:0;s:14:"listitem_close";i:1;a:0:{}i:2;i:426;}i:33;a:3:{i:0;s:11:"listu_close";i:1;a:0:{}i:2;i:426;}i:34;a:3:{i:0;s:6:"p_open";i:1;a:0:{}i:2;i:426;}i:35;a:3:{i:0;s:5:"cdata";i:1;a:1:{i:0;s:16:"
grupo lembram.
";}i:2;i:427;}i:36;a:3:{i:0;s:7:"p_close";i:1;a:0:{}i:2;i:443;}i:37;a:3:{i:0;s:10:"listu_open";i:1;a:0:{}i:2;i:443;}i:38;a:3:{i:0;s:13:"listitem_open";i:1;a:1:{i:0;i:1;}i:2;i:443;}i:39;a:3:{i:0;s:16:"listcontent_open";i:1;a:0:{}i:2;i:443;}i:40;a:3:{i:0;s:5:"cdata";i:1;a:1:{i:0;s:74:" A confusã ocorreu pois não estava na ata as férias de nenhum dos dois.";}i:2;i:447;}i:41;a:3:{i:0;s:17:"listcontent_close";i:1;a:0:{}i:2;i:521;}i:42;a:3:{i:0;s:14:"listitem_close";i:1;a:0:{}i:2;i:521;}i:43;a:3:{i:0;s:13:"listitem_open";i:1;a:1:{i:0;i:1;}i:2;i:521;}i:44;a:3:{i:0;s:16:"listcontent_open";i:1;a:0:{}i:2;i:521;}i:45;a:3:{i:0;s:5:"cdata";i:1;a:1:{i:0;s:75:" Iniciou-se uma discussão sobre a necessidade de ler a ata sempre. O grupo";}i:2;i:525;}i:46;a:3:{i:0;s:17:"listcontent_close";i:1;a:0:{}i:2;i:600;}i:47;a:3:{i:0;s:14:"listitem_close";i:1;a:0:{}i:2;i:600;}i:48;a:3:{i:0;s:11:"listu_close";i:1;a:0:{}i:2;i:600;}i:49;a:3:{i:0;s:6:"p_open";i:1;a:0:{}i:2;i:600;}i:50;a:3:{i:0;s:5:"cdata";i:1;a:1:{i:0;s:89:"
decidiu que ninguém é OBRIGADO a ler a ata; cada um deve ler quando achar necessário.";}i:2;i:601;}i:51;a:3:{i:0;s:7:"p_close";i:1;a:0:{}i:2;i:690;}i:52;a:3:{i:0;s:13:"section_close";i:1;a:0:{}i:2;i:692;}i:53;a:3:{i:0;s:12:"section_edit";i:1;a:4:{i:0;i:260;i:1;i:691;i:2;i:2;i:3;s:67:"1) Semana de férias da Cassiana e do Tyron (não avisaram) (Bruno)";}i:2;i:692;}i:54;a:3:{i:0;s:6:"header";i:1;a:3:{i:0;s:61:"2) Caixas organizadoras para o NXT / LRI compradas (Cassiana)";i:1;i:2;i:2;i:692;}i:2;i:692;}i:55;a:3:{i:0;s:12:"section_open";i:1;a:1:{i:0;i:2;}i:2;i:692;}i:56;a:3:{i:0;s:10:"listu_open";i:1;a:0:{}i:2;i:766;}i:57;a:3:{i:0;s:13:"listitem_open";i:1;a:1:{i:0;i:1;}i:2;i:766;}i:58;a:3:{i:0;s:16:"listcontent_open";i:1;a:0:{}i:2;i:766;}i:59;a:3:{i:0;s:5:"cdata";i:1;a:1:{i:0;s:102:" Cassiana comprou duas caixas organizadoras pra o NXT. Cada uma custou 5,99. O caixa do PET vai pagar.";}i:2;i:770;}i:60;a:3:{i:0;s:17:"listcontent_close";i:1;a:0:{}i:2;i:872;}i:61;a:3:{i:0;s:14:"listitem_close";i:1;a:0:{}i:2;i:872;}i:62;a:3:{i:0;s:11:"listu_close";i:1;a:0:{}i:2;i:872;}i:63;a:3:{i:0;s:13:"section_close";i:1;a:0:{}i:2;i:874;}i:64;a:3:{i:0;s:12:"section_edit";i:1;a:4:{i:0;i:692;i:1;i:873;i:2;i:2;i:3;s:61:"2) Caixas organizadoras para o NXT / LRI compradas (Cassiana)";}i:2;i:874;}i:65;a:3:{i:0;s:6:"header";i:1;a:3:{i:0;s:49:"3) Mudança das datas de nossas reuniões (Kauê)";i:1;i:2;i:2;i:874;}i:2;i:874;}i:66;a:3:{i:0;s:12:"section_open";i:1;a:1:{i:0;i:2;}i:2;i:874;}i:67;a:3:{i:0;s:10:"listu_open";i:1;a:0:{}i:2;i:936;}i:68;a:3:{i:0;s:13:"listitem_open";i:1;a:1:{i:0;i:1;}i:2;i:936;}i:69;a:3:{i:0;s:16:"listcontent_open";i:1;a:0:{}i:2;i:936;}i:70;a:3:{i:0;s:5:"cdata";i:1;a:1:{i:0;s:144:" Como estamos de férias, o grupo achou melhor trocarmos as datas e horários das próximas reuniões. Os horários definidos foram os seguintes";}i:2;i:940;}i:71;a:3:{i:0;s:17:"listcontent_close";i:1;a:0:{}i:2;i:1084;}i:72;a:3:{i:0;s:10:"listu_open";i:1;a:0:{}i:2;i:1084;}i:73;a:3:{i:0;s:13:"listitem_open";i:1;a:1:{i:0;i:2;}i:2;i:1084;}i:74;a:3:{i:0;s:16:"listcontent_open";i:1;a:0:{}i:2;i:1084;}i:75;a:3:{i:0;s:5:"cdata";i:1;a:1:{i:0;s:21:" 9 de dezembro (ter) ";}i:2;i:1090;}i:76;a:3:{i:0;s:6:"entity";i:1;a:1:{i:0;s:2:"--";}i:2;i:1111;}i:77;a:3:{i:0;s:5:"cdata";i:1;a:1:{i:0;s:10:"&gt; 14:00";}i:2;i:1113;}i:78;a:3:{i:0;s:17:"listcontent_close";i:1;a:0:{}i:2;i:1123;}i:79;a:3:{i:0;s:14:"listitem_close";i:1;a:0:{}i:2;i:1123;}i:80;a:3:{i:0;s:13:"listitem_open";i:1;a:1:{i:0;i:2;}i:2;i:1123;}i:81;a:3:{i:0;s:16:"listcontent_open";i:1;a:0:{}i:2;i:1123;}i:82;a:3:{i:0;s:5:"cdata";i:1;a:1:{i:0;s:22:" 15 de dezembro (seg) ";}i:2;i:1129;}i:83;a:3:{i:0;s:6:"entity";i:1;a:1:{i:0;s:2:"--";}i:2;i:1151;}i:84;a:3:{i:0;s:5:"cdata";i:1;a:1:{i:0;s:10:"&gt; 14:00";}i:2;i:1153;}i:85;a:3:{i:0;s:17:"listcontent_close";i:1;a:0:{}i:2;i:1163;}i:86;a:3:{i:0;s:14:"listitem_close";i:1;a:0:{}i:2;i:1163;}i:87;a:3:{i:0;s:13:"listitem_open";i:1;a:1:{i:0;i:2;}i:2;i:1163;}i:88;a:3:{i:0;s:16:"listcontent_open";i:1;a:0:{}i:2;i:1163;}i:89;a:3:{i:0;s:5:"cdata";i:1;a:1:{i:0;s:20:" 9 de janeiro (sex) ";}i:2;i:1169;}i:90;a:3:{i:0;s:6:"entity";i:1;a:1:{i:0;s:2:"--";}i:2;i:1189;}i:91;a:3:{i:0;s:5:"cdata";i:1;a:1:{i:0;s:10:"&gt; 14:00";}i:2;i:1191;}i:92;a:3:{i:0;s:17:"listcontent_close";i:1;a:0:{}i:2;i:1201;}i:93;a:3:{i:0;s:14:"listitem_close";i:1;a:0:{}i:2;i:1201;}i:94;a:3:{i:0;s:13:"listitem_open";i:1;a:1:{i:0;i:2;}i:2;i:1201;}i:95;a:3:{i:0;s:16:"listcontent_open";i:1;a:0:{}i:2;i:1201;}i:96;a:3:{i:0;s:5:"cdata";i:1;a:1:{i:0;s:26:" 16 de janeiro (sex) 14:00";}i:2;i:1207;}i:97;a:3:{i:0;s:17:"listcontent_close";i:1;a:0:{}i:2;i:1233;}i:98;a:3:{i:0;s:14:"listitem_close";i:1;a:0:{}i:2;i:1233;}i:99;a:3:{i:0;s:13:"listitem_open";i:1;a:1:{i:0;i:2;}i:2;i:1233;}i:100;a:3:{i:0;s:16:"listcontent_open";i:1;a:0:{}i:2;i:1233;}i:101;a:3:{i:0;s:5:"cdata";i:1;a:1:{i:0;s:26:" 26 de janeiro (seg) 14:00";}i:2;i:1239;}i:102;a:3:{i:0;s:17:"listcontent_close";i:1;a:0:{}i:2;i:1265;}i:103;a:3:{i:0;s:14:"listitem_close";i:1;a:0:{}i:2;i:1265;}i:104;a:3:{i:0;s:11:"listu_close";i:1;a:0:{}i:2;i:1265;}i:105;a:3:{i:0;s:14:"listitem_close";i:1;a:0:{}i:2;i:1265;}i:106;a:3:{i:0;s:11:"listu_close";i:1;a:0:{}i:2;i:1265;}i:107;a:3:{i:0;s:10:"listu_open";i:1;a:0:{}i:2;i:1266;}i:108;a:3:{i:0;s:13:"listitem_open";i:1;a:1:{i:0;i:1;}i:2;i:1266;}i:109;a:3:{i:0;s:16:"listcontent_open";i:1;a:0:{}i:2;i:1266;}i:110;a:3:{i:0;s:5:"cdata";i:1;a:1:{i:0;s:143:" Na semana da Campus Party (19/01 a 24/01) o pessoal que ficar no PET deverá marcar uma reunião. Data e horário a critério dos que ficarem.";}i:2;i:1270;}i:111;a:3:{i:0;s:17:"listcontent_close";i:1;a:0:{}i:2;i:1413;}i:112;a:3:{i:0;s:14:"listitem_close";i:1;a:0:{}i:2;i:1413;}i:113;a:3:{i:0;s:13:"listitem_open";i:1;a:1:{i:0;i:1;}i:2;i:1413;}i:114;a:3:{i:0;s:16:"listcontent_open";i:1;a:0:{}i:2;i:1413;}i:115;a:3:{i:0;s:5:"cdata";i:1;a:1:{i:0;s:149:" Na reunião de 26 de janeiro, todos que forem a Campus Party deverão apresentar um relatório das atividades, valendo 12 horas na semana do evento.";}i:2;i:1417;}i:116;a:3:{i:0;s:17:"listcontent_close";i:1;a:0:{}i:2;i:1566;}i:117;a:3:{i:0;s:14:"listitem_close";i:1;a:0:{}i:2;i:1566;}i:118;a:3:{i:0;s:13:"listitem_open";i:1;a:1:{i:0;i:1;}i:2;i:1566;}i:119;a:3:{i:0;s:16:"listcontent_open";i:1;a:0:{}i:2;i:1566;}i:120;a:3:{i:0;s:5:"cdata";i:1;a:1:{i:0;s:95:" O horário das reuniões do rpóximo semestre será decidido na reunião do dia 26 de janeiro.";}i:2;i:1570;}i:121;a:3:{i:0;s:17:"listcontent_close";i:1;a:0:{}i:2;i:1665;}i:122;a:3:{i:0;s:14:"listitem_close";i:1;a:0:{}i:2;i:1665;}i:123;a:3:{i:0;s:11:"listu_close";i:1;a:0:{}i:2;i:1665;}i:124;a:3:{i:0;s:13:"section_close";i:1;a:0:{}i:2;i:1667;}i:125;a:3:{i:0;s:12:"section_edit";i:1;a:4:{i:0;i:874;i:1;i:1666;i:2;i:2;i:3;s:49:"3) Mudança das datas de nossas reuniões (Kauê)";}i:2;i:1667;}i:126;a:3:{i:0;s:6:"header";i:1;a:3:{i:0;s:47:"4) Trabalho de pesquisa com o Manuel (Leonardo)";i:1;i:2;i:2;i:1667;}i:2;i:1667;}i:127;a:3:{i:0;s:12:"section_open";i:1;a:1:{i:0;i:2;}i:2;i:1667;}i:128;a:3:{i:0;s:10:"listu_open";i:1;a:0:{}i:2;i:1727;}i:129;a:3:{i:0;s:13:"listitem_open";i:1;a:1:{i:0;i:1;}i:2;i:1727;}i:130;a:3:{i:0;s:16:"listcontent_open";i:1;a:0:{}i:2;i:1727;}i:131;a:3:{i:0;s:5:"cdata";i:1;a:1:{i:0;s:80:" Leonardo contou que o profesor Manuel o convidou para participar de um projeto.";}i:2;i:1731;}i:132;a:3:{i:0;s:17:"listcontent_close";i:1;a:0:{}i:2;i:1811;}i:133;a:3:{i:0;s:14:"listitem_close";i:1;a:0:{}i:2;i:1811;}i:134;a:3:{i:0;s:13:"listitem_open";i:1;a:1:{i:0;i:1;}i:2;i:1811;}i:135;a:3:{i:0;s:16:"listcontent_open";i:1;a:0:{}i:2;i:1811;}i:136;a:3:{i:0;s:5:"cdata";i:1;a:1:{i:0;s:75:" Ele gostaria de participar desse projeto, mas não vai se desligar do PET.";}i:2;i:1815;}i:137;a:3:{i:0;s:17:"listcontent_close";i:1;a:0:{}i:2;i:1890;}i:138;a:3:{i:0;s:14:"listitem_close";i:1;a:0:{}i:2;i:1890;}i:139;a:3:{i:0;s:13:"listitem_open";i:1;a:1:{i:0;i:1;}i:2;i:1890;}i:140;a:3:{i:0;s:16:"listcontent_open";i:1;a:0:{}i:2;i:1890;}i:141;a:3:{i:0;s:5:"cdata";i:1;a:1:{i:0;s:18:" O grupo concorda.";}i:2;i:1894;}i:142;a:3:{i:0;s:17:"listcontent_close";i:1;a:0:{}i:2;i:1912;}i:143;a:3:{i:0;s:14:"listitem_close";i:1;a:0:{}i:2;i:1912;}i:144;a:3:{i:0;s:11:"listu_close";i:1;a:0:{}i:2;i:1912;}i:145;a:3:{i:0;s:13:"section_close";i:1;a:0:{}i:2;i:1914;}i:146;a:3:{i:0;s:12:"section_edit";i:1;a:4:{i:0;i:1667;i:1;i:1913;i:2;i:2;i:3;s:47:"4) Trabalho de pesquisa com o Manuel (Leonardo)";}i:2;i:1914;}i:147;a:3:{i:0;s:6:"header";i:1;a:3:{i:0;s:36:"5) Compra de periféricos (Leonardo)";i:1;i:2;i:2;i:1914;}i:2;i:1914;}i:148;a:3:{i:0;s:12:"section_open";i:1;a:1:{i:0;i:2;}i:2;i:1914;}i:149;a:3:{i:0;s:10:"listu_open";i:1;a:0:{}i:2;i:1963;}i:150;a:3:{i:0;s:13:"listitem_open";i:1;a:1:{i:0;i:1;}i:2;i:1963;}i:151;a:3:{i:0;s:16:"listcontent_open";i:1;a:0:{}i:2;i:1963;}i:152;a:3:{i:0;s:5:"cdata";i:1;a:1:{i:0;s:82:" Leonardo observou que tem muitos periféricos sobrando no PET. Ele sugeriu trazer";}i:2;i:1967;}i:153;a:3:{i:0;s:17:"listcontent_close";i:1;a:0:{}i:2;i:2049;}i:154;a:3:{i:0;s:14:"listitem_close";i:1;a:0:{}i:2;i:2049;}i:155;a:3:{i:0;s:11:"listu_close";i:1;a:0:{}i:2;i:2049;}i:156;a:3:{i:0;s:6:"p_open";i:1;a:0:{}i:2;i:2049;}i:157;a:3:{i:0;s:5:"cdata";i:1;a:1:{i:0;s:62:"
um lanche para o grupo em troca de um mouse e de um teclado.
";}i:2;i:2050;}i:158;a:3:{i:0;s:7:"p_close";i:1;a:0:{}i:2;i:2112;}i:159;a:3:{i:0;s:10:"listu_open";i:1;a:0:{}i:2;i:2112;}i:160;a:3:{i:0;s:13:"listitem_open";i:1;a:1:{i:0;i:1;}i:2;i:2112;}i:161;a:3:{i:0;s:16:"listcontent_open";i:1;a:0:{}i:2;i:2112;}i:162;a:3:{i:0;s:5:"cdata";i:1;a:1:{i:0;s:16:" O grupo aceita.";}i:2;i:2116;}i:163;a:3:{i:0;s:17:"listcontent_close";i:1;a:0:{}i:2;i:2132;}i:164;a:3:{i:0;s:14:"listitem_close";i:1;a:0:{}i:2;i:2132;}i:165;a:3:{i:0;s:11:"listu_close";i:1;a:0:{}i:2;i:2132;}i:166;a:3:{i:0;s:13:"section_close";i:1;a:0:{}i:2;i:2134;}i:167;a:3:{i:0;s:12:"section_edit";i:1;a:4:{i:0;i:1914;i:1;i:2133;i:2;i:2;i:3;s:36:"5) Compra de periféricos (Leonardo)";}i:2;i:2134;}i:168;a:3:{i:0;s:6:"header";i:1;a:3:{i:0;s:35:"6) Horas Semanais e Mensais (bruno)";i:1;i:2;i:2;i:2134;}i:2;i:2134;}i:169;a:3:{i:0;s:12:"section_open";i:1;a:1:{i:0;i:2;}i:2;i:2134;}i:170;a:3:{i:0;s:10:"listu_open";i:1;a:0:{}i:2;i:2182;}i:171;a:3:{i:0;s:13:"listitem_open";i:1;a:1:{i:0;i:1;}i:2;i:2182;}i:172;a:3:{i:0;s:16:"listcontent_open";i:1;a:0:{}i:2;i:2182;}i:173;a:3:{i:0;s:5:"cdata";i:1;a:1:{i:0;s:7:" Portal";}i:2;i:2186;}i:174;a:3:{i:0;s:17:"listcontent_close";i:1;a:0:{}i:2;i:2193;}i:175;a:3:{i:0;s:10:"listu_open";i:1;a:0:{}i:2;i:2193;}i:176;a:3:{i:0;s:13:"listitem_open";i:1;a:1:{i:0;i:2;}i:2;i:2193;}i:177;a:3:{i:0;s:16:"listcontent_open";i:1;a:0:{}i:2;i:2193;}i:178;a:3:{i:0;s:5:"cdata";i:1;a:1:{i:0;s:80:" Portal se confundiu e acabou não fazendo todas as horas do mês. Ele estava de";}i:2;i:2199;}i:179;a:3:{i:0;s:17:"listcontent_close";i:1;a:0:{}i:2;i:2279;}i:180;a:3:{i:0;s:14:"listitem_close";i:1;a:0:{}i:2;i:2279;}i:181;a:3:{i:0;s:11:"listu_close";i:1;a:0:{}i:2;i:2279;}i:182;a:3:{i:0;s:14:"listitem_close";i:1;a:0:{}i:2;i:2279;}i:183;a:3:{i:0;s:11:"listu_close";i:1;a:0:{}i:2;i:2279;}i:184;a:3:{i:0;s:6:"p_open";i:1;a:0:{}i:2;i:2279;}i:185;a:3:{i:0;s:5:"cdata";i:1;a:1:{i:0;s:36:"
férias, mas não fechou 36 horas.
";}i:2;i:2280;}i:186;a:3:{i:0;s:7:"p_close";i:1;a:0:{}i:2;i:2316;}i:187;a:3:{i:0;s:10:"listu_open";i:1;a:0:{}i:2;i:2316;}i:188;a:3:{i:0;s:13:"listitem_open";i:1;a:1:{i:0;i:1;}i:2;i:2316;}i:189;a:3:{i:0;s:16:"listcontent_open";i:1;a:0:{}i:2;i:2316;}i:190;a:3:{i:0;s:5:"cdata";i:1;a:1:{i:0;s:35:" O grupo decide por ponto de falta.";}i:2;i:2320;}i:191;a:3:{i:0;s:17:"listcontent_close";i:1;a:0:{}i:2;i:2355;}i:192;a:3:{i:0;s:14:"listitem_close";i:1;a:0:{}i:2;i:2355;}i:193;a:3:{i:0;s:11:"listu_close";i:1;a:0:{}i:2;i:2355;}i:194;a:3:{i:0;s:13:"section_close";i:1;a:0:{}i:2;i:2357;}i:195;a:3:{i:0;s:12:"section_edit";i:1;a:4:{i:0;i:2134;i:1;i:2356;i:2;i:2;i:3;s:35:"6) Horas Semanais e Mensais (bruno)";}i:2;i:2357;}i:196;a:3:{i:0;s:6:"header";i:1;a:3:{i:0;s:53:"7) Planejamento Anual 2009 até o fim do ano! (bruno)";i:1;i:2;i:2;i:2357;}i:2;i:2357;}i:197;a:3:{i:0;s:12:"section_open";i:1;a:1:{i:0;i:2;}i:2;i:2357;}i:198;a:3:{i:0;s:10:"listu_open";i:1;a:0:{}i:2;i:2423;}i:199;a:3:{i:0;s:13:"listitem_open";i:1;a:1:{i:0;i:1;}i:2;i:2423;}i:200;a:3:{i:0;s:16:"listcontent_open";i:1;a:0:{}i:2;i:2423;}i:201;a:3:{i:0;s:5:"cdata";i:1;a:1:{i:0;s:71:" O planejamento anual de 2009 deverá ser entregue até 31 de dezembro.";}i:2;i:2427;}i:202;a:3:{i:0;s:17:"listcontent_close";i:1;a:0:{}i:2;i:2498;}i:203;a:3:{i:0;s:14:"listitem_close";i:1;a:0:{}i:2;i:2498;}i:204;a:3:{i:0;s:13:"listitem_open";i:1;a:1:{i:0;i:1;}i:2;i:2498;}i:205;a:3:{i:0;s:16:"listcontent_open";i:1;a:0:{}i:2;i:2498;}i:206;a:3:{i:0;s:5:"cdata";i:1;a:1:{i:0;s:104:" Como a Cassiana, o Tyron e o Bruno alteraram suas férias, eles serão os responsáveis por organizar o";}i:2;i:2502;}i:207;a:3:{i:0;s:17:"listcontent_close";i:1;a:0:{}i:2;i:2606;}i:208;a:3:{i:0;s:14:"listitem_close";i:1;a:0:{}i:2;i:2606;}i:209;a:3:{i:0;s:11:"listu_close";i:1;a:0:{}i:2;i:2606;}i:210;a:3:{i:0;s:6:"p_open";i:1;a:0:{}i:2;i:2606;}i:211;a:3:{i:0;s:5:"cdata";i:1;a:1:{i:0;s:15:"
planejamento.
";}i:2;i:2607;}i:212;a:3:{i:0;s:7:"p_close";i:1;a:0:{}i:2;i:2622;}i:213;a:3:{i:0;s:10:"listu_open";i:1;a:0:{}i:2;i:2622;}i:214;a:3:{i:0;s:13:"listitem_open";i:1;a:1:{i:0;i:1;}i:2;i:2622;}i:215;a:3:{i:0;s:16:"listcontent_open";i:1;a:0:{}i:2;i:2622;}i:216;a:3:{i:0;s:5:"cdata";i:1;a:1:{i:0;s:122:" Até a próxima semana, cada grupo deverá enviar um email para a lista com o resumo das atividades planejadas para 2009.";}i:2;i:2626;}i:217;a:3:{i:0;s:17:"listcontent_close";i:1;a:0:{}i:2;i:2748;}i:218;a:3:{i:0;s:14:"listitem_close";i:1;a:0:{}i:2;i:2748;}i:219;a:3:{i:0;s:11:"listu_close";i:1;a:0:{}i:2;i:2748;}i:220;a:3:{i:0;s:10:"listu_open";i:1;a:0:{}i:2;i:2749;}i:221;a:3:{i:0;s:13:"listitem_open";i:1;a:1:{i:0;i:1;}i:2;i:2749;}i:222;a:3:{i:0;s:16:"listcontent_open";i:1;a:0:{}i:2;i:2749;}i:223;a:3:{i:0;s:5:"cdata";i:1;a:1:{i:0;s:89:" Para constar na ata: Cassiana e Tyron vão tirar apenas uma semana de férias no verão,";}i:2;i:2753;}i:224;a:3:{i:0;s:17:"listcontent_close";i:1;a:0:{}i:2;i:2842;}i:225;a:3:{i:0;s:14:"listitem_close";i:1;a:0:{}i:2;i:2842;}i:226;a:3:{i:0;s:11:"listu_close";i:1;a:0:{}i:2;i:2842;}i:227;a:3:{i:0;s:6:"p_open";i:1;a:0:{}i:2;i:2842;}i:228;a:3:{i:0;s:5:"cdata";i:1;a:1:{i:0;s:143:"
uma no final do segundo semestre e um mês em julho, pois pretendem viajar. Bruno vai tirar férias no mês de janeiro oa invés de fevereiro.";}i:2;i:2843;}i:229;a:3:{i:0;s:7:"p_close";i:1;a:0:{}i:2;i:2986;}i:230;a:3:{i:0;s:13:"section_close";i:1;a:0:{}i:2;i:2988;}i:231;a:3:{i:0;s:12:"section_edit";i:1;a:4:{i:0;i:2357;i:1;i:2987;i:2;i:2;i:3;s:53:"7) Planejamento Anual 2009 até o fim do ano! (bruno)";}i:2;i:2988;}i:232;a:3:{i:0;s:6:"header";i:1;a:3:{i:0;s:15:"8) Campus Party";i:1;i:2;i:2;i:2988;}i:2;i:2988;}i:233;a:3:{i:0;s:12:"section_open";i:1;a:1:{i:0;i:2;}i:2;i:2988;}i:234;a:3:{i:0;s:10:"listu_open";i:1;a:0:{}i:2;i:3016;}i:235;a:3:{i:0;s:13:"listitem_open";i:1;a:1:{i:0;i:1;}i:2;i:3016;}i:236;a:3:{i:0;s:16:"listcontent_open";i:1;a:0:{}i:2;i:3016;}i:237;a:3:{i:0;s:5:"cdata";i:1;a:1:{i:0;s:18:" Passagens (Tyron)";}i:2;i:3020;}i:238;a:3:{i:0;s:17:"listcontent_close";i:1;a:0:{}i:2;i:3038;}i:239;a:3:{i:0;s:10:"listu_open";i:1;a:0:{}i:2;i:3038;}i:240;a:3:{i:0;s:13:"listitem_open";i:1;a:1:{i:0;i:2;}i:2;i:3038;}i:241;a:3:{i:0;s:16:"listcontent_open";i:1;a:0:{}i:2;i:3038;}i:242;a:3:{i:0;s:5:"cdata";i:1;a:1:{i:0;s:75:" Cassiana e Tyron ganharam ingressos para um show dois dias antes da viagem";}i:2;i:3044;}i:243;a:3:{i:0;s:17:"listcontent_close";i:1;a:0:{}i:2;i:3119;}i:244;a:3:{i:0;s:14:"listitem_close";i:1;a:0:{}i:2;i:3119;}i:245;a:3:{i:0;s:11:"listu_close";i:1;a:0:{}i:2;i:3119;}i:246;a:3:{i:0;s:14:"listitem_close";i:1;a:0:{}i:2;i:3119;}i:247;a:3:{i:0;s:11:"listu_close";i:1;a:0:{}i:2;i:3119;}i:248;a:3:{i:0;s:6:"p_open";i:1;a:0:{}i:2;i:3119;}i:249;a:3:{i:0;s:5:"cdata";i:1;a:1:{i:0;s:103:"
para a campus party. Eles pediram autorização do grupo para transferir a passagem. O grupo aceitou.
";}i:2;i:3120;}i:250;a:3:{i:0;s:7:"p_close";i:1;a:0:{}i:2;i:3223;}i:251;a:3:{i:0;s:10:"listu_open";i:1;a:0:{}i:2;i:3223;}i:252;a:3:{i:0;s:13:"listitem_open";i:1;a:1:{i:0;i:1;}i:2;i:3223;}i:253;a:3:{i:0;s:16:"listcontent_open";i:1;a:0:{}i:2;i:3223;}i:254;a:3:{i:0;s:5:"cdata";i:1;a:1:{i:0;s:22:" Transporte (Cassiana)";}i:2;i:3227;}i:255;a:3:{i:0;s:17:"listcontent_close";i:1;a:0:{}i:2;i:3249;}i:256;a:3:{i:0;s:10:"listu_open";i:1;a:0:{}i:2;i:3249;}i:257;a:3:{i:0;s:13:"listitem_open";i:1;a:1:{i:0;i:2;}i:2;i:3249;}i:258;a:3:{i:0;s:16:"listcontent_open";i:1;a:0:{}i:2;i:3249;}i:259;a:3:{i:0;s:5:"cdata";i:1;a:1:{i:0;s:84:" Cassiana vai contratar uma van para buscar os petianos na campus party e levar para";}i:2;i:3255;}i:260;a:3:{i:0;s:17:"listcontent_close";i:1;a:0:{}i:2;i:3339;}i:261;a:3:{i:0;s:14:"listitem_close";i:1;a:0:{}i:2;i:3339;}i:262;a:3:{i:0;s:11:"listu_close";i:1;a:0:{}i:2;i:3339;}i:263;a:3:{i:0;s:14:"listitem_close";i:1;a:0:{}i:2;i:3339;}i:264;a:3:{i:0;s:11:"listu_close";i:1;a:0:{}i:2;i:3339;}i:265;a:3:{i:0;s:6:"p_open";i:1;a:0:{}i:2;i:3339;}i:266;a:3:{i:0;s:5:"cdata";i:1;a:1:{i:0;s:36:"
Guarulhos, no fim da campus party.
";}i:2;i:3340;}i:267;a:3:{i:0;s:7:"p_close";i:1;a:0:{}i:2;i:3376;}i:268;a:3:{i:0;s:10:"listu_open";i:1;a:0:{}i:2;i:3376;}i:269;a:3:{i:0;s:13:"listitem_open";i:1;a:1:{i:0;i:1;}i:2;i:3376;}i:270;a:3:{i:0;s:16:"listcontent_open";i:1;a:0:{}i:2;i:3376;}i:271;a:3:{i:0;s:5:"cdata";i:1;a:1:{i:0;s:47:" O valor das vans varias entre 170,00 e 220,00.";}i:2;i:3380;}i:272;a:3:{i:0;s:17:"listcontent_close";i:1;a:0:{}i:2;i:3427;}i:273;a:3:{i:0;s:14:"listitem_close";i:1;a:0:{}i:2;i:3427;}i:274;a:3:{i:0;s:13:"listitem_open";i:1;a:1:{i:0;i:1;}i:2;i:3427;}i:275;a:3:{i:0;s:16:"listcontent_open";i:1;a:0:{}i:2;i:3427;}i:276;a:3:{i:0;s:5:"cdata";i:1;a:1:{i:0;s:83:" A van contratada deverá fornecer recibo, pois o grupo vai tentar pedir reembolso.";}i:2;i:3431;}i:277;a:3:{i:0;s:17:"listcontent_close";i:1;a:0:{}i:2;i:3514;}i:278;a:3:{i:0;s:14:"listitem_close";i:1;a:0:{}i:2;i:3514;}i:279;a:3:{i:0;s:13:"listitem_open";i:1;a:1:{i:0;i:1;}i:2;i:3514;}i:280;a:3:{i:0;s:16:"listcontent_open";i:1;a:0:{}i:2;i:3514;}i:281;a:3:{i:0;s:5:"cdata";i:1;a:1:{i:0;s:95:" Na ida, o grupo deve pegar o translado gratuito de Guarulhos para Congonhas e depois um táxi.";}i:2;i:3518;}i:282;a:3:{i:0;s:17:"listcontent_close";i:1;a:0:{}i:2;i:3613;}i:283;a:3:{i:0;s:14:"listitem_close";i:1;a:0:{}i:2;i:3613;}i:284;a:3:{i:0;s:11:"listu_close";i:1;a:0:{}i:2;i:3613;}i:285;a:3:{i:0;s:13:"section_close";i:1;a:0:{}i:2;i:3615;}i:286;a:3:{i:0;s:12:"section_edit";i:1;a:4:{i:0;i:2988;i:1;i:3614;i:2;i:2;i:3;s:15:"8) Campus Party";}i:2;i:3615;}i:287;a:3:{i:0;s:6:"header";i:1;a:3:{i:0;s:25:"9) PET Churras (Proença)";i:1;i:2;i:2;i:3615;}i:2;i:3615;}i:288;a:3:{i:0;s:12:"section_open";i:1;a:1:{i:0;i:2;}i:2;i:3615;}i:289;a:3:{i:0;s:10:"listu_open";i:1;a:0:{}i:2;i:3653;}i:290;a:3:{i:0;s:13:"listitem_open";i:1;a:1:{i:0;i:1;}i:2;i:3653;}i:291;a:3:{i:0;s:16:"listcontent_open";i:1;a:0:{}i:2;i:3653;}i:292;a:3:{i:0;s:5:"cdata";i:1;a:1:{i:0;s:55:" Será dia 15/12 à noite. Sairemos depois da reunião.";}i:2;i:3657;}i:293;a:3:{i:0;s:17:"listcontent_close";i:1;a:0:{}i:2;i:3712;}i:294;a:3:{i:0;s:14:"listitem_close";i:1;a:0:{}i:2;i:3712;}i:295;a:3:{i:0;s:13:"listitem_open";i:1;a:1:{i:0;i:1;}i:2;i:3712;}i:296;a:3:{i:0;s:16:"listcontent_open";i:1;a:0:{}i:2;i:3712;}i:297;a:3:{i:0;s:5:"cdata";i:1;a:1:{i:0;s:88:" O PET Churras inclui o churrasco da noite, bebidas e o café da manhã do dia seguinte.";}i:2;i:3716;}i:298;a:3:{i:0;s:17:"listcontent_close";i:1;a:0:{}i:2;i:3804;}i:299;a:3:{i:0;s:14:"listitem_close";i:1;a:0:{}i:2;i:3804;}i:300;a:3:{i:0;s:13:"listitem_open";i:1;a:1:{i:0;i:1;}i:2;i:3804;}i:301;a:3:{i:0;s:16:"listcontent_open";i:1;a:0:{}i:2;i:3804;}i:302;a:3:{i:0;s:5:"cdata";i:1;a:1:{i:0;s:54:" Demais decisões serão tomadas na próxima reunião.";}i:2;i:3808;}i:303;a:3:{i:0;s:17:"listcontent_close";i:1;a:0:{}i:2;i:3862;}i:304;a:3:{i:0;s:14:"listitem_close";i:1;a:0:{}i:2;i:3862;}i:305;a:3:{i:0;s:11:"listu_close";i:1;a:0:{}i:2;i:3862;}i:306;a:3:{i:0;s:13:"section_close";i:1;a:0:{}i:2;i:3863;}i:307;a:3:{i:0;s:12:"section_edit";i:1;a:4:{i:0;i:3615;i:1;i:0;i:2;i:2;i:3;s:25:"9) PET Churras (Proença)";}i:2;i:3863;}i:308;a:3:{i:0;s:12:"document_end";i:1;a:0:{}i:2;i:3863;}}