a:75:{i:0;a:3:{i:0;s:14:"document_start";i:1;a:0:{}i:2;i:0;}i:1;a:3:{i:0;s:6:"p_open";i:1;a:0:{}i:2;i:0;}i:2;a:3:{i:0;s:7:"p_close";i:1;a:0:{}i:2;i:1;}i:3;a:3:{i:0;s:12:"section_edit";i:1;a:4:{i:0;i:-1;i:1;i:0;i:2;i:1;i:3;s:0:"";}i:2;i:1;}i:4;a:3:{i:0;s:6:"header";i:1;a:3:{i:0;s:13:"Acesso Remoto";i:1;i:1;i:2;i:1;}i:2;i:1;}i:5;a:3:{i:0;s:12:"section_open";i:1;a:1:{i:0;i:1;}i:2;i:1;}i:6;a:3:{i:0;s:10:"listu_open";i:1;a:0:{}i:2;i:29;}i:7;a:3:{i:0;s:13:"listitem_open";i:1;a:1:{i:0;i:1;}i:2;i:29;}i:8;a:3:{i:0;s:16:"listcontent_open";i:1;a:0:{}i:2;i:29;}i:9;a:3:{i:0;s:5:"cdata";i:1;a:1:{i:0;s:58:" Descrição de como acessar recursos do PET externamente.";}i:2;i:33;}i:10;a:3:{i:0;s:17:"listcontent_close";i:1;a:0:{}i:2;i:91;}i:11;a:3:{i:0;s:14:"listitem_close";i:1;a:0:{}i:2;i:91;}i:12;a:3:{i:0;s:11:"listu_close";i:1;a:0:{}i:2;i:91;}i:13;a:3:{i:0;s:6:"p_open";i:1;a:0:{}i:2;i:91;}i:14;a:3:{i:0;s:5:"cdata";i:1;a:1:{i:0;s:1:"
";}i:2;i:92;}i:15;a:3:{i:0;s:9:"linebreak";i:1;a:0:{}i:2;i:93;}i:16;a:3:{i:0;s:5:"cdata";i:1;a:1:{i:0;s:135:"  Para acessar o trac de sua casa utilize os seguintes passos, onde usuario-ufrgs é seu login no portal e usuário-pet é seu login do";}i:2;i:95;}i:17;a:3:{i:0;s:6:"entity";i:1;a:1:{i:0;s:3:"...";}i:2;i:230;}i:18;a:3:{i:0;s:5:"cdata";i:1;a:1:{i:0;s:44:" pet. Abra um terminal e digite o seguinte:
";}i:2;i:233;}i:19;a:3:{i:0;s:7:"p_close";i:1;a:0:{}i:2;i:277;}i:20;a:3:{i:0;s:12:"preformatted";i:1;a:1:{i:0;s:58:"ssh usuario-ufrgs@portal.inf.ufrgs.br -L 7777:pet:22 cat -";}i:2;i:277;}i:21;a:3:{i:0;s:6:"p_open";i:1;a:0:{}i:2;i:277;}i:22;a:3:{i:0;s:5:"cdata";i:1;a:1:{i:0;s:21:"
Digite sua senha do ";}i:2;i:339;}i:23;a:3:{i:0;s:11:"strong_open";i:1;a:0:{}i:2;i:360;}i:24;a:3:{i:0;s:5:"cdata";i:1;a:1:{i:0;s:6:"portal";}i:2;i:362;}i:25;a:3:{i:0;s:12:"strong_close";i:1;a:0:{}i:2;i:368;}i:26;a:3:{i:0;s:5:"cdata";i:1;a:1:{i:0;s:21:". O terminal ficará ";}i:2;i:370;}i:27;a:3:{i:0;s:18:"doublequoteopening";i:1;a:0:{}i:2;i:391;}i:28;a:3:{i:0;s:5:"cdata";i:1;a:1:{i:0;s:5:"preso";}i:2;i:392;}i:29;a:3:{i:0;s:18:"doublequoteclosing";i:1;a:0:{}i:2;i:397;}i:30;a:3:{i:0;s:5:"cdata";i:1;a:1:{i:0;s:47:" na conexão. Abra outro terminal e entre com:
";}i:2;i:398;}i:31;a:3:{i:0;s:7:"p_close";i:1;a:0:{}i:2;i:445;}i:32;a:3:{i:0;s:12:"preformatted";i:1;a:1:{i:0;s:60:"ssh usuario-pet@localhost -p 7777 -L 8888:localhost:80 cat -";}i:2;i:445;}i:33;a:3:{i:0;s:6:"p_open";i:1;a:0:{}i:2;i:445;}i:34;a:3:{i:0;s:5:"cdata";i:1;a:1:{i:0;s:21:"
Digite sua senha do ";}i:2;i:509;}i:35;a:3:{i:0;s:11:"strong_open";i:1;a:0:{}i:2;i:530;}i:36;a:3:{i:0;s:5:"cdata";i:1;a:1:{i:0;s:3:"pet";}i:2;i:532;}i:37;a:3:{i:0;s:12:"strong_close";i:1;a:0:{}i:2;i:535;}i:38;a:3:{i:0;s:5:"cdata";i:1;a:1:{i:0;s:58:". Tudo pronto, agora abra seu browser preferido e acesse:
";}i:2;i:537;}i:39;a:3:{i:0;s:7:"p_close";i:1;a:0:{}i:2;i:595;}i:40;a:3:{i:0;s:12:"preformatted";i:1;a:1:{i:0;s:26:"http://localhost:8888/pet/";}i:2;i:595;}i:41;a:3:{i:0;s:6:"p_open";i:1;a:0:{}i:2;i:595;}i:42;a:3:{i:0;s:5:"cdata";i:1;a:1:{i:0;s:63:"
Note que todos os recursos web do pet são acessíveis, como:
";}i:2;i:625;}i:43;a:3:{i:0;s:7:"p_close";i:1;a:0:{}i:2;i:688;}i:44;a:3:{i:0;s:12:"preformatted";i:1;a:1:{i:0;s:22:"http://localhost:8888/";}i:2;i:688;}i:45;a:3:{i:0;s:6:"p_open";i:1;a:0:{}i:2;i:688;}i:46;a:3:{i:0;s:5:"cdata";i:1;a:1:{i:0;s:88:"
7777 e 8888 podem ser portas quaisquer (entre 1024 e 65535 - fora disso só sendo root)";}i:2;i:714;}i:47;a:3:{i:0;s:7:"p_close";i:1;a:0:{}i:2;i:802;}i:48;a:3:{i:0;s:13:"section_close";i:1;a:0:{}i:2;i:804;}i:49;a:3:{i:0;s:12:"section_edit";i:1;a:4:{i:0;i:1;i:1;i:803;i:2;i:1;i:3;s:13:"Acesso Remoto";}i:2;i:804;}i:50;a:3:{i:0;s:6:"header";i:1;a:3:{i:0;s:12:"Explicação";i:1;i:2;i:2;i:804;}i:2;i:804;}i:51;a:3:{i:0;s:12:"section_open";i:1;a:1:{i:0;i:2;}i:2;i:804;}i:52;a:3:{i:0;s:6:"p_open";i:1;a:0:{}i:2;i:828;}i:53;a:3:{i:0;s:5:"cdata";i:1;a:1:{i:0;s:25:"
O que cada comando faz?
";}i:2;i:829;}i:54;a:3:{i:0;s:7:"p_close";i:1;a:0:{}i:2;i:854;}i:55;a:3:{i:0;s:12:"preformatted";i:1;a:1:{i:0;s:58:"ssh usuario-ufrgs@portal.inf.ufrgs.br -L 7777:pet:22 cat -";}i:2;i:854;}i:56;a:3:{i:0;s:6:"p_open";i:1;a:0:{}i:2;i:854;}i:57;a:3:{i:0;s:5:"cdata";i:1;a:1:{i:0;s:123:"
Esse comando faz com que todas conexões feitas na porta local 7777 serão redirecionadas pelo portal ao pet na porta 22 (";}i:2;i:916;}i:58;a:3:{i:0;s:7:"acronym";i:1;a:1:{i:0;s:3:"SSH";}i:2;i:1039;}i:59;a:3:{i:0;s:5:"cdata";i:1;a:1:{i:0;s:6:"). (O ";}i:2;i:1042;}i:60;a:3:{i:0;s:18:"doublequoteopening";i:1;a:0:{}i:2;i:1048;}i:61;a:3:{i:0;s:5:"cdata";i:1;a:1:{i:0;s:5:"cat -";}i:2;i:1049;}i:62;a:3:{i:0;s:18:"doublequoteclosing";i:1;a:0:{}i:2;i:1054;}i:63;a:3:{i:0;s:5:"cdata";i:1;a:1:{i:0;s:66:" serve para manter a conexão aberta entre o PC local e o portal)
";}i:2;i:1055;}i:64;a:3:{i:0;s:7:"p_close";i:1;a:0:{}i:2;i:1121;}i:65;a:3:{i:0;s:12:"preformatted";i:1;a:1:{i:0;s:60:"ssh usuario-pet@localhost -p 7777 -L 8888:localhost:80 cat -";}i:2;i:1121;}i:66;a:3:{i:0;s:6:"p_open";i:1;a:0:{}i:2;i:1121;}i:67;a:3:{i:0;s:5:"cdata";i:1;a:1:{i:0;s:152:"
Aqui abrimos uma conexão ssh com o pet na porta 22. Agora, todas as conexões feitas na porta local 8888 serão redirecionadas para o pet na porta 80.";}i:2;i:1185;}i:68;a:3:{i:0;s:9:"linebreak";i:1;a:0:{}i:2;i:1337;}i:69;a:3:{i:0;s:5:"cdata";i:1;a:1:{i:0;s:53:" O esquemático de como ficam as conexões ao final:
";}i:2;i:1339;}i:70;a:3:{i:0;s:7:"p_close";i:1;a:0:{}i:2;i:1392;}i:71;a:3:{i:0;s:12:"preformatted";i:1;a:1:{i:0;s:341:"+---------------------------------+                                                               +--------+
| browser: http://localhost:8888/ | ---&gt; casa:8888 ---&gt; casa:7777 ---&gt; portal:22 ---&gt; pet:22 ---&gt; | pet:80 |
+---------------------------------+                                                               +--------+";}i:2;i:1392;}i:72;a:3:{i:0;s:13:"section_close";i:1;a:0:{}i:2;i:1741;}i:73;a:3:{i:0;s:12:"section_edit";i:1;a:4:{i:0;i:804;i:1;i:0;i:2;i:2;i:3;s:12:"Explicação";}i:2;i:1741;}i:74;a:3:{i:0;s:12:"document_end";i:1;a:0:{}i:2;i:1741;}}