a:57:{i:0;a:3:{i:0;s:14:"document_start";i:1;a:0:{}i:2;i:0;}i:1;a:3:{i:0;s:6:"p_open";i:1;a:0:{}i:2;i:0;}i:2;a:3:{i:0;s:7:"p_close";i:1;a:0:{}i:2;i:1;}i:3;a:3:{i:0;s:12:"section_edit";i:1;a:4:{i:0;i:-1;i:1;i:0;i:2;i:1;i:3;s:0:"";}i:2;i:1;}i:4;a:3:{i:0;s:6:"header";i:1;a:3:{i:0;s:28:"Instalação do Gentoo Linux";i:1;i:1;i:2;i:1;}i:2;i:1;}i:5;a:3:{i:0;s:12:"section_open";i:1;a:1:{i:0;i:1;}i:2;i:1;}i:6;a:3:{i:0;s:6:"p_open";i:1;a:0:{}i:2;i:43;}i:7;a:3:{i:0;s:5:"cdata";i:1;a:1:{i:0;s:3:"
O ";}i:2;i:44;}i:8;a:3:{i:0;s:12:"externallink";i:1;a:2:{i:0;s:21:"http://www.gentoo.org";i:1;s:12:"Gentoo Linux";}i:2;i:47;}i:9;a:3:{i:0;s:5:"cdata";i:1;a:1:{i:0;s:63:" é uma distribuição cujas principais características são:
";}i:2;i:85;}i:10;a:3:{i:0;s:7:"p_close";i:1;a:0:{}i:2;i:148;}i:11;a:3:{i:0;s:10:"listu_open";i:1;a:0:{}i:2;i:148;}i:12;a:3:{i:0;s:13:"listitem_open";i:1;a:1:{i:0;i:1;}i:2;i:148;}i:13;a:3:{i:0;s:16:"listcontent_open";i:1;a:0:{}i:2;i:148;}i:14;a:3:{i:0;s:5:"cdata";i:1;a:1:{i:0;s:24:" Altamente configurável";}i:2;i:152;}i:15;a:3:{i:0;s:17:"listcontent_close";i:1;a:0:{}i:2;i:176;}i:16;a:3:{i:0;s:14:"listitem_close";i:1;a:0:{}i:2;i:176;}i:17;a:3:{i:0;s:13:"listitem_open";i:1;a:1:{i:0;i:1;}i:2;i:176;}i:18;a:3:{i:0;s:16:"listcontent_open";i:1;a:0:{}i:2;i:176;}i:19;a:3:{i:0;s:5:"cdata";i:1;a:1:{i:0;s:7:" emerge";}i:2;i:180;}i:20;a:3:{i:0;s:17:"listcontent_close";i:1;a:0:{}i:2;i:187;}i:21;a:3:{i:0;s:14:"listitem_close";i:1;a:0:{}i:2;i:187;}i:22;a:3:{i:0;s:13:"listitem_open";i:1;a:1:{i:0;i:1;}i:2;i:187;}i:23;a:3:{i:0;s:16:"listcontent_open";i:1;a:0:{}i:2;i:187;}i:24;a:3:{i:0;s:5:"cdata";i:1;a:1:{i:0;s:19:" init personalizado";}i:2;i:191;}i:25;a:3:{i:0;s:17:"listcontent_close";i:1;a:0:{}i:2;i:210;}i:26;a:3:{i:0;s:14:"listitem_close";i:1;a:0:{}i:2;i:210;}i:27;a:3:{i:0;s:11:"listu_close";i:1;a:0:{}i:2;i:210;}i:28;a:3:{i:0;s:6:"p_open";i:1;a:0:{}i:2;i:210;}i:29;a:3:{i:0;s:5:"cdata";i:1;a:1:{i:0;s:36:"
Suas principais desvantagens são:
";}i:2;i:211;}i:30;a:3:{i:0;s:7:"p_close";i:1;a:0:{}i:2;i:247;}i:31;a:3:{i:0;s:10:"listu_open";i:1;a:0:{}i:2;i:247;}i:32;a:3:{i:0;s:13:"listitem_open";i:1;a:1:{i:0;i:1;}i:2;i:247;}i:33;a:3:{i:0;s:16:"listcontent_open";i:1;a:0:{}i:2;i:247;}i:34;a:3:{i:0;s:5:"cdata";i:1;a:1:{i:0;s:22:" Instalação demorada";}i:2;i:251;}i:35;a:3:{i:0;s:17:"listcontent_close";i:1;a:0:{}i:2;i:273;}i:36;a:3:{i:0;s:14:"listitem_close";i:1;a:0:{}i:2;i:273;}i:37;a:3:{i:0;s:13:"listitem_open";i:1;a:1:{i:0;i:1;}i:2;i:273;}i:38;a:3:{i:0;s:16:"listcontent_open";i:1;a:0:{}i:2;i:273;}i:39;a:3:{i:0;s:5:"cdata";i:1;a:1:{i:0;s:38:" Exige conexão rápida com a Internet";}i:2;i:277;}i:40;a:3:{i:0;s:17:"listcontent_close";i:1;a:0:{}i:2;i:315;}i:41;a:3:{i:0;s:14:"listitem_close";i:1;a:0:{}i:2;i:315;}i:42;a:3:{i:0;s:13:"listitem_open";i:1;a:1:{i:0;i:1;}i:2;i:315;}i:43;a:3:{i:0;s:16:"listcontent_open";i:1;a:0:{}i:2;i:315;}i:44;a:3:{i:0;s:5:"cdata";i:1;a:1:{i:0;s:48:" Necessário um conhecimento prévio sobre Linux";}i:2;i:319;}i:45;a:3:{i:0;s:17:"listcontent_close";i:1;a:0:{}i:2;i:367;}i:46;a:3:{i:0;s:14:"listitem_close";i:1;a:0:{}i:2;i:367;}i:47;a:3:{i:0;s:11:"listu_close";i:1;a:0:{}i:2;i:367;}i:48;a:3:{i:0;s:6:"p_open";i:1;a:0:{}i:2;i:367;}i:49;a:3:{i:0;s:5:"cdata";i:1;a:1:{i:0;s:45:"
A instalação procede nos seguintes passos:";}i:2;i:368;}i:50;a:3:{i:0;s:7:"p_close";i:1;a:0:{}i:2;i:413;}i:51;a:3:{i:0;s:6:"p_open";i:1;a:0:{}i:2;i:413;}i:52;a:3:{i:0;s:5:"cdata";i:1;a:1:{i:0;s:3:"1. ";}i:2;i:415;}i:53;a:3:{i:0;s:12:"internallink";i:1;a:2:{i:0;s:16:"/trac/wiki/media";i:1;s:40:"Escolher o meio de instalação adequado";}i:2;i:418;}i:54;a:3:{i:0;s:7:"p_close";i:1;a:0:{}i:2;i:479;}i:55;a:3:{i:0;s:13:"section_close";i:1;a:0:{}i:2;i:480;}i:56;a:3:{i:0;s:12:"document_end";i:1;a:0:{}i:2;i:480;}}