a:95:{i:0;a:3:{i:0;s:14:"document_start";i:1;a:0:{}i:2;i:0;}i:1;a:3:{i:0;s:6:"p_open";i:1;a:0:{}i:2;i:0;}i:2;a:3:{i:0;s:7:"p_close";i:1;a:0:{}i:2;i:1;}i:3;a:3:{i:0;s:12:"section_edit";i:1;a:4:{i:0;i:-1;i:1;i:0;i:2;i:1;i:3;s:0:"";}i:2;i:1;}i:4;a:3:{i:0;s:6:"header";i:1;a:3:{i:0;s:17:"Instalação Trac";i:1;i:1;i:2;i:1;}i:2;i:1;}i:5;a:3:{i:0;s:12:"section_open";i:1;a:1:{i:0;i:1;}i:2;i:1;}i:6;a:3:{i:0;s:13:"section_close";i:1;a:0:{}i:2;i:34;}i:7;a:3:{i:0;s:12:"section_edit";i:1;a:4:{i:0;i:1;i:1;i:33;i:2;i:1;i:3;s:17:"Instalação Trac";}i:2;i:34;}i:8;a:3:{i:0;s:6:"header";i:1;a:3:{i:0;s:33:"1. Instale os pacotes de software";i:1;i:3;i:2;i:34;}i:2;i:34;}i:9;a:3:{i:0;s:12:"section_open";i:1;a:1:{i:0;i:3;}i:2;i:34;}i:10;a:3:{i:0;s:12:"preformatted";i:1;a:1:{i:0;s:40:"sudo apt-get install trac libapache2-svn";}i:2;i:78;}i:11;a:3:{i:0;s:13:"section_close";i:1;a:0:{}i:2;i:123;}i:12;a:3:{i:0;s:12:"section_edit";i:1;a:4:{i:0;i:34;i:1;i:122;i:2;i:3;i:3;s:33:"1. Instale os pacotes de software";}i:2;i:123;}i:13;a:3:{i:0;s:6:"header";i:1;a:3:{i:0;s:29:"2. Criar o diretório do Trac";i:1;i:3;i:2;i:123;}i:2;i:123;}i:14;a:3:{i:0;s:12:"section_open";i:1;a:1:{i:0;i:3;}i:2;i:123;}i:15;a:3:{i:0;s:6:"p_open";i:1;a:0:{}i:2;i:162;}i:16;a:3:{i:0;s:5:"cdata";i:1;a:1:{i:0;s:76:"
Após, é necessário criar um diretório para armazenar os dados do Trac:
";}i:2;i:163;}i:17;a:3:{i:0;s:7:"p_close";i:1;a:0:{}i:2;i:239;}i:18;a:3:{i:0;s:12:"preformatted";i:1;a:1:{i:0;s:67:"sudo mkdir /var/lib/trac
sudo chown www-data:www-data /var/lib/trac";}i:2;i:239;}i:19;a:3:{i:0;s:13:"section_close";i:1;a:0:{}i:2;i:313;}i:20;a:3:{i:0;s:12:"section_edit";i:1;a:4:{i:0;i:123;i:1;i:312;i:2;i:3;i:3;s:29:"2. Criar o diretório do Trac";}i:2;i:313;}i:21;a:3:{i:0;s:6:"header";i:1;a:3:{i:0;s:22:"3. Configurar o Apache";i:1;i:3;i:2;i:313;}i:2;i:313;}i:22;a:3:{i:0;s:12:"section_open";i:1;a:1:{i:0;i:3;}i:2;i:313;}i:23;a:3:{i:0;s:6:"p_open";i:1;a:0:{}i:2;i:345;}i:24;a:3:{i:0;s:5:"cdata";i:1;a:1:{i:0;s:75:"
Após, criamos um novo vhost do Apache 2 salvando o seguinte código como ";}i:2;i:346;}i:25;a:3:{i:0;s:18:"doublequoteclosing";i:1;a:0:{}i:2;i:421;}i:26;a:3:{i:0;s:5:"cdata";i:1;a:1:{i:0;s:34:"/etc/apache2/sites-available/trac ";}i:2;i:422;}i:27;a:3:{i:0;s:18:"doublequoteclosing";i:1;a:0:{}i:2;i:456;}i:28;a:3:{i:0;s:5:"cdata";i:1;a:1:{i:0;s:2:":
";}i:2;i:457;}i:29;a:3:{i:0;s:7:"p_close";i:1;a:0:{}i:2;i:459;}i:30;a:3:{i:0;s:12:"preformatted";i:1;a:1:{i:0;s:377:"&lt;VirtualHost *&gt;
        ServerName pet
        DocumentRoot /usr/share/trac/cgi-bin/
        &lt;Directory /usr/share/trac/cgi-bin/&gt;
                Options Indexes FollowSymLinks MultiViews ExecCGI
                AllowOverride All
                Order allow,deny
                allow from all
        &lt;/Directory&gt;
        Alias /trac "/usr/share/trac/htdocs"";}i:2;i:459;}i:31;a:3:{i:0;s:12:"preformatted";i:1;a:1:{i:0;s:108:"        &lt;Location /trac.cgi&gt;
            SetEnv TRAC_ENV "/var/lib/trac/pet"
        &lt;/Location&gt;";}i:2;i:858;}i:32;a:3:{i:0;s:12:"preformatted";i:1;a:1:{i:0;s:161:"        DirectoryIndex trac.cgi
        ErrorLog /var/log/apache2/error.trac.log
        CustomLog /var/log/apache2/access.trac.log combined
&lt;/VirtualHost&gt;";}i:2;i:974;}i:33;a:3:{i:0;s:6:"p_open";i:1;a:0:{}i:2;i:974;}i:34;a:3:{i:0;s:5:"cdata";i:1;a:1:{i:0;s:68:"
Após, é necessário descomentar o seguinte parâmetro no arquivo ";}i:2;i:1145;}i:35;a:3:{i:0;s:18:"doublequoteclosing";i:1;a:0:{}i:2;i:1213;}i:36;a:3:{i:0;s:5:"cdata";i:1;a:1:{i:0;s:25:"/etc/apache2/apache2.conf";}i:2;i:1214;}i:37;a:3:{i:0;s:18:"doublequoteclosing";i:1;a:0:{}i:2;i:1239;}i:38;a:3:{i:0;s:5:"cdata";i:1;a:1:{i:0;s:2:":
";}i:2;i:1240;}i:39;a:3:{i:0;s:7:"p_close";i:1;a:0:{}i:2;i:1242;}i:40;a:3:{i:0;s:12:"preformatted";i:1;a:1:{i:0;s:68:"# To use CGI scripts outside /cgi-bin/:
#
AddHandler cgi-script .cgi";}i:2;i:1242;}i:41;a:3:{i:0;s:13:"section_close";i:1;a:0:{}i:2;i:1319;}i:42;a:3:{i:0;s:12:"section_edit";i:1;a:4:{i:0;i:313;i:1;i:1318;i:2;i:3;i:3;s:22:"3. Configurar o Apache";}i:2;i:1319;}i:43;a:3:{i:0;s:6:"header";i:1;a:3:{i:0;s:19:"4. Criar o Ambiente";i:1;i:3;i:2;i:1319;}i:2;i:1319;}i:44;a:3:{i:0;s:12:"section_open";i:1;a:1:{i:0;i:3;}i:2;i:1319;}i:45;a:3:{i:0;s:6:"p_open";i:1;a:0:{}i:2;i:1348;}i:46;a:3:{i:0;s:5:"cdata";i:1;a:1:{i:0;s:82:"
Precisamos dar um import inicial no nosso repositório SVN. Para tanto, fazemos:
";}i:2;i:1349;}i:47;a:3:{i:0;s:7:"p_close";i:1;a:0:{}i:2;i:1431;}i:48;a:3:{i:0;s:10:"listu_open";i:1;a:0:{}i:2;i:1431;}i:49;a:3:{i:0;s:13:"listitem_open";i:1;a:1:{i:0;i:1;}i:2;i:1431;}i:50;a:3:{i:0;s:16:"listcontent_open";i:1;a:0:{}i:2;i:1431;}i:51;a:3:{i:0;s:5:"cdata";i:1;a:1:{i:0;s:79:" Criamos uma pasta no tmp para após importarmos ela para o nosso repositório.";}i:2;i:1435;}i:52;a:3:{i:0;s:17:"listcontent_close";i:1;a:0:{}i:2;i:1514;}i:53;a:3:{i:0;s:14:"listitem_close";i:1;a:0:{}i:2;i:1514;}i:54;a:3:{i:0;s:11:"listu_close";i:1;a:0:{}i:2;i:1514;}i:55;a:3:{i:0;s:6:"p_open";i:1;a:0:{}i:2;i:1514;}i:56;a:3:{i:0;s:5:"cdata";i:1;a:1:{i:0;s:23:"    sudo mkdir /tmp/pet";}i:2;i:1515;}i:57;a:3:{i:0;s:7:"p_close";i:1;a:0:{}i:2;i:1538;}i:58;a:3:{i:0;s:12:"preformatted";i:1;a:1:{i:0;s:179:"  sudo mkdir /tmp/pet/branches
  sudo mkdir /tmp/pet/tags
  sudo mkdir /tmp/pet/trunk
  sudo svn import /tmp/pet file:///var/lib/svn/pet -m "initial import"
  sudo rm -rf /tmp/pet";}i:2;i:1538;}i:59;a:3:{i:0;s:10:"listu_open";i:1;a:0:{}i:2;i:1729;}i:60;a:3:{i:0;s:13:"listitem_open";i:1;a:1:{i:0;i:1;}i:2;i:1729;}i:61;a:3:{i:0;s:16:"listcontent_open";i:1;a:0:{}i:2;i:1729;}i:62;a:3:{i:0;s:5:"cdata";i:1;a:1:{i:0;s:58:" Habilitamos as devidas permissões e reiniciamos o apache";}i:2;i:1733;}i:63;a:3:{i:0;s:17:"listcontent_close";i:1;a:0:{}i:2;i:1791;}i:64;a:3:{i:0;s:14:"listitem_close";i:1;a:0:{}i:2;i:1791;}i:65;a:3:{i:0;s:11:"listu_close";i:1;a:0:{}i:2;i:1791;}i:66;a:3:{i:0;s:6:"p_open";i:1;a:0:{}i:2;i:1791;}i:67;a:3:{i:0;s:5:"cdata";i:1;a:1:{i:0;s:43:"    sudo chown -R www-data /var/lib/svn/pet";}i:2;i:1792;}i:68;a:3:{i:0;s:7:"p_close";i:1;a:0:{}i:2;i:1835;}i:69;a:3:{i:0;s:12:"preformatted";i:1;a:1:{i:0;s:66:"  sudo chown -R www-data /usr/share/trac
  sudo apache2 -k restart";}i:2;i:1835;}i:70;a:3:{i:0;s:10:"listu_open";i:1;a:0:{}i:2;i:1907;}i:71;a:3:{i:0;s:13:"listitem_open";i:1;a:1:{i:0;i:1;}i:2;i:1907;}i:72;a:3:{i:0;s:16:"listcontent_open";i:1;a:0:{}i:2;i:1907;}i:73;a:3:{i:0;s:5:"cdata";i:1;a:1:{i:0;s:38:" Terminamos de criar as pastas do trac";}i:2;i:1911;}i:74;a:3:{i:0;s:17:"listcontent_close";i:1;a:0:{}i:2;i:1949;}i:75;a:3:{i:0;s:14:"listitem_close";i:1;a:0:{}i:2;i:1949;}i:76;a:3:{i:0;s:11:"listu_close";i:1;a:0:{}i:2;i:1949;}i:77;a:3:{i:0;s:6:"p_open";i:1;a:0:{}i:2;i:1949;}i:78;a:3:{i:0;s:5:"cdata";i:1;a:1:{i:0;s:28:"    sudo mkdir /var/lib/trac";}i:2;i:1950;}i:79;a:3:{i:0;s:7:"p_close";i:1;a:0:{}i:2;i:1978;}i:80;a:3:{i:0;s:12:"preformatted";i:1;a:1:{i:0;s:86:"  sudo trac-admin /var/lib/trac/pet initenv
  sudo chown -R www-data /var/lib/trac/pet";}i:2;i:1978;}i:81;a:3:{i:0;s:13:"section_close";i:1;a:0:{}i:2;i:2071;}i:82;a:3:{i:0;s:12:"section_edit";i:1;a:4:{i:0;i:1319;i:1;i:2070;i:2;i:3;i:3;s:19:"4. Criar o Ambiente";}i:2;i:2071;}i:83;a:3:{i:0;s:6:"header";i:1;a:3:{i:0;s:19:"5. Iniciando o Trac";i:1;i:3;i:2;i:2071;}i:2;i:2071;}i:84;a:3:{i:0;s:12:"section_open";i:1;a:1:{i:0;i:3;}i:2;i:2071;}i:85;a:3:{i:0;s:6:"p_open";i:1;a:0:{}i:2;i:2100;}i:86;a:3:{i:0;s:5:"cdata";i:1;a:1:{i:0;s:114:"
Após, é preciso desativar o site padrão do Apache, e ativar o site do trac. Isto é executado pelos comandos:
";}i:2;i:2101;}i:87;a:3:{i:0;s:7:"p_close";i:1;a:0:{}i:2;i:2215;}i:88;a:3:{i:0;s:12:"preformatted";i:1;a:1:{i:0;s:73:"sudo a2dissite default
sudo a2ensite trac
sudo /etc/init.d/apache2 reload";}i:2;i:2215;}i:89;a:3:{i:0;s:6:"p_open";i:1;a:0:{}i:2;i:2215;}i:90;a:3:{i:0;s:5:"cdata";i:1;a:1:{i:0;s:63:"
TODO: descobrir como ativar simultaneamente o logador e o trac";}i:2;i:2296;}i:91;a:3:{i:0;s:7:"p_close";i:1;a:0:{}i:2;i:2359;}i:92;a:3:{i:0;s:13:"section_close";i:1;a:0:{}i:2;i:2360;}i:93;a:3:{i:0;s:12:"section_edit";i:1;a:4:{i:0;i:2071;i:1;i:0;i:2;i:3;i:3;s:19:"5. Iniciando o Trac";}i:2;i:2360;}i:94;a:3:{i:0;s:12:"document_end";i:1;a:0:{}i:2;i:2360;}}