a:215:{i:0;a:3:{i:0;s:14:"document_start";i:1;a:0:{}i:2;i:0;}i:1;a:3:{i:0;s:6:"p_open";i:1;a:0:{}i:2;i:0;}i:2;a:3:{i:0;s:7:"p_close";i:1;a:0:{}i:2;i:1;}i:3;a:3:{i:0;s:12:"section_edit";i:1;a:4:{i:0;i:-1;i:1;i:0;i:2;i:1;i:3;s:0:"";}i:2;i:1;}i:4;a:3:{i:0;s:6:"header";i:1;a:3:{i:0;s:29:"Ata da reunião de 10/05/2006";i:1;i:2;i:2;i:1;}i:2;i:1;}i:5;a:3:{i:0;s:12:"section_open";i:1;a:1:{i:0;i:2;}i:2;i:1;}i:6;a:3:{i:0;s:6:"p_open";i:1;a:0:{}i:2;i:42;}i:7;a:3:{i:0;s:5:"cdata";i:1;a:1:{i:0;s:160:"
Presentes: Alexandre, Dante, Eduardo, Estevão, Fabiano, Felipe, Gabriela, Lucas Cavalheiro, Lucas Mizusaki, Marcelo, Marcos, Nondillo, Pablo, Ricardo e Thiago";}i:2;i:43;}i:8;a:3:{i:0;s:7:"p_close";i:1;a:0:{}i:2;i:203;}i:9;a:3:{i:0;s:6:"p_open";i:1;a:0:{}i:2;i:203;}i:10;a:3:{i:0;s:5:"cdata";i:1;a:1:{i:0;s:16:"Ausentes: Nenhum";}i:2;i:205;}i:11;a:3:{i:0;s:7:"p_close";i:1;a:0:{}i:2;i:221;}i:12;a:3:{i:0;s:6:"p_open";i:1;a:0:{}i:2;i:221;}i:13;a:3:{i:0;s:5:"cdata";i:1;a:1:{i:0;s:17:"Relator: Lucas C.";}i:2;i:223;}i:14;a:3:{i:0;s:7:"p_close";i:1;a:0:{}i:2;i:240;}i:15;a:3:{i:0;s:13:"section_close";i:1;a:0:{}i:2;i:242;}i:16;a:3:{i:0;s:12:"section_edit";i:1;a:4:{i:0;i:1;i:1;i:241;i:2;i:2;i:3;s:29:"Ata da reunião de 10/05/2006";}i:2;i:242;}i:17;a:3:{i:0;s:6:"header";i:1;a:3:{i:0;s:22:"1)Planejamento Comgrad";i:1;i:2;i:2;i:242;}i:2;i:242;}i:18;a:3:{i:0;s:12:"section_open";i:1;a:1:{i:0;i:2;}i:2;i:242;}i:19;a:3:{i:0;s:6:"p_open";i:1;a:0:{}i:2;i:276;}i:20;a:3:{i:0;s:5:"cdata";i:1;a:1:{i:0;s:170:"
Fabiano propôs que todo mês alguém fique responsável por lembrar os petianos do relatório mensal da prograd e a folha de atividades. Foram eleitos para esta tarefa ";}i:2;i:277;}i:21;a:3:{i:0;s:11:"strong_open";i:1;a:0:{}i:2;i:447;}i:22;a:3:{i:0;s:5:"cdata";i:1;a:1:{i:0;s:5:"Pablo";}i:2;i:449;}i:23;a:3:{i:0;s:12:"strong_close";i:1;a:0:{}i:2;i:454;}i:24;a:3:{i:0;s:5:"cdata";i:1;a:1:{i:0;s:3:" e ";}i:2;i:456;}i:25;a:3:{i:0;s:11:"strong_open";i:1;a:0:{}i:2;i:459;}i:26;a:3:{i:0;s:5:"cdata";i:1;a:1:{i:0;s:13:"Felipe Flores";}i:2;i:461;}i:27;a:3:{i:0;s:12:"strong_close";i:1;a:0:{}i:2;i:474;}i:28;a:3:{i:0;s:5:"cdata";i:1;a:1:{i:0;s:1:".";}i:2;i:476;}i:29;a:3:{i:0;s:7:"p_close";i:1;a:0:{}i:2;i:477;}i:30;a:3:{i:0;s:13:"section_close";i:1;a:0:{}i:2;i:479;}i:31;a:3:{i:0;s:12:"section_edit";i:1;a:4:{i:0;i:242;i:1;i:478;i:2;i:2;i:3;s:22:"1)Planejamento Comgrad";}i:2;i:479;}i:32;a:3:{i:0;s:6:"header";i:1;a:3:{i:0;s:15:"2)Interpet ESEF";i:1;i:2;i:2;i:479;}i:2;i:479;}i:33;a:3:{i:0;s:12:"section_open";i:1;a:1:{i:0;i:2;}i:2;i:479;}i:34;a:3:{i:0;s:6:"p_open";i:1;a:0:{}i:2;i:506;}i:35;a:3:{i:0;s:5:"cdata";i:1;a:1:{i:0;s:132:"
Marcos ressaltou que todos os grupos PET estavam representados e havia um prof. Tutor presente. Os assuntos debatidos foram esses:
";}i:2;i:507;}i:36;a:3:{i:0;s:7:"p_close";i:1;a:0:{}i:2;i:639;}i:37;a:3:{i:0;s:10:"listu_open";i:1;a:0:{}i:2;i:639;}i:38;a:3:{i:0;s:13:"listitem_open";i:1;a:1:{i:0;i:1;}i:2;i:639;}i:39;a:3:{i:0;s:16:"listcontent_open";i:1;a:0:{}i:2;i:639;}i:40;a:3:{i:0;s:5:"cdata";i:1;a:1:{i:0;s:7:" Sulpet";}i:2;i:643;}i:41;a:3:{i:0;s:17:"listcontent_close";i:1;a:0:{}i:2;i:650;}i:42;a:3:{i:0;s:10:"listu_open";i:1;a:0:{}i:2;i:650;}i:43;a:3:{i:0;s:13:"listitem_open";i:1;a:1:{i:0;i:2;}i:2;i:650;}i:44;a:3:{i:0;s:16:"listcontent_open";i:1;a:0:{}i:2;i:650;}i:45;a:3:{i:0;s:5:"cdata";i:1;a:1:{i:0;s:23:" O prolema com a Odonto";}i:2;i:656;}i:46;a:3:{i:0;s:17:"listcontent_close";i:1;a:0:{}i:2;i:679;}i:47;a:3:{i:0;s:14:"listitem_close";i:1;a:0:{}i:2;i:679;}i:48;a:3:{i:0;s:11:"listu_close";i:1;a:0:{}i:2;i:679;}i:49;a:3:{i:0;s:14:"listitem_close";i:1;a:0:{}i:2;i:679;}i:50;a:3:{i:0;s:13:"listitem_open";i:1;a:1:{i:0;i:1;}i:2;i:679;}i:51;a:3:{i:0;s:16:"listcontent_open";i:1;a:0:{}i:2;i:679;}i:52;a:3:{i:0;s:5:"cdata";i:1;a:1:{i:0;s:31:" Enapet: falta de organização";}i:2;i:683;}i:53;a:3:{i:0;s:17:"listcontent_close";i:1;a:0:{}i:2;i:714;}i:54;a:3:{i:0;s:14:"listitem_close";i:1;a:0:{}i:2;i:714;}i:55;a:3:{i:0;s:13:"listitem_open";i:1;a:1:{i:0;i:1;}i:2;i:714;}i:56;a:3:{i:0;s:16:"listcontent_open";i:1;a:0:{}i:2;i:714;}i:57;a:3:{i:0;s:5:"cdata";i:1;a:1:{i:0;s:33:" Regularização do tutor da ESEF";}i:2;i:718;}i:58;a:3:{i:0;s:17:"listcontent_close";i:1;a:0:{}i:2;i:751;}i:59;a:3:{i:0;s:14:"listitem_close";i:1;a:0:{}i:2;i:751;}i:60;a:3:{i:0;s:13:"listitem_open";i:1;a:1:{i:0;i:1;}i:2;i:751;}i:61;a:3:{i:0;s:16:"listcontent_open";i:1;a:0:{}i:2;i:751;}i:62;a:3:{i:0;s:5:"cdata";i:1;a:1:{i:0;s:30:" Relatório semestral da SESU:";}i:2;i:755;}i:63;a:3:{i:0;s:17:"listcontent_close";i:1;a:0:{}i:2;i:785;}i:64;a:3:{i:0;s:14:"listitem_close";i:1;a:0:{}i:2;i:785;}i:65;a:3:{i:0;s:11:"listu_close";i:1;a:0:{}i:2;i:785;}i:66;a:3:{i:0;s:6:"p_open";i:1;a:0:{}i:2;i:785;}i:67;a:3:{i:0;s:5:"cdata";i:1;a:1:{i:0;s:210:"
Foram criticados alguns aspectos do relatório: muito quantitativo e não se encaixa na estrutura do nosso PET. Dante propôs uma discussão sobre o assunto para levar um posicionamento dos PETs à Brasília.
";}i:2;i:786;}i:68;a:3:{i:0;s:7:"p_close";i:1;a:0:{}i:2;i:996;}i:69;a:3:{i:0;s:10:"listu_open";i:1;a:0:{}i:2;i:996;}i:70;a:3:{i:0;s:13:"listitem_open";i:1;a:1:{i:0;i:1;}i:2;i:996;}i:71;a:3:{i:0;s:16:"listcontent_open";i:1;a:0:{}i:2;i:996;}i:72;a:3:{i:0;s:5:"cdata";i:1;a:1:{i:0;s:95:" Interpetão: Cada grupo leva uma proposta sobre a organização do seu PET (Tutor, líder, etc";}i:2;i:1000;}i:73;a:3:{i:0;s:6:"entity";i:1;a:1:{i:0;s:3:"...";}i:2;i:1095;}i:74;a:3:{i:0;s:5:"cdata";i:1;a:1:{i:0;s:12:") A data é ";}i:2;i:1098;}i:75;a:3:{i:0;s:11:"strong_open";i:1;a:0:{}i:2;i:1110;}i:76;a:3:{i:0;s:5:"cdata";i:1;a:1:{i:0;s:56:" 3 de Junho, na Odonto (impossível para os ECPs) às 8h";}i:2;i:1112;}i:77;a:3:{i:0;s:12:"strong_close";i:1;a:0:{}i:2;i:1168;}i:78;a:3:{i:0;s:5:"cdata";i:1;a:1:{i:0;s:122:". Foi proposta uma nova data: 10 de junho. Dia 24 de Maio está marcado outro Interpet, que debaterá o regimento Cenapet.";}i:2;i:1170;}i:79;a:3:{i:0;s:17:"listcontent_close";i:1;a:0:{}i:2;i:1292;}i:80;a:3:{i:0;s:14:"listitem_close";i:1;a:0:{}i:2;i:1292;}i:81;a:3:{i:0;s:11:"listu_close";i:1;a:0:{}i:2;i:1292;}i:82;a:3:{i:0;s:13:"section_close";i:1;a:0:{}i:2;i:1294;}i:83;a:3:{i:0;s:12:"section_edit";i:1;a:4:{i:0;i:479;i:1;i:1293;i:2;i:2;i:3;s:15:"2)Interpet ESEF";}i:2;i:1294;}i:84;a:3:{i:0;s:6:"header";i:1;a:3:{i:0;s:16:"3)Portas Abertas";i:1;i:2;i:2;i:1294;}i:2;i:1294;}i:85;a:3:{i:0;s:12:"section_open";i:1;a:1:{i:0;i:2;}i:2;i:1294;}i:86;a:3:{i:0;s:6:"p_open";i:1;a:0:{}i:2;i:1322;}i:87;a:3:{i:0;s:5:"cdata";i:1;a:1:{i:0;s:180:"
Foi debatida a situação atual e a escala para sábado (13/05). A escala foi feita considerando a retirada de dúvidas e as atividades no museu. Alguns petianos irão distribuir ";}i:2;i:1323;}i:88;a:3:{i:0;s:13:"emphasis_open";i:1;a:0:{}i:2;i:1503;}i:89;a:3:{i:0;s:5:"cdata";i:1;a:1:{i:0;s:9:"santinhos";}i:2;i:1505;}i:90;a:3:{i:0;s:14:"emphasis_close";i:1;a:0:{}i:2;i:1514;}i:91;a:3:{i:0;s:5:"cdata";i:1;a:1:{i:0;s:72:" no museu. Foram acertados os últimos detalhes dos folderes, posteres, ";}i:2;i:1516;}i:92;a:3:{i:0;s:13:"emphasis_open";i:1;a:0:{}i:2;i:1588;}i:93;a:3:{i:0;s:5:"cdata";i:1;a:1:{i:0;s:9:"santinhos";}i:2;i:1590;}i:94;a:3:{i:0;s:14:"emphasis_close";i:1;a:0:{}i:2;i:1599;}i:95;a:3:{i:0;s:5:"cdata";i:1;a:1:{i:0;s:113:". Após o Portas Abertas, o museu continuará em exposição por duas semanas na sala 107 do prédio 43425 do II.";}i:2;i:1601;}i:96;a:3:{i:0;s:7:"p_close";i:1;a:0:{}i:2;i:1714;}i:97;a:3:{i:0;s:13:"section_close";i:1;a:0:{}i:2;i:1716;}i:98;a:3:{i:0;s:12:"section_edit";i:1;a:4:{i:0;i:1294;i:1;i:1715;i:2;i:2;i:3;s:16:"3)Portas Abertas";}i:2;i:1716;}i:99;a:3:{i:0;s:6:"header";i:1;a:3:{i:0;s:15:"4)Camisetas PET";i:1;i:2;i:2;i:1716;}i:2;i:1716;}i:100;a:3:{i:0;s:12:"section_open";i:1;a:1:{i:0;i:2;}i:2;i:1716;}i:101;a:3:{i:0;s:6:"p_open";i:1;a:0:{}i:2;i:1743;}i:102;a:3:{i:0;s:5:"cdata";i:1;a:1:{i:0;s:39:"
Estevão passou ao grupo os detalhes:
";}i:2;i:1744;}i:103;a:3:{i:0;s:7:"p_close";i:1;a:0:{}i:2;i:1783;}i:104;a:3:{i:0;s:10:"listu_open";i:1;a:0:{}i:2;i:1783;}i:105;a:3:{i:0;s:13:"listitem_open";i:1;a:1:{i:0;i:1;}i:2;i:1783;}i:106;a:3:{i:0;s:16:"listcontent_open";i:1;a:0:{}i:2;i:1783;}i:107;a:3:{i:0;s:5:"cdata";i:1;a:1:{i:0;s:1:" ";}i:2;i:1787;}i:108;a:3:{i:0;s:11:"strong_open";i:1;a:0:{}i:2;i:1788;}i:109;a:3:{i:0;s:5:"cdata";i:1;a:1:{i:0;s:6:"Valor:";}i:2;i:1790;}i:110;a:3:{i:0;s:12:"strong_close";i:1;a:0:{}i:2;i:1796;}i:111;a:3:{i:0;s:5:"cdata";i:1;a:1:{i:0;s:9:" R$ 14,20";}i:2;i:1798;}i:112;a:3:{i:0;s:17:"listcontent_close";i:1;a:0:{}i:2;i:1807;}i:113;a:3:{i:0;s:14:"listitem_close";i:1;a:0:{}i:2;i:1807;}i:114;a:3:{i:0;s:13:"listitem_open";i:1;a:1:{i:0;i:1;}i:2;i:1807;}i:115;a:3:{i:0;s:16:"listcontent_open";i:1;a:0:{}i:2;i:1807;}i:116;a:3:{i:0;s:5:"cdata";i:1;a:1:{i:0;s:1:" ";}i:2;i:1811;}i:117;a:3:{i:0;s:11:"strong_open";i:1;a:0:{}i:2;i:1812;}i:118;a:3:{i:0;s:5:"cdata";i:1;a:1:{i:0;s:8:"Entrega:";}i:2;i:1814;}i:119;a:3:{i:0;s:12:"strong_close";i:1;a:0:{}i:2;i:1822;}i:120;a:3:{i:0;s:5:"cdata";i:1;a:1:{i:0;s:18:" Sexta, 12 de maio";}i:2;i:1824;}i:121;a:3:{i:0;s:17:"listcontent_close";i:1;a:0:{}i:2;i:1842;}i:122;a:3:{i:0;s:14:"listitem_close";i:1;a:0:{}i:2;i:1842;}i:123;a:3:{i:0;s:11:"listu_close";i:1;a:0:{}i:2;i:1842;}i:124;a:3:{i:0;s:6:"p_open";i:1;a:0:{}i:2;i:1842;}i:125;a:3:{i:0;s:5:"cdata";i:1;a:1:{i:0;s:123:"
Modelo laranja, sem friso. Ficarão guardados os fotolitos (com o Estevão) para reduzir os custos de uma futura camiseta.";}i:2;i:1843;}i:126;a:3:{i:0;s:7:"p_close";i:1;a:0:{}i:2;i:1966;}i:127;a:3:{i:0;s:13:"section_close";i:1;a:0:{}i:2;i:1968;}i:128;a:3:{i:0;s:12:"section_edit";i:1;a:4:{i:0;i:1716;i:1;i:1967;i:2;i:2;i:3;s:15:"4)Camisetas PET";}i:2;i:1968;}i:129;a:3:{i:0;s:6:"header";i:1;a:3:{i:0;s:15:"5)Curso de HTML";i:1;i:2;i:2;i:1968;}i:2;i:1968;}i:130;a:3:{i:0;s:12:"section_open";i:1;a:1:{i:0;i:2;}i:2;i:1968;}i:131;a:3:{i:0;s:6:"p_open";i:1;a:0:{}i:2;i:1995;}i:132;a:3:{i:0;s:5:"cdata";i:1;a:1:{i:0;s:20:"
Dante comentou que ";}i:2;i:1996;}i:133;a:3:{i:0;s:18:"doublequoteopening";i:1;a:0:{}i:2;i:2016;}i:134;a:3:{i:0;s:5:"cdata";i:1;a:1:{i:0;s:10:"os papéis";}i:2;i:2017;}i:135;a:3:{i:0;s:18:"doublequoteclosing";i:1;a:0:{}i:2;i:2027;}i:136;a:3:{i:0;s:5:"cdata";i:1;a:1:{i:0;s:118:" para a organização de um curso de html estão todos prontos, e que seria um desperdício não realizar esse curso. ";}i:2;i:2028;}i:137;a:3:{i:0;s:11:"strong_open";i:1;a:0:{}i:2;i:2146;}i:138;a:3:{i:0;s:5:"cdata";i:1;a:1:{i:0;s:6:"Thiago";}i:2;i:2148;}i:139;a:3:{i:0;s:12:"strong_close";i:1;a:0:{}i:2;i:2154;}i:140;a:3:{i:0;s:5:"cdata";i:1;a:1:{i:0;s:79:" ficou encarregado de coordenar a comissão que decidirá o futuro da proposta ";}i:2;i:2156;}i:141;a:3:{i:0;s:11:"strong_open";i:1;a:0:{}i:2;i:2235;}i:142;a:3:{i:0;s:5:"cdata";i:1;a:1:{i:0;s:39:"preferencialmente até o dia 24 de maio";}i:2;i:2237;}i:143;a:3:{i:0;s:12:"strong_close";i:1;a:0:{}i:2;i:2276;}i:144;a:3:{i:0;s:5:"cdata";i:1;a:1:{i:0;s:1:".";}i:2;i:2278;}i:145;a:3:{i:0;s:7:"p_close";i:1;a:0:{}i:2;i:2279;}i:146;a:3:{i:0;s:13:"section_close";i:1;a:0:{}i:2;i:2281;}i:147;a:3:{i:0;s:12:"section_edit";i:1;a:4:{i:0;i:1968;i:1;i:2280;i:2;i:2;i:3;s:15:"5)Curso de HTML";}i:2;i:2281;}i:148;a:3:{i:0;s:6:"header";i:1;a:3:{i:0;s:29:"6)Curso de JAVA (Pendências)";i:1;i:2;i:2;i:2281;}i:2;i:2281;}i:149;a:3:{i:0;s:12:"section_open";i:1;a:1:{i:0;i:2;}i:2;i:2281;}i:150;a:3:{i:0;s:6:"p_open";i:1;a:0:{}i:2;i:2322;}i:151;a:3:{i:0;s:5:"cdata";i:1;a:1:{i:0;s:254:"
Ficaram encarregados de concluir o processo (relatórios) o Estevão e o Thiago. Ficou definido que os certificados terão um cuso de R$ 4,00, e que o grupo pagará esse valor para os ex-petianos. Estevão ficou encarregado pelo levantamento dos custos.";}i:2;i:2323;}i:152;a:3:{i:0;s:7:"p_close";i:1;a:0:{}i:2;i:2577;}i:153;a:3:{i:0;s:13:"section_close";i:1;a:0:{}i:2;i:2579;}i:154;a:3:{i:0;s:12:"section_edit";i:1;a:4:{i:0;i:2281;i:1;i:2578;i:2;i:2;i:3;s:29:"6)Curso de JAVA (Pendências)";}i:2;i:2579;}i:155;a:3:{i:0;s:6:"header";i:1;a:3:{i:0;s:18:"7)Ciclo de Debates";i:1;i:2;i:2;i:2579;}i:2;i:2579;}i:156;a:3:{i:0;s:12:"section_open";i:1;a:1:{i:0;i:2;}i:2;i:2579;}i:157;a:3:{i:0;s:6:"p_open";i:1;a:0:{}i:2;i:2609;}i:158;a:3:{i:0;s:5:"cdata";i:1;a:1:{i:0;s:55:"
Foram ressaltados os pontos fracos e fortes do ciclo:
";}i:2;i:2610;}i:159;a:3:{i:0;s:7:"p_close";i:1;a:0:{}i:2;i:2665;}i:160;a:3:{i:0;s:10:"listu_open";i:1;a:0:{}i:2;i:2665;}i:161;a:3:{i:0;s:13:"listitem_open";i:1;a:1:{i:0;i:1;}i:2;i:2665;}i:162;a:3:{i:0;s:16:"listcontent_open";i:1;a:0:{}i:2;i:2665;}i:163;a:3:{i:0;s:5:"cdata";i:1;a:1:{i:0;s:17:" Poucos inscritos";}i:2;i:2669;}i:164;a:3:{i:0;s:17:"listcontent_close";i:1;a:0:{}i:2;i:2686;}i:165;a:3:{i:0;s:14:"listitem_close";i:1;a:0:{}i:2;i:2686;}i:166;a:3:{i:0;s:13:"listitem_open";i:1;a:1:{i:0;i:1;}i:2;i:2686;}i:167;a:3:{i:0;s:16:"listcontent_open";i:1;a:0:{}i:2;i:2686;}i:168;a:3:{i:0;s:5:"cdata";i:1;a:1:{i:0;s:18:" Break muito longo";}i:2;i:2690;}i:169;a:3:{i:0;s:17:"listcontent_close";i:1;a:0:{}i:2;i:2708;}i:170;a:3:{i:0;s:14:"listitem_close";i:1;a:0:{}i:2;i:2708;}i:171;a:3:{i:0;s:13:"listitem_open";i:1;a:1:{i:0;i:1;}i:2;i:2708;}i:172;a:3:{i:0;s:16:"listcontent_open";i:1;a:0:{}i:2;i:2708;}i:173;a:3:{i:0;s:5:"cdata";i:1;a:1:{i:0;s:54:" Indefinição no horário da palestra (13h30 ou 14h?)";}i:2;i:2712;}i:174;a:3:{i:0;s:17:"listcontent_close";i:1;a:0:{}i:2;i:2766;}i:175;a:3:{i:0;s:14:"listitem_close";i:1;a:0:{}i:2;i:2766;}i:176;a:3:{i:0;s:13:"listitem_open";i:1;a:1:{i:0;i:1;}i:2;i:2766;}i:177;a:3:{i:0;s:16:"listcontent_open";i:1;a:0:{}i:2;i:2766;}i:178;a:3:{i:0;s:5:"cdata";i:1;a:1:{i:0;s:28:" Próximo definido para 14h!";}i:2;i:2770;}i:179;a:3:{i:0;s:17:"listcontent_close";i:1;a:0:{}i:2;i:2798;}i:180;a:3:{i:0;s:14:"listitem_close";i:1;a:0:{}i:2;i:2798;}i:181;a:3:{i:0;s:13:"listitem_open";i:1;a:1:{i:0;i:1;}i:2;i:2798;}i:182;a:3:{i:0;s:16:"listcontent_open";i:1;a:0:{}i:2;i:2798;}i:183;a:3:{i:0;s:5:"cdata";i:1;a:1:{i:0;s:42:" Reservar um tempo maior para as palestras";}i:2;i:2802;}i:184;a:3:{i:0;s:17:"listcontent_close";i:1;a:0:{}i:2;i:2844;}i:185;a:3:{i:0;s:14:"listitem_close";i:1;a:0:{}i:2;i:2844;}i:186;a:3:{i:0;s:11:"listu_close";i:1;a:0:{}i:2;i:2844;}i:187;a:3:{i:0;s:6:"p_open";i:1;a:0:{}i:2;i:2844;}i:188;a:3:{i:0;s:5:"cdata";i:1;a:1:{i:0;s:38:"
Idéias para a promoção do Evento:
";}i:2;i:2845;}i:189;a:3:{i:0;s:7:"p_close";i:1;a:0:{}i:2;i:2883;}i:190;a:3:{i:0;s:10:"quote_open";i:1;a:0:{}i:2;i:2883;}i:191;a:3:{i:0;s:5:"cdata";i:1;a:1:{i:0;s:134:" E-mails para a lista de graduação com uma semana de antecedência e envio de mais e-mails (por outras pessoas) relembrando o Ciclo.";}i:2;i:2885;}i:192;a:3:{i:0;s:11:"quote_close";i:1;a:0:{}i:2;i:3019;}i:193;a:3:{i:0;s:6:"p_open";i:1;a:0:{}i:2;i:3019;}i:194;a:3:{i:0;s:5:"cdata";i:1;a:1:{i:0;s:204:"
Thiago ficou encarregado de procurar integrantes da mobilidade acadêmica para a palestra de sexta. Nondillo convidará alguém do Decordi. Lucas C. enviará o e-mail inicial divulgando o evento (sexta).";}i:2;i:3020;}i:195;a:3:{i:0;s:7:"p_close";i:1;a:0:{}i:2;i:3224;}i:196;a:3:{i:0;s:13:"section_close";i:1;a:0:{}i:2;i:3226;}i:197;a:3:{i:0;s:12:"section_edit";i:1;a:4:{i:0;i:2579;i:1;i:3225;i:2;i:2;i:3;s:18:"7)Ciclo de Debates";}i:2;i:3226;}i:198;a:3:{i:0;s:6:"header";i:1;a:3:{i:0;s:6:"8)Rede";i:1;i:2;i:2;i:3226;}i:2;i:3226;}i:199;a:3:{i:0;s:12:"section_open";i:1;a:1:{i:0;i:2;}i:2;i:3226;}i:200;a:3:{i:0;s:6:"p_open";i:1;a:0:{}i:2;i:3244;}i:201;a:3:{i:0;s:5:"cdata";i:1;a:1:{i:0;s:157:"
Devido aos vários problemas encontrados na rede do PET, ficou acertado que qualquer comportamento estranho por parte dos pcs deverá ser relatado no wiki (";}i:2;i:3245;}i:202;a:3:{i:0;s:12:"externallink";i:1;a:2:{i:0;s:42:"http://pet/trac/pet/wiki/AdministracaoRede";i:1;N;}i:2;i:3402;}i:203;a:3:{i:0;s:5:"cdata";i:1;a:1:{i:0;s:1:")";}i:2;i:3444;}i:204;a:3:{i:0;s:7:"p_close";i:1;a:0:{}i:2;i:3445;}i:205;a:3:{i:0;s:13:"section_close";i:1;a:0:{}i:2;i:3447;}i:206;a:3:{i:0;s:12:"section_edit";i:1;a:4:{i:0;i:3226;i:1;i:3446;i:2;i:2;i:3;s:6:"8)Rede";}i:2;i:3447;}i:207;a:3:{i:0;s:6:"header";i:1;a:3:{i:0;s:12:"9)Seminário";i:1;i:2;i:2;i:3447;}i:2;i:3447;}i:208;a:3:{i:0;s:12:"section_open";i:1;a:1:{i:0;i:2;}i:2;i:3447;}i:209;a:3:{i:0;s:6:"p_open";i:1;a:0:{}i:2;i:3471;}i:210;a:3:{i:0;s:5:"cdata";i:1;a:1:{i:0;s:65:"
Fabiano adiou para 17 de maio o seu seminário sobre a Gasolina.";}i:2;i:3472;}i:211;a:3:{i:0;s:7:"p_close";i:1;a:0:{}i:2;i:3537;}i:212;a:3:{i:0;s:13:"section_close";i:1;a:0:{}i:2;i:3538;}i:213;a:3:{i:0;s:12:"section_edit";i:1;a:4:{i:0;i:3447;i:1;i:0;i:2;i:2;i:3;s:12:"9)Seminário";}i:2;i:3538;}i:214;a:3:{i:0;s:12:"document_end";i:1;a:0:{}i:2;i:3538;}}