a:79:{i:0;a:3:{i:0;s:14:"document_start";i:1;a:0:{}i:2;i:0;}i:1;a:3:{i:0;s:6:"p_open";i:1;a:0:{}i:2;i:0;}i:2;a:3:{i:0;s:7:"p_close";i:1;a:0:{}i:2;i:1;}i:3;a:3:{i:0;s:12:"section_edit";i:1;a:4:{i:0;i:-1;i:1;i:0;i:2;i:1;i:3;s:0:"";}i:2;i:1;}i:4;a:3:{i:0;s:6:"header";i:1;a:3:{i:0;s:19:"/etc/samba/smb.conf";i:1;i:1;i:2;i:1;}i:2;i:1;}i:5;a:3:{i:0;s:12:"section_open";i:1;a:1:{i:0;i:1;}i:2;i:1;}i:6;a:3:{i:0;s:10:"listu_open";i:1;a:0:{}i:2;i:35;}i:7;a:3:{i:0;s:13:"listitem_open";i:1;a:1:{i:0;i:1;}i:2;i:35;}i:8;a:3:{i:0;s:16:"listcontent_open";i:1;a:0:{}i:2;i:35;}i:9;a:3:{i:0;s:5:"cdata";i:1;a:1:{i:0;s:80:" Isso é mais ou menos o que deve ter no arquivo /etc/samba/smb.conf do servidor";}i:2;i:39;}i:10;a:3:{i:0;s:17:"listcontent_close";i:1;a:0:{}i:2;i:119;}i:11;a:3:{i:0;s:14:"listitem_close";i:1;a:0:{}i:2;i:119;}i:12;a:3:{i:0;s:11:"listu_close";i:1;a:0:{}i:2;i:119;}i:13;a:3:{i:0;s:12:"preformatted";i:1;a:1:{i:0;s:663:"#
# Sample configuration file for the Samba suite for Debian GNU/Linux.
#
#
# This is the main Samba configuration file. You should read the
# smb.conf(5) manual page in order to understand the options listed
# here. Samba has a huge number of configurable options most of which
# are not shown in this example
#
# Any line which starts with a ; (semi-colon) or a # (hash)
# is a comment and is ignored. In this example we will use a #
# for commentary and a ; for parts of the config file that you
# may wish to enable
#
# NOTE: Whenever you modify this file you should run the command
# "testparm" to check that you have not made any basic syntactic
# errors.
#";}i:2;i:120;}i:14;a:3:{i:0;s:12:"preformatted";i:1;a:1:{i:0;s:64:"#======================= Global Settings =======================";}i:2;i:821;}i:15;a:3:{i:0;s:12:"preformatted";i:1;a:1:{i:0;s:8:"[global]";}i:2;i:889;}i:16;a:3:{i:0;s:12:"preformatted";i:1;a:1:{i:0;s:30:"## Browsing/Identification ###";}i:2;i:901;}i:17;a:3:{i:0;s:12:"preformatted";i:1;a:1:{i:0;s:95:"# Change this to the workgroup/NT-domain name your Samba server will part of
   workgroup = PET";}i:2;i:935;}i:18;a:3:{i:0;s:12:"preformatted";i:1;a:1:{i:0;s:99:"# server string is the equivalent of the NT Description field
   server string = %h (Samba, Ubuntu)";}i:2;i:1036;}i:19;a:3:{i:0;s:12:"preformatted";i:1;a:1:{i:0;s:147:"# Windows Internet Name Serving Support Section:
# WINS Support - Tells the NMBD component of Samba to enable its WINS Server
;   wins support = no";}i:2;i:1141;}i:20;a:3:{i:0;s:12:"preformatted";i:1;a:1:{i:0;s:174:"# WINS Server - Tells the NMBD components of Samba to be a WINS Client
# Note: Samba can be either a WINS Server, or a WINS Client, but NOT both
   wins server = 143.54.11.38";}i:2;i:1296;}i:21;a:3:{i:0;s:12:"preformatted";i:1;a:1:{i:0;s:83:"# This will prevent nmbd to search for NetBIOS names through DNS.
   dns proxy = no";}i:2;i:1478;}i:22;a:3:{i:0;s:12:"preformatted";i:1;a:1:{i:0;s:142:"# What naming service and in what order should we use to resolve host names
# to IP addresses
;   name resolve order = lmhosts host wins bcast";}i:2;i:1567;}i:23;a:3:{i:0;s:12:"preformatted";i:1;a:1:{i:0;s:20:"#### Networking ####";}i:2;i:1717;}i:24;a:3:{i:0;s:12:"preformatted";i:1;a:1:{i:0;s:195:"# The specific set of interfaces / networks to bind to
# This can be either the interface name or an IP address/netmask;
# interface names are normally preferred
;   interfaces = 127.0.0.0/8 eth0";}i:2;i:1741;}i:25;a:3:{i:0;s:12:"preformatted";i:1;a:1:{i:0;s:356:"# Only bind to the named interfaces and/or networks; you must use the
# 'interfaces' option above to use this.
# It is recommended that you enable this feature if your Samba machine is
# not protected by a firewall or is a firewall itself.  However, this
# option cannot handle dynamic or non-broadcast interfaces correctly.
;   bind interfaces only = true";}i:2;i:1946;}i:26;a:3:{i:0;s:12:"preformatted";i:1;a:1:{i:0;s:30:"#### Debugging/Accounting ####";}i:2;i:2316;}i:27;a:3:{i:0;s:12:"preformatted";i:1;a:1:{i:0;s:114:"# This tells Samba to use a separate log file for each machine
# that connects
   log file = /var/log/samba/log.%m";}i:2;i:2350;}i:28;a:3:{i:0;s:12:"preformatted";i:1;a:1:{i:0;s:75:"# Cap the size of the individual log files (in KiB).
   max log size = 1000";}i:2;i:2472;}i:29;a:3:{i:0;s:12:"preformatted";i:1;a:1:{i:0;s:112:"# If you want Samba to only log through syslog then set the following
# parameter to 'yes'.
;   syslog only = no";}i:2;i:2553;}i:30;a:3:{i:0;s:12:"preformatted";i:1;a:1:{i:0;s:241:"# We want Samba to log a minimum amount of information to syslog. Everything
# should go to /var/log/samba/log.{smbd,nmbd} instead. If you want to log
# through syslog you should set the following parameter to something higher.
   syslog = 0";}i:2;i:2673;}i:31;a:3:{i:0;s:12:"preformatted";i:1;a:1:{i:0;s:121:"# Do something sensible when Samba crashes: mail the admin a backtrace
   panic action = /usr/share/samba/panic-action %d";}i:2;i:2924;}i:32;a:3:{i:0;s:12:"preformatted";i:1;a:1:{i:0;s:30:"####### Authentication #######";}i:2;i:3051;}i:33;a:3:{i:0;s:12:"preformatted";i:1;a:1:{i:0;s:257:"# "security = user" is always a good idea. This will require a Unix account
# in this server for every user accessing the server. See
# /usr/share/doc/samba-doc/htmldocs/Samba3-HOWTO/ServerType.html
# in the samba-doc package for details.
   security = user";}i:2;i:3085;}i:34;a:3:{i:0;s:12:"preformatted";i:1;a:1:{i:0;s:156:"# You may wish to use password encryption.  See the section on
# 'encrypt passwords' in the smb.conf(5) manpage before enabling.
   encrypt passwords = true";}i:2;i:3354;}i:35;a:3:{i:0;s:12:"preformatted";i:1;a:1:{i:0;s:135:"# If you are using encrypted passwords, Samba will need to know what
# password database type you are using.
   passdb backend = tdbsam";}i:2;i:3518;}i:36;a:3:{i:0;s:12:"preformatted";i:1;a:1:{i:0;s:30:"   obey pam restrictions = yes";}i:2;i:3661;}i:37;a:3:{i:0;s:12:"preformatted";i:1;a:1:{i:0;s:50:";   guest account = nobody
   invalid users = root";}i:2;i:3695;}i:38;a:3:{i:0;s:12:"preformatted";i:1;a:1:{i:0;s:194:"# This boolean parameter controls whether Samba attempts to sync the Unix
# password with the SMB password when the encrypted SMB password in the
# passdb is changed.
   unix password sync = yes";}i:2;i:3751;}i:39;a:3:{i:0;s:12:"preformatted";i:1;a:1:{i:0;s:402:"# For Unix password sync to work on a Debian GNU/Linux system, the following
# parameters must be set (thanks to Ian Kahan &lt;&lt;kahan@informatik.tu-muenchen.de&gt; for
# sending the correct chat script for the passwd program in Debian Sarge).
   passwd program = /usr/bin/passwd %u
   passwd chat = *Enter\snew\s*\spassword:* %n\n *Retype\snew\s*\spassword:* %n\n *password\supdated\ssuccessfully* .";}i:2;i:3955;}i:40;a:3:{i:0;s:12:"preformatted";i:1;a:1:{i:0;s:206:"# This boolean controls whether PAM will be used for password changes
# when requested by an SMB client instead of the program listed in
# 'passwd program'. The default is 'no'.
   pam password change = yes";}i:2;i:4369;}i:41;a:3:{i:0;s:12:"preformatted";i:1;a:1:{i:0;s:124:"# This option controls how nsuccessful authentication attempts are mapped
# to anonymous connections
map to guest = bad user";}i:2;i:4585;}i:42;a:3:{i:0;s:12:"preformatted";i:1;a:1:{i:0;s:30:"########## Domains ###########";}i:2;i:4717;}i:43;a:3:{i:0;s:12:"preformatted";i:1;a:1:{i:0;s:589:"# Is this machine able to authenticate users. Both PDC and BDC
# must have this setting enabled. If you are the BDC you must
# change the 'domain master' setting to no
#
;   domain logons = yes
#
# The following setting only takes effect if 'domain logons' is set
# It specifies the location of the user's profile directory
# from the client point of view)
# The following required a [profiles] share to be setup on the
# samba server (see below)
;   logon path = \\%N\profiles\%U
# Another common choice is storing the profile in the user's home directory
;   logon path = \\%N\%U\profile";}i:2;i:4751;}i:44;a:3:{i:0;s:12:"preformatted";i:1;a:1:{i:0;s:202:"# The following setting only takes effect if 'domain logons' is set
# It specifies the location of a user's home directory (from the client
# point of view)
;   logon drive = H:
;   logon home = \\%N\%U";}i:2;i:5370;}i:45;a:3:{i:0;s:12:"preformatted";i:1;a:1:{i:0;s:249:"# The following setting only takes effect if 'domain logons' is set
# It specifies the script to run during logon. The script must be stored
# in the [netlogon] share
# NOTE: Must be store in 'DOS' file format convention
;   logon script = logon.cmd";}i:2;i:5584;}i:46;a:3:{i:0;s:12:"preformatted";i:1;a:1:{i:0;s:272:"# This allows Unix users to be created on the domain controller via the SAMR
# RPC pipe.  The example command creates a user account with a disabled Unix
# password; please adapt to your needs
; add user script = /usr/sbin/adduser --quiet --disabled-password --gecos "" %u";}i:2;i:5845;}i:47;a:3:{i:0;s:12:"preformatted";i:1;a:1:{i:0;s:30:"########## Printing ##########";}i:2;i:6127;}i:48;a:3:{i:0;s:12:"preformatted";i:1;a:1:{i:0;s:142:"# If you want to automatically load your printer list rather
# than setting them up individually then you'll need this
;   load printers = yes";}i:2;i:6161;}i:49;a:3:{i:0;s:12:"preformatted";i:1;a:1:{i:0;s:133:"# lpr(ng) printing. You may wish to override the location of the
# printcap file
;   printing = bsd
;   printcap name = /etc/printcap";}i:2;i:6311;}i:50;a:3:{i:0;s:12:"preformatted";i:1;a:1:{i:0;s:129:"# CUPS printing.  See also the cupsaddsmb(8) manpage in the
# cupsys-client package.
;   printing = cups
;   printcap name = cups";}i:2;i:6454;}i:51;a:3:{i:0;s:12:"preformatted";i:1;a:1:{i:0;s:30:"############ Misc ############";}i:2;i:6593;}i:52;a:3:{i:0;s:12:"preformatted";i:1;a:1:{i:0;s:217:"# Using the following line enables you to customise your configuration
# on a per machine basis. The %m gets replaced with the netbios name
# of the machine that is connecting
;   include = /home/samba/etc/smb.conf.%m";}i:2;i:6627;}i:53;a:3:{i:0;s:12:"preformatted";i:1;a:1:{i:0;s:287:"# Most people will find that this option gives better performance.
# See smb.conf(5) and /usr/share/doc/samba-doc/htmldocs/Samba3-HOWTO/speed.html
# for details
# You may want to add the following on a Linux system:
#         SO_RCVBUF=8192 SO_SNDBUF=8192
   socket options = TCP_NODELAY";}i:2;i:6854;}i:54;a:3:{i:0;s:12:"preformatted";i:1;a:1:{i:0;s:290:"# The following parameter is useful only if you have the linpopup package
# installed. The samba maintainer and the linpopup maintainer are
# working to ease installation and configuration of linpopup and samba.
;   message command = /bin/sh -c '/usr/bin/linpopup "%f" "%m" %s; rm %s' &amp;";}i:2;i:7155;}i:55;a:3:{i:0;s:12:"preformatted";i:1;a:1:{i:0;s:240:"# Domain Master specifies Samba to be the Domain Master Browser. If this
# machine will be configured as a BDC (a secondary logon server), you
# must set this to 'no'; otherwise, the default behavior is recommended.
;   domain master = auto";}i:2;i:7455;}i:56;a:3:{i:0;s:12:"preformatted";i:1;a:1:{i:0;s:176:"# Some defaults for winbind (make sure you're not using the ranges
# for something else.)
;   idmap uid = 10000-20000
;   idmap gid = 10000-20000
;   template shell = /bin/bash";}i:2;i:7705;}i:57;a:3:{i:0;s:12:"preformatted";i:1;a:1:{i:0;s:335:"# The following was the default behaviour in sarge,
# but samba upstream reverted the default because it might induce
# performance issues in large organizations.
# See Debian bug #368251 for some of the consequences of *not*
# having this setting and smb.conf(5) for details.
;   winbind enum groups = yes
;   winbind enum users = yes";}i:2;i:7893;}i:58;a:3:{i:0;s:12:"preformatted";i:1;a:1:{i:0;s:101:"# Setup usershare options to enable non-root users to share folders
# with the net usershare command.";}i:2;i:8244;}i:59;a:3:{i:0;s:12:"preformatted";i:1;a:1:{i:0;s:107:"# Maximum number of usershare. 0 (default) means that usershare is disabled.
;   usershare max shares = 100";}i:2;i:8351;}i:60;a:3:{i:0;s:12:"preformatted";i:1;a:1:{i:0;s:141:"# Allow users who've been granted usershare privileges to create
# public shares, not just authenticated ones
   usershare allow guests = yes";}i:2;i:8464;}i:61;a:3:{i:0;s:12:"preformatted";i:1;a:1:{i:0;s:54:"# Max disk size = 0 -&gt; sem limite
max disk size = 0";}i:2;i:8613;}i:62;a:3:{i:0;s:12:"preformatted";i:1;a:1:{i:0;s:66:"#======================= Share Definitions =======================";}i:2;i:8673;}i:63;a:3:{i:0;s:12:"preformatted";i:1;a:1:{i:0;s:279:"# Un-comment the following (and tweak the other settings below to suit)
# to enable the default home directory shares.  This will share each
# user's home directory as \\server\username
[homes]
   comment = Home do %S
   browseable = no
   valid users = %S pet
   force user = %S";}i:2;i:8743;}i:64;a:3:{i:0;s:12:"preformatted";i:1;a:1:{i:0;s:141:"[pet-docs]
   comment = PET Documents
   path = /pet-docs
   create mask = 0777
   directory mask = 0777
   read only = no
   writeable = yes";}i:2;i:9040;}i:65;a:3:{i:0;s:12:"preformatted";i:1;a:1:{i:0;s:152:"[grupos]
   comment = Pasta dos Grupos de Projetos
   path = /grupos
   create mask = 0777
   directory mask = 0777
   read only = no
   writeable = yes";}i:2;i:9197;}i:66;a:3:{i:0;s:12:"preformatted";i:1;a:1:{i:0;s:140:"[users]
   comment = Pasta dos Usuarios
   path = /users
   create mask = 0777
   directory mask = 0777
   read only = no
   writeable = yes";}i:2;i:9365;}i:67;a:3:{i:0;s:12:"preformatted";i:1;a:1:{i:0;s:155:"# By default, the home directories are exported read-only. Change the
# next parameter to 'no' if you want to be able to write to them.
;   read only = yes";}i:2;i:9521;}i:68;a:3:{i:0;s:12:"preformatted";i:1;a:1:{i:0;s:165:"# File creation mask is set to 0700 for security reasons. If you want to
# create files with group=rw permissions, set next parameter to 0775.
;   create mask = 0700";}i:2;i:9684;}i:69;a:3:{i:0;s:12:"preformatted";i:1;a:1:{i:0;s:173:"# Directory creation mask is set to 0700 for security reasons. If you want to
# create dirs. with group=rw permissions, set next parameter to 0775.
;   directory mask = 0700";}i:2;i:9857;}i:70;a:3:{i:0;s:12:"preformatted";i:1;a:1:{i:0;s:303:"# By default, \\server\username shares can be connected to by anyone
# with access to the samba server.  Un-comment the following parameter
# to make sure that only "username" can connect to \\server\username
# This might need tweaking when using external authentication schemes
;   valid users = %S pet";}i:2;i:10038;}i:71;a:3:{i:0;s:12:"preformatted";i:1;a:1:{i:0;s:285:"# Un-comment the following and create the netlogon directory for Domain Logons
# (you need to configure Samba to act as a domain controller too.)
;[netlogon]
;   comment = Network Logon Service
;   path = /home/samba/netlogon
;   guest ok = yes
;   read only = yes
;   share modes = no";}i:2;i:10353;}i:72;a:3:{i:0;s:12:"preformatted";i:1;a:1:{i:0;s:474:"# Un-comment the following and create the profiles directory to store
# users profiles (see the "logon path" option above)
# (you need to configure Samba to act as a domain controller too.)
# The path below should be writable by all users so that their
# profile directory may be created the first time they log on
;[profiles]
;   comment = Users profiles
;   path = /home/samba/profiles
;   guest ok = no
;   browseable = no
;   create mask = 0600
;   directory mask = 0700";}i:2;i:10656;}i:73;a:3:{i:0;s:12:"preformatted";i:1;a:1:{i:0;s:159:"[printers]
   comment = All Printers
   browseable = no
   path = /var/spool/samba
   printable = yes
   guest ok = no
   read only = yes
   create mask = 0700";}i:2;i:11156;}i:74;a:3:{i:0;s:12:"preformatted";i:1;a:1:{i:0;s:399:"# Windows clients look for this share name as a source of downloadable
# printer drivers
[print$]
   comment = Printer Drivers
   path = /var/lib/samba/printers
   browseable = yes
   read only = yes
   guest ok = no
# Uncomment to allow remote administration of Windows print drivers.
# Replace 'ntadmin' with the name of the group your admin users are
# members of.
;   write list = root, @ntadmin";}i:2;i:11333;}i:75;a:3:{i:0;s:12:"preformatted";i:1;a:1:{i:0;s:172:"# A sample share for sharing your CD-ROM with others.
;[cdrom]
;   comment = Samba server's CD-ROM
;   read only = yes
;   locking = no
;   path = /cdrom
;   guest ok = yes";}i:2;i:11758;}i:76;a:3:{i:0;s:12:"preformatted";i:1;a:1:{i:0;s:457:"# The next two parameters show how to auto-mount a CD-ROM when the
#	cdrom share is accesed. For this to work /etc/fstab must contain
#	an entry like this:
#
#       /dev/scd0   /cdrom  iso9660 defaults,noauto,ro,user   0 0
#
# The CD-ROM gets unmounted automatically after the connection to the
#
# If you don't want to use auto-mounting/unmounting make sure the CD
#	is mounted on /cdrom
#
;   preexec = /bin/mount /cdrom
;   postexec = /bin/umount /cdrom";}i:2;i:11946;}i:77;a:3:{i:0;s:13:"section_close";i:1;a:0:{}i:2;i:12431;}i:78;a:3:{i:0;s:12:"document_end";i:1;a:0:{}i:2;i:12431;}}