a:47:{i:0;a:3:{i:0;s:14:"document_start";i:1;a:0:{}i:2;i:0;}i:1;a:3:{i:0;s:6:"p_open";i:1;a:0:{}i:2;i:0;}i:2;a:3:{i:0;s:5:"cdata";i:1;a:1:{i:0;s:12:"Ata 05/07/05";}i:2;i:1;}i:3;a:3:{i:0;s:7:"p_close";i:1;a:0:{}i:2;i:13;}i:4;a:3:{i:0;s:6:"p_open";i:1;a:0:{}i:2;i:13;}i:5;a:3:{i:0;s:5:"cdata";i:1;a:1:{i:0;s:139:"- Até a próxima reunião todos deverão fazer o planejamento trimestral - Quem não o fizer, perdeerá um ponto burocrático por reunião";}i:2;i:15;}i:6;a:3:{i:0;s:7:"p_close";i:1;a:0:{}i:2;i:154;}i:7;a:3:{i:0;s:6:"p_open";i:1;a:0:{}i:2;i:154;}i:8;a:3:{i:0;s:5:"cdata";i:1;a:1:{i:0;s:30:"- Faltas na última reunião:
";}i:2;i:156;}i:9;a:3:{i:0;s:7:"p_close";i:1;a:0:{}i:2;i:186;}i:10;a:3:{i:0;s:10:"quote_open";i:1;a:0:{}i:2;i:186;}i:11;a:3:{i:0;s:5:"cdata";i:1;a:1:{i:0;s:167:" Irigon faltou sem justificativa: perde 3 pontos Vinícius faltou por que tinha prova: perdeu 3 pontos Lilian, já que não estava na reunião hoje ainda tem chance de";}i:2;i:188;}i:12;a:3:{i:0;s:11:"quote_close";i:1;a:0:{}i:2;i:355;}i:13;a:3:{i:0;s:6:"p_open";i:1;a:0:{}i:2;i:355;}i:14;a:3:{i:0;s:5:"cdata";i:1;a:1:{i:0;s:11:"
justificar";}i:2;i:356;}i:15;a:3:{i:0;s:7:"p_close";i:1;a:0:{}i:2;i:367;}i:16;a:3:{i:0;s:6:"p_open";i:1;a:0:{}i:2;i:367;}i:17;a:3:{i:0;s:5:"cdata";i:1;a:1:{i:0;s:8:"- Rede:
";}i:2;i:369;}i:18;a:3:{i:0;s:7:"p_close";i:1;a:0:{}i:2;i:377;}i:19;a:3:{i:0;s:10:"quote_open";i:1;a:0:{}i:2;i:377;}i:20;a:3:{i:0;s:5:"cdata";i:1;a:1:{i:0;s:64:" Diego e Maurício ficarão aprendendo redes com o administrador";}i:2;i:379;}i:21;a:3:{i:0;s:11:"quote_close";i:1;a:0:{}i:2;i:443;}i:22;a:3:{i:0;s:6:"p_open";i:1;a:0:{}i:2;i:443;}i:23;a:3:{i:0;s:5:"cdata";i:1;a:1:{i:0;s:77:"
- Paulo mandará um mail para todos a respeito dos horários possíveis para";}i:2;i:444;}i:24;a:3:{i:0;s:7:"p_close";i:1;a:0:{}i:2;i:521;}i:25;a:3:{i:0;s:6:"p_open";i:1;a:0:{}i:2;i:521;}i:26;a:3:{i:0;s:5:"cdata";i:1;a:1:{i:0;s:38:"trocar o horário da próxima reunião";}i:2;i:523;}i:27;a:3:{i:0;s:7:"p_close";i:1;a:0:{}i:2;i:561;}i:28;a:3:{i:0;s:6:"p_open";i:1;a:0:{}i:2;i:561;}i:29;a:3:{i:0;s:5:"cdata";i:1;a:1:{i:0;s:55:"- Serão instalados linux e windows em todas máquinas.";}i:2;i:563;}i:30;a:3:{i:0;s:7:"p_close";i:1;a:0:{}i:2;i:618;}i:31;a:3:{i:0;s:6:"p_open";i:1;a:0:{}i:2;i:618;}i:32;a:3:{i:0;s:5:"cdata";i:1;a:1:{i:0;s:72:"- Máquina da presença foi consertada por Maurício, que trocou a pilha";}i:2;i:620;}i:33;a:3:{i:0;s:7:"p_close";i:1;a:0:{}i:2;i:692;}i:34;a:3:{i:0;s:6:"p_open";i:1;a:0:{}i:2;i:692;}i:35;a:3:{i:0;s:5:"cdata";i:1;a:1:{i:0;s:74:"- É pedido aos integrantes do grupo melhora na pontualidade das reuniões";}i:2;i:694;}i:36;a:3:{i:0;s:7:"p_close";i:1;a:0:{}i:2;i:768;}i:37;a:3:{i:0;s:6:"p_open";i:1;a:0:{}i:2;i:768;}i:38;a:3:{i:0;s:5:"cdata";i:1;a:1:{i:0;s:69:"- Diminuir as piadas e barulho nas reuniões levando-as mais a sério";}i:2;i:770;}i:39;a:3:{i:0;s:7:"p_close";i:1;a:0:{}i:2;i:839;}i:40;a:3:{i:0;s:6:"p_open";i:1;a:0:{}i:2;i:839;}i:41;a:3:{i:0;s:5:"cdata";i:1;a:1:{i:0;s:77:"- A divisão do dinheiro para o ENAPET será - a princípio - igualitária em";}i:2;i:841;}i:42;a:3:{i:0;s:7:"p_close";i:1;a:0:{}i:2;i:918;}i:43;a:3:{i:0;s:6:"p_open";i:1;a:0:{}i:2;i:918;}i:44;a:3:{i:0;s:5:"cdata";i:1;a:1:{i:0;s:76:"passagem e inscrição. Se sobrar dinheiro deverá cobrir também a estadia.";}i:2;i:920;}i:45;a:3:{i:0;s:7:"p_close";i:1;a:0:{}i:2;i:996;}i:46;a:3:{i:0;s:12:"document_end";i:1;a:0:{}i:2;i:996;}}