a:241:{i:0;a:3:{i:0;s:14:"document_start";i:1;a:0:{}i:2;i:0;}i:1;a:3:{i:0;s:6:"p_open";i:1;a:0:{}i:2;i:0;}i:2;a:3:{i:0;s:5:"cdata";i:1;a:1:{i:0;s:14:"ATA 10/05/2005";}i:2;i:1;}i:3;a:3:{i:0;s:7:"p_close";i:1;a:0:{}i:2;i:15;}i:4;a:3:{i:0;s:6:"p_open";i:1;a:0:{}i:2;i:15;}i:5;a:3:{i:0;s:5:"cdata";i:1;a:1:{i:0;s:123:"Presentes: Rubin, João, Nondillo, Robert, Paulo, Maurício, Mateus, Fabiano, Gustavo, Irigon, Lilian, Diego e Prof. Dante.";}i:2;i:17;}i:6;a:3:{i:0;s:7:"p_close";i:1;a:0:{}i:2;i:140;}i:7;a:3:{i:0;s:6:"p_open";i:1;a:0:{}i:2;i:140;}i:8;a:3:{i:0;s:5:"cdata";i:1;a:1:{i:0;s:18:"Relator: Maurício";}i:2;i:142;}i:9;a:3:{i:0;s:7:"p_close";i:1;a:0:{}i:2;i:160;}i:10;a:3:{i:0;s:6:"p_open";i:1;a:0:{}i:2;i:160;}i:11;a:3:{i:0;s:5:"cdata";i:1;a:1:{i:0;s:29:"1. Relatório de Atividades:
";}i:2;i:162;}i:12;a:3:{i:0;s:7:"p_close";i:1;a:0:{}i:2;i:191;}i:13;a:3:{i:0;s:10:"listu_open";i:1;a:0:{}i:2;i:191;}i:14;a:3:{i:0;s:13:"listitem_open";i:1;a:1:{i:0;i:1;}i:2;i:191;}i:15;a:3:{i:0;s:16:"listcontent_open";i:1;a:0:{}i:2;i:191;}i:16;a:3:{i:0;s:5:"cdata";i:1;a:1:{i:0;s:55:" Ficou decidido que não serão discutidos em reunião.";}i:2;i:195;}i:17;a:3:{i:0;s:17:"listcontent_close";i:1;a:0:{}i:2;i:250;}i:18;a:3:{i:0;s:14:"listitem_close";i:1;a:0:{}i:2;i:250;}i:19;a:3:{i:0;s:11:"listu_close";i:1;a:0:{}i:2;i:250;}i:20;a:3:{i:0;s:6:"p_open";i:1;a:0:{}i:2;i:250;}i:21;a:3:{i:0;s:5:"cdata";i:1;a:1:{i:0;s:30:"
2. Sobre o Último Interpet:
";}i:2;i:251;}i:22;a:3:{i:0;s:7:"p_close";i:1;a:0:{}i:2;i:281;}i:23;a:3:{i:0;s:10:"listu_open";i:1;a:0:{}i:2;i:281;}i:24;a:3:{i:0;s:13:"listitem_open";i:1;a:1:{i:0;i:1;}i:2;i:281;}i:25;a:3:{i:0;s:16:"listcontent_open";i:1;a:0:{}i:2;i:281;}i:26;a:3:{i:0;s:5:"cdata";i:1;a:1:{i:0;s:27:" Discussões sobre o Enapet";}i:2;i:285;}i:27;a:3:{i:0;s:17:"listcontent_close";i:1;a:0:{}i:2;i:312;}i:28;a:3:{i:0;s:14:"listitem_close";i:1;a:0:{}i:2;i:312;}i:29;a:3:{i:0;s:11:"listu_close";i:1;a:0:{}i:2;i:312;}i:30;a:3:{i:0;s:10:"listu_open";i:1;a:0:{}i:2;i:313;}i:31;a:3:{i:0;s:13:"listitem_open";i:1;a:1:{i:0;i:1;}i:2;i:313;}i:32;a:3:{i:0;s:16:"listcontent_open";i:1;a:0:{}i:2;i:313;}i:33;a:3:{i:0;s:5:"cdata";i:1;a:1:{i:0;s:39:" Meio de transporte mais cotado: avião";}i:2;i:317;}i:34;a:3:{i:0;s:17:"listcontent_close";i:1;a:0:{}i:2;i:356;}i:35;a:3:{i:0;s:14:"listitem_close";i:1;a:0:{}i:2;i:356;}i:36;a:3:{i:0;s:11:"listu_close";i:1;a:0:{}i:2;i:356;}i:37;a:3:{i:0;s:10:"listu_open";i:1;a:0:{}i:2;i:357;}i:38;a:3:{i:0;s:13:"listitem_open";i:1;a:1:{i:0;i:1;}i:2;i:357;}i:39;a:3:{i:0;s:16:"listcontent_open";i:1;a:0:{}i:2;i:357;}i:40;a:3:{i:0;s:5:"cdata";i:1;a:1:{i:0;s:411:" Arrecadação de recursos para o Enapet: não houve retorno dos ex-bolsistas sobre a devolução de bolsas; procurar auxílio dos institutos; recursos da reitoria, se conseguidos, serão divididos entre todos os PET's; recursos de cada instituto serão destinados aos respectivos PET's da unidade; ficou decidido que o PET Computação é a favor de dividir os recursos entre os petianos e não entre os PET's.";}i:2;i:361;}i:41;a:3:{i:0;s:17:"listcontent_close";i:1;a:0:{}i:2;i:772;}i:42;a:3:{i:0;s:14:"listitem_close";i:1;a:0:{}i:2;i:772;}i:43;a:3:{i:0;s:11:"listu_close";i:1;a:0:{}i:2;i:772;}i:44;a:3:{i:0;s:10:"listu_open";i:1;a:0:{}i:2;i:773;}i:45;a:3:{i:0;s:13:"listitem_open";i:1;a:1:{i:0;i:1;}i:2;i:773;}i:46;a:3:{i:0;s:16:"listcontent_open";i:1;a:0:{}i:2;i:773;}i:47;a:3:{i:0;s:5:"cdata";i:1;a:1:{i:0;s:65:" Próximo Interpet: Quarta-Feira, 18/05/05, 19:30, na Odontologia";}i:2;i:777;}i:48;a:3:{i:0;s:17:"listcontent_close";i:1;a:0:{}i:2;i:842;}i:49;a:3:{i:0;s:14:"listitem_close";i:1;a:0:{}i:2;i:842;}i:50;a:3:{i:0;s:11:"listu_close";i:1;a:0:{}i:2;i:842;}i:51;a:3:{i:0;s:10:"listu_open";i:1;a:0:{}i:2;i:843;}i:52;a:3:{i:0;s:13:"listitem_open";i:1;a:1:{i:0;i:1;}i:2;i:843;}i:53;a:3:{i:0;s:16:"listcontent_open";i:1;a:0:{}i:2;i:843;}i:54;a:3:{i:0;s:5:"cdata";i:1;a:1:{i:0;s:57:" Interpetão: discussões sobre o Sulpet e sobre o Enapet";}i:2;i:847;}i:55;a:3:{i:0;s:17:"listcontent_close";i:1;a:0:{}i:2;i:904;}i:56;a:3:{i:0;s:14:"listitem_close";i:1;a:0:{}i:2;i:904;}i:57;a:3:{i:0;s:11:"listu_close";i:1;a:0:{}i:2;i:904;}i:58;a:3:{i:0;s:10:"listu_open";i:1;a:0:{}i:2;i:905;}i:59;a:3:{i:0;s:13:"listitem_open";i:1;a:1:{i:0;i:1;}i:2;i:905;}i:60;a:3:{i:0;s:16:"listcontent_open";i:1;a:0:{}i:2;i:905;}i:61;a:3:{i:0;s:5:"cdata";i:1;a:1:{i:0;s:54:" Próximo Interpet: Diego, Irigon e Robert ficam de ir";}i:2;i:909;}i:62;a:3:{i:0;s:17:"listcontent_close";i:1;a:0:{}i:2;i:963;}i:63;a:3:{i:0;s:14:"listitem_close";i:1;a:0:{}i:2;i:963;}i:64;a:3:{i:0;s:11:"listu_close";i:1;a:0:{}i:2;i:963;}i:65;a:3:{i:0;s:6:"p_open";i:1;a:0:{}i:2;i:963;}i:66;a:3:{i:0;s:5:"cdata";i:1;a:1:{i:0;s:20:"
3. Novo SO do PET:
";}i:2;i:964;}i:67;a:3:{i:0;s:7:"p_close";i:1;a:0:{}i:2;i:984;}i:68;a:3:{i:0;s:10:"listu_open";i:1;a:0:{}i:2;i:984;}i:69;a:3:{i:0;s:13:"listitem_open";i:1;a:1:{i:0;i:1;}i:2;i:984;}i:70;a:3:{i:0;s:16:"listcontent_open";i:1;a:0:{}i:2;i:984;}i:71;a:3:{i:0;s:5:"cdata";i:1;a:1:{i:0;s:36:" Nondillo quer se engajar no projeto";}i:2;i:988;}i:72;a:3:{i:0;s:17:"listcontent_close";i:1;a:0:{}i:2;i:1024;}i:73;a:3:{i:0;s:14:"listitem_close";i:1;a:0:{}i:2;i:1024;}i:74;a:3:{i:0;s:11:"listu_close";i:1;a:0:{}i:2;i:1024;}i:75;a:3:{i:0;s:6:"p_open";i:1;a:0:{}i:2;i:1024;}i:76;a:3:{i:0;s:5:"cdata";i:1;a:1:{i:0;s:32:"
4. PET Fórum: Administração
";}i:2;i:1025;}i:77;a:3:{i:0;s:7:"p_close";i:1;a:0:{}i:2;i:1057;}i:78;a:3:{i:0;s:10:"listu_open";i:1;a:0:{}i:2;i:1057;}i:79;a:3:{i:0;s:13:"listitem_open";i:1;a:1:{i:0;i:1;}i:2;i:1057;}i:80;a:3:{i:0;s:16:"listcontent_open";i:1;a:0:{}i:2;i:1057;}i:81;a:3:{i:0;s:5:"cdata";i:1;a:1:{i:0;s:43:" Diego e Gustavo ficam como administradores";}i:2;i:1061;}i:82;a:3:{i:0;s:17:"listcontent_close";i:1;a:0:{}i:2;i:1104;}i:83;a:3:{i:0;s:14:"listitem_close";i:1;a:0:{}i:2;i:1104;}i:84;a:3:{i:0;s:11:"listu_close";i:1;a:0:{}i:2;i:1104;}i:85;a:3:{i:0;s:6:"p_open";i:1;a:0:{}i:2;i:1104;}i:86;a:3:{i:0;s:5:"cdata";i:1;a:1:{i:0;s:13:"
5. ROBOPET:
";}i:2;i:1105;}i:87;a:3:{i:0;s:7:"p_close";i:1;a:0:{}i:2;i:1118;}i:88;a:3:{i:0;s:10:"listu_open";i:1;a:0:{}i:2;i:1118;}i:89;a:3:{i:0;s:13:"listitem_open";i:1;a:1:{i:0;i:1;}i:2;i:1118;}i:90;a:3:{i:0;s:16:"listcontent_open";i:1;a:0:{}i:2;i:1118;}i:91;a:3:{i:0;s:5:"cdata";i:1;a:1:{i:0;s:65:" Interagir com Itamir para conhecimento do projeto (bafo-na-nuca)";}i:2;i:1122;}i:92;a:3:{i:0;s:17:"listcontent_close";i:1;a:0:{}i:2;i:1187;}i:93;a:3:{i:0;s:14:"listitem_close";i:1;a:0:{}i:2;i:1187;}i:94;a:3:{i:0;s:11:"listu_close";i:1;a:0:{}i:2;i:1187;}i:95;a:3:{i:0;s:10:"listu_open";i:1;a:0:{}i:2;i:1188;}i:96;a:3:{i:0;s:13:"listitem_open";i:1;a:1:{i:0;i:1;}i:2;i:1188;}i:97;a:3:{i:0;s:16:"listcontent_open";i:1;a:0:{}i:2;i:1188;}i:98;a:3:{i:0;s:5:"cdata";i:1;a:1:{i:0;s:65:" Comprar pistola de cola quente para consertar motor do Robô (?)";}i:2;i:1192;}i:99;a:3:{i:0;s:17:"listcontent_close";i:1;a:0:{}i:2;i:1257;}i:100;a:3:{i:0;s:14:"listitem_close";i:1;a:0:{}i:2;i:1257;}i:101;a:3:{i:0;s:11:"listu_close";i:1;a:0:{}i:2;i:1257;}i:102;a:3:{i:0;s:10:"listu_open";i:1;a:0:{}i:2;i:1258;}i:103;a:3:{i:0;s:13:"listitem_open";i:1;a:1:{i:0;i:1;}i:2;i:1258;}i:104;a:3:{i:0;s:16:"listcontent_open";i:1;a:0:{}i:2;i:1258;}i:105;a:3:{i:0;s:5:"cdata";i:1;a:1:{i:0;s:59:" No portas abertas apenas Joystick para controlar os robôs";}i:2;i:1262;}i:106;a:3:{i:0;s:17:"listcontent_close";i:1;a:0:{}i:2;i:1321;}i:107;a:3:{i:0;s:14:"listitem_close";i:1;a:0:{}i:2;i:1321;}i:108;a:3:{i:0;s:11:"listu_close";i:1;a:0:{}i:2;i:1321;}i:109;a:3:{i:0;s:10:"listu_open";i:1;a:0:{}i:2;i:1322;}i:110;a:3:{i:0;s:13:"listitem_open";i:1;a:1:{i:0;i:1;}i:2;i:1322;}i:111;a:3:{i:0;s:16:"listcontent_open";i:1;a:0:{}i:2;i:1322;}i:112;a:3:{i:0;s:5:"cdata";i:1;a:1:{i:0;s:59:" Discutir como aplicar a verba de R$5000,00 já disponível";}i:2;i:1326;}i:113;a:3:{i:0;s:17:"listcontent_close";i:1;a:0:{}i:2;i:1385;}i:114;a:3:{i:0;s:14:"listitem_close";i:1;a:0:{}i:2;i:1385;}i:115;a:3:{i:0;s:11:"listu_close";i:1;a:0:{}i:2;i:1385;}i:116;a:3:{i:0;s:6:"p_open";i:1;a:0:{}i:2;i:1385;}i:117;a:3:{i:0;s:5:"cdata";i:1;a:1:{i:0;s:41:"
6. Curso de Desenvolvimento de Equipes:
";}i:2;i:1386;}i:118;a:3:{i:0;s:7:"p_close";i:1;a:0:{}i:2;i:1427;}i:119;a:3:{i:0;s:10:"listu_open";i:1;a:0:{}i:2;i:1427;}i:120;a:3:{i:0;s:13:"listitem_open";i:1;a:1:{i:0;i:1;}i:2;i:1427;}i:121;a:3:{i:0;s:16:"listcontent_open";i:1;a:0:{}i:2;i:1427;}i:122;a:3:{i:0;s:5:"cdata";i:1;a:1:{i:0;s:48:" Datas: 14,15,16 de Junho. Hora: 18:00 às 22:00";}i:2;i:1431;}i:123;a:3:{i:0;s:17:"listcontent_close";i:1;a:0:{}i:2;i:1479;}i:124;a:3:{i:0;s:14:"listitem_close";i:1;a:0:{}i:2;i:1479;}i:125;a:3:{i:0;s:11:"listu_close";i:1;a:0:{}i:2;i:1479;}i:126;a:3:{i:0;s:6:"p_open";i:1;a:0:{}i:2;i:1479;}i:127;a:3:{i:0;s:5:"cdata";i:1;a:1:{i:0;s:16:"
7. Globaltech:
";}i:2;i:1480;}i:128;a:3:{i:0;s:7:"p_close";i:1;a:0:{}i:2;i:1496;}i:129;a:3:{i:0;s:10:"listu_open";i:1;a:0:{}i:2;i:1496;}i:130;a:3:{i:0;s:13:"listitem_open";i:1;a:1:{i:0;i:1;}i:2;i:1496;}i:131;a:3:{i:0;s:16:"listcontent_open";i:1;a:0:{}i:2;i:1496;}i:132;a:3:{i:0;s:5:"cdata";i:1;a:1:{i:0;s:51:" Jogos com Rio Grande 19/05 às 19:00,20:00 e 21:00";}i:2;i:1500;}i:133;a:3:{i:0;s:17:"listcontent_close";i:1;a:0:{}i:2;i:1551;}i:134;a:3:{i:0;s:14:"listitem_close";i:1;a:0:{}i:2;i:1551;}i:135;a:3:{i:0;s:11:"listu_close";i:1;a:0:{}i:2;i:1551;}i:136;a:3:{i:0;s:10:"listu_open";i:1;a:0:{}i:2;i:1552;}i:137;a:3:{i:0;s:13:"listitem_open";i:1;a:1:{i:0;i:1;}i:2;i:1552;}i:138;a:3:{i:0;s:16:"listcontent_open";i:1;a:0:{}i:2;i:1552;}i:139;a:3:{i:0;s:5:"cdata";i:1;a:1:{i:0;s:61:" Na quarta-feira, 18/05, times da Áustria estarão presentes";}i:2;i:1556;}i:140;a:3:{i:0;s:17:"listcontent_close";i:1;a:0:{}i:2;i:1617;}i:141;a:3:{i:0;s:14:"listitem_close";i:1;a:0:{}i:2;i:1617;}i:142;a:3:{i:0;s:11:"listu_close";i:1;a:0:{}i:2;i:1617;}i:143;a:3:{i:0;s:10:"listu_open";i:1;a:0:{}i:2;i:1618;}i:144;a:3:{i:0;s:13:"listitem_open";i:1;a:1:{i:0;i:1;}i:2;i:1618;}i:145;a:3:{i:0;s:16:"listcontent_open";i:1;a:0:{}i:2;i:1618;}i:146;a:3:{i:0;s:5:"cdata";i:1;a:1:{i:0;s:97:" Todos devem estar presentes e relatar o que acharam de mais interessante e de menos interessante";}i:2;i:1622;}i:147;a:3:{i:0;s:17:"listcontent_close";i:1;a:0:{}i:2;i:1719;}i:148;a:3:{i:0;s:14:"listitem_close";i:1;a:0:{}i:2;i:1719;}i:149;a:3:{i:0;s:11:"listu_close";i:1;a:0:{}i:2;i:1719;}i:150;a:3:{i:0;s:10:"listu_open";i:1;a:0:{}i:2;i:1720;}i:151;a:3:{i:0;s:13:"listitem_open";i:1;a:1:{i:0;i:1;}i:2;i:1720;}i:152;a:3:{i:0;s:16:"listcontent_open";i:1;a:0:{}i:2;i:1720;}i:153;a:3:{i:0;s:5:"cdata";i:1;a:1:{i:0;s:51:" Decidir como serão feitos os jogos com Rio Grande";}i:2;i:1724;}i:154;a:3:{i:0;s:17:"listcontent_close";i:1;a:0:{}i:2;i:1775;}i:155;a:3:{i:0;s:14:"listitem_close";i:1;a:0:{}i:2;i:1775;}i:156;a:3:{i:0;s:11:"listu_close";i:1;a:0:{}i:2;i:1775;}i:157;a:3:{i:0;s:6:"p_open";i:1;a:0:{}i:2;i:1775;}i:158;a:3:{i:0;s:5:"cdata";i:1;a:1:{i:0;s:35:"
8. Portas Abertas e Mostra UFRGS:
";}i:2;i:1776;}i:159;a:3:{i:0;s:7:"p_close";i:1;a:0:{}i:2;i:1811;}i:160;a:3:{i:0;s:10:"listu_open";i:1;a:0:{}i:2;i:1811;}i:161;a:3:{i:0;s:13:"listitem_open";i:1;a:1:{i:0;i:1;}i:2;i:1811;}i:162;a:3:{i:0;s:16:"listcontent_open";i:1;a:0:{}i:2;i:1811;}i:163;a:3:{i:0;s:5:"cdata";i:1;a:1:{i:0;s:92:" Todos devem participar e relatar o que acharam de mais interessante e de menos interessante";}i:2;i:1815;}i:164;a:3:{i:0;s:17:"listcontent_close";i:1;a:0:{}i:2;i:1907;}i:165;a:3:{i:0;s:14:"listitem_close";i:1;a:0:{}i:2;i:1907;}i:166;a:3:{i:0;s:11:"listu_close";i:1;a:0:{}i:2;i:1907;}i:167;a:3:{i:0;s:10:"listu_open";i:1;a:0:{}i:2;i:1908;}i:168;a:3:{i:0;s:13:"listitem_open";i:1;a:1:{i:0;i:1;}i:2;i:1908;}i:169;a:3:{i:0;s:16:"listcontent_open";i:1;a:0:{}i:2;i:1908;}i:170;a:3:{i:0;s:5:"cdata";i:1;a:1:{i:0;s:142:" Escalas sábado para Portas Abertas: De manhã: Lilian, Nondillo, Robert, Gustavo. De tarde: Maurício, Rubin, Mateus, Paulo, Fabiano, Irigon";}i:2;i:1912;}i:171;a:3:{i:0;s:17:"listcontent_close";i:1;a:0:{}i:2;i:2054;}i:172;a:3:{i:0;s:14:"listitem_close";i:1;a:0:{}i:2;i:2054;}i:173;a:3:{i:0;s:11:"listu_close";i:1;a:0:{}i:2;i:2054;}i:174;a:3:{i:0;s:10:"listu_open";i:1;a:0:{}i:2;i:2055;}i:175;a:3:{i:0;s:13:"listitem_open";i:1;a:1:{i:0;i:1;}i:2;i:2055;}i:176;a:3:{i:0;s:16:"listcontent_open";i:1;a:0:{}i:2;i:2055;}i:177;a:3:{i:0;s:5:"cdata";i:1;a:1:{i:0;s:51:" Diego e Paulo presentes na Mostra UFRGS no sábado";}i:2;i:2059;}i:178;a:3:{i:0;s:17:"listcontent_close";i:1;a:0:{}i:2;i:2110;}i:179;a:3:{i:0;s:14:"listitem_close";i:1;a:0:{}i:2;i:2110;}i:180;a:3:{i:0;s:11:"listu_close";i:1;a:0:{}i:2;i:2110;}i:181;a:3:{i:0;s:10:"listu_open";i:1;a:0:{}i:2;i:2111;}i:182;a:3:{i:0;s:13:"listitem_open";i:1;a:1:{i:0;i:1;}i:2;i:2111;}i:183;a:3:{i:0;s:16:"listcontent_open";i:1;a:0:{}i:2;i:2111;}i:184;a:3:{i:0;s:5:"cdata";i:1;a:1:{i:0;s:47:" Levar os vídeos de Portugal no Portas Abertas";}i:2;i:2115;}i:185;a:3:{i:0;s:17:"listcontent_close";i:1;a:0:{}i:2;i:2162;}i:186;a:3:{i:0;s:14:"listitem_close";i:1;a:0:{}i:2;i:2162;}i:187;a:3:{i:0;s:11:"listu_close";i:1;a:0:{}i:2;i:2162;}i:188;a:3:{i:0;s:6:"p_open";i:1;a:0:{}i:2;i:2162;}i:189;a:3:{i:0;s:5:"cdata";i:1;a:1:{i:0;s:21:"
9. Outros Tópicos:
";}i:2;i:2163;}i:190;a:3:{i:0;s:7:"p_close";i:1;a:0:{}i:2;i:2184;}i:191;a:3:{i:0;s:10:"listu_open";i:1;a:0:{}i:2;i:2184;}i:192;a:3:{i:0;s:13:"listitem_open";i:1;a:1:{i:0;i:1;}i:2;i:2184;}i:193;a:3:{i:0;s:16:"listcontent_open";i:1;a:0:{}i:2;i:2184;}i:194;a:3:{i:0;s:5:"cdata";i:1;a:1:{i:0;s:103:" Verba da PROGRAD que sobrou: pagar despesas dos petianos no Sulpet e o que sobrar fica no caixa do PET";}i:2;i:2188;}i:195;a:3:{i:0;s:17:"listcontent_close";i:1;a:0:{}i:2;i:2291;}i:196;a:3:{i:0;s:14:"listitem_close";i:1;a:0:{}i:2;i:2291;}i:197;a:3:{i:0;s:11:"listu_close";i:1;a:0:{}i:2;i:2291;}i:198;a:3:{i:0;s:10:"listu_open";i:1;a:0:{}i:2;i:2292;}i:199;a:3:{i:0;s:13:"listitem_open";i:1;a:1:{i:0;i:1;}i:2;i:2292;}i:200;a:3:{i:0;s:16:"listcontent_open";i:1;a:0:{}i:2;i:2292;}i:201;a:3:{i:0;s:5:"cdata";i:1;a:1:{i:0;s:45:" Projeto Robótica na Educação em andamento";}i:2;i:2296;}i:202;a:3:{i:0;s:17:"listcontent_close";i:1;a:0:{}i:2;i:2341;}i:203;a:3:{i:0;s:14:"listitem_close";i:1;a:0:{}i:2;i:2341;}i:204;a:3:{i:0;s:11:"listu_close";i:1;a:0:{}i:2;i:2341;}i:205;a:3:{i:0;s:10:"listu_open";i:1;a:0:{}i:2;i:2342;}i:206;a:3:{i:0;s:13:"listitem_open";i:1;a:1:{i:0;i:1;}i:2;i:2342;}i:207;a:3:{i:0;s:16:"listcontent_open";i:1;a:0:{}i:2;i:2342;}i:208;a:3:{i:0;s:5:"cdata";i:1;a:1:{i:0;s:79:" Pontos burocráticos para Gustavo e Lilian: participação em reuniões do CLA";}i:2;i:2346;}i:209;a:3:{i:0;s:17:"listcontent_close";i:1;a:0:{}i:2;i:2425;}i:210;a:3:{i:0;s:14:"listitem_close";i:1;a:0:{}i:2;i:2425;}i:211;a:3:{i:0;s:11:"listu_close";i:1;a:0:{}i:2;i:2425;}i:212;a:3:{i:0;s:10:"listu_open";i:1;a:0:{}i:2;i:2426;}i:213;a:3:{i:0;s:13:"listitem_open";i:1;a:1:{i:0;i:1;}i:2;i:2426;}i:214;a:3:{i:0;s:16:"listcontent_open";i:1;a:0:{}i:2;i:2426;}i:215;a:3:{i:0;s:5:"cdata";i:1;a:1:{i:0;s:38:" Editar livro com histórico dos PET's";}i:2;i:2430;}i:216;a:3:{i:0;s:17:"listcontent_close";i:1;a:0:{}i:2;i:2468;}i:217;a:3:{i:0;s:14:"listitem_close";i:1;a:0:{}i:2;i:2468;}i:218;a:3:{i:0;s:11:"listu_close";i:1;a:0:{}i:2;i:2468;}i:219;a:3:{i:0;s:10:"listu_open";i:1;a:0:{}i:2;i:2469;}i:220;a:3:{i:0;s:13:"listitem_open";i:1;a:1:{i:0;i:1;}i:2;i:2469;}i:221;a:3:{i:0;s:16:"listcontent_open";i:1;a:0:{}i:2;i:2469;}i:222;a:3:{i:0;s:5:"cdata";i:1;a:1:{i:0;s:84:" Teatro e outras atividades para melhorar o desempenho em comunicação dos petianos";}i:2;i:2473;}i:223;a:3:{i:0;s:17:"listcontent_close";i:1;a:0:{}i:2;i:2557;}i:224;a:3:{i:0;s:14:"listitem_close";i:1;a:0:{}i:2;i:2557;}i:225;a:3:{i:0;s:11:"listu_close";i:1;a:0:{}i:2;i:2557;}i:226;a:3:{i:0;s:10:"listu_open";i:1;a:0:{}i:2;i:2558;}i:227;a:3:{i:0;s:13:"listitem_open";i:1;a:1:{i:0;i:1;}i:2;i:2558;}i:228;a:3:{i:0;s:16:"listcontent_open";i:1;a:0:{}i:2;i:2558;}i:229;a:3:{i:0;s:5:"cdata";i:1;a:1:{i:0;s:48:" Todos devem ler o Manual do Pet no mês de maio";}i:2;i:2562;}i:230;a:3:{i:0;s:17:"listcontent_close";i:1;a:0:{}i:2;i:2610;}i:231;a:3:{i:0;s:14:"listitem_close";i:1;a:0:{}i:2;i:2610;}i:232;a:3:{i:0;s:11:"listu_close";i:1;a:0:{}i:2;i:2610;}i:233;a:3:{i:0;s:10:"listu_open";i:1;a:0:{}i:2;i:2611;}i:234;a:3:{i:0;s:13:"listitem_open";i:1;a:1:{i:0;i:1;}i:2;i:2611;}i:235;a:3:{i:0;s:16:"listcontent_open";i:1;a:0:{}i:2;i:2611;}i:236;a:3:{i:0;s:5:"cdata";i:1;a:1:{i:0;s:45:" Projeto Integrado: página de todos os PET's";}i:2;i:2615;}i:237;a:3:{i:0;s:17:"listcontent_close";i:1;a:0:{}i:2;i:2660;}i:238;a:3:{i:0;s:14:"listitem_close";i:1;a:0:{}i:2;i:2660;}i:239;a:3:{i:0;s:11:"listu_close";i:1;a:0:{}i:2;i:2660;}i:240;a:3:{i:0;s:12:"document_end";i:1;a:0:{}i:2;i:2660;}}