====== Pontos de Falta ======

| Antônio | 1 |
| Bruno | 0 |
| Bruno G | 0 |
| Bruno J. | 0 |
| Cassiana | 0 |
| Fábio | 0 |
| Felipe | 0 |
| Gabriel | 0 |
| Kauê | 0 |
| Leonardo | 0 |
| Lucas F. | 1 |
| Marcos | 1 |
| Matheus | 0 |
| Matheus P. | 0 |
| Tyron | 0 |
