a:166:{i:0;a:3:{i:0;s:14:"document_start";i:1;a:0:{}i:2;i:0;}i:1;a:3:{i:0;s:6:"p_open";i:1;a:0:{}i:2;i:0;}i:2;a:3:{i:0;s:7:"p_close";i:1;a:0:{}i:2;i:1;}i:3;a:3:{i:0;s:12:"section_edit";i:1;a:4:{i:0;i:-1;i:1;i:0;i:2;i:1;i:3;s:0:"";}i:2;i:1;}i:4;a:3:{i:0;s:6:"header";i:1;a:3:{i:0;s:29:"Ata da reunião de 14/06/2006";i:1;i:2;i:2;i:1;}i:2;i:1;}i:5;a:3:{i:0;s:12:"section_open";i:1;a:1:{i:0;i:2;}i:2;i:1;}i:6;a:3:{i:0;s:6:"p_open";i:1;a:0:{}i:2;i:42;}i:7;a:3:{i:0;s:5:"cdata";i:1;a:1:{i:0;s:151:"
Presentes: Alexandre, Dante, Estevão, Fabiano, Felipe, Gabriela, Lucas Cavalheiro, Lucas Mizusaki, Marcelo, Marcos, Nondillo, Pablo, Ricardo e Thiago";}i:2;i:43;}i:8;a:3:{i:0;s:7:"p_close";i:1;a:0:{}i:2;i:194;}i:9;a:3:{i:0;s:6:"p_open";i:1;a:0:{}i:2;i:194;}i:10;a:3:{i:0;s:5:"cdata";i:1;a:1:{i:0;s:24:"Relator: Alexandre Capra";}i:2;i:196;}i:11;a:3:{i:0;s:7:"p_close";i:1;a:0:{}i:2;i:220;}i:12;a:3:{i:0;s:13:"section_close";i:1;a:0:{}i:2;i:222;}i:13;a:3:{i:0;s:12:"section_edit";i:1;a:4:{i:0;i:1;i:1;i:221;i:2;i:2;i:3;s:29:"Ata da reunião de 14/06/2006";}i:2;i:222;}i:14;a:3:{i:0;s:6:"header";i:1;a:3:{i:0;s:20:"1)Visita ao TecnoPUC";i:1;i:2;i:2;i:222;}i:2;i:222;}i:15;a:3:{i:0;s:12:"section_open";i:1;a:1:{i:0;i:2;}i:2;i:222;}i:16;a:3:{i:0;s:6:"p_open";i:1;a:0:{}i:2;i:254;}i:17;a:3:{i:0;s:5:"cdata";i:1;a:1:{i:0;s:165:"
A princípio marcada para o dia 11/07 às 9h, porém não há disponibilidade da maioria dos petianos neste dia. Pablo vai negociar para que fique dia 14/07 às 9h.";}i:2;i:255;}i:18;a:3:{i:0;s:7:"p_close";i:1;a:0:{}i:2;i:420;}i:19;a:3:{i:0;s:13:"section_close";i:1;a:0:{}i:2;i:422;}i:20;a:3:{i:0;s:12:"section_edit";i:1;a:4:{i:0;i:222;i:1;i:421;i:2;i:2;i:3;s:20:"1)Visita ao TecnoPUC";}i:2;i:422;}i:21;a:3:{i:0;s:6:"header";i:1;a:3:{i:0;s:24:"2)Interpetão do Sábado";i:1;i:2;i:2;i:422;}i:2;i:422;}i:22;a:3:{i:0;s:12:"section_open";i:1;a:1:{i:0;i:2;}i:2;i:422;}i:23;a:3:{i:0;s:6:"p_open";i:1;a:0:{}i:2;i:458;}i:24;a:3:{i:0;s:5:"cdata";i:1;a:1:{i:0;s:76:"
Próximo interpet foi marcado para dia 01/07 as 9h na Civil, pauta: ENAPET.";}i:2;i:459;}i:25;a:3:{i:0;s:7:"p_close";i:1;a:0:{}i:2;i:535;}i:26;a:3:{i:0;s:6:"p_open";i:1;a:0:{}i:2;i:535;}i:27;a:3:{i:0;s:5:"cdata";i:1;a:1:{i:0;s:121:"[Dante e Nondillo comentam da Comissão Estudantil, que possui 5 cargos, e sobre o Conselho, que possui outros 10 cargos]";}i:2;i:537;}i:28;a:3:{i:0;s:7:"p_close";i:1;a:0:{}i:2;i:658;}i:29;a:3:{i:0;s:6:"p_open";i:1;a:0:{}i:2;i:658;}i:30;a:3:{i:0;s:5:"cdata";i:1;a:1:{i:0;s:402:"Fabiano: gostou dos objetivos propostos pelo tutor da Civil; e também da divisão em subgrupos. Cavalheiro: acha boa a idéia de começar a divulgar mais os eventos para os bichos da computação, para que estes criem mais o costume de participar de eventos. Fabiano: estágios remunerados, pode? Dante acredita que se for de outra instituição, pode; e relata que a Iguatemi também disse que podia.";}i:2;i:660;}i:31;a:3:{i:0;s:7:"p_close";i:1;a:0:{}i:2;i:1062;}i:32;a:3:{i:0;s:13:"section_close";i:1;a:0:{}i:2;i:1064;}i:33;a:3:{i:0;s:12:"section_edit";i:1;a:4:{i:0;i:422;i:1;i:1063;i:2;i:2;i:3;s:24:"2)Interpetão do Sábado";}i:2;i:1064;}i:34;a:3:{i:0;s:6:"header";i:1;a:3:{i:0;s:18:"3)Ciclo de Debates";i:1;i:2;i:2;i:1064;}i:2;i:1064;}i:35;a:3:{i:0;s:12:"section_open";i:1;a:1:{i:0;i:2;}i:2;i:1064;}i:36;a:3:{i:0;s:10:"listu_open";i:1;a:0:{}i:2;i:1095;}i:37;a:3:{i:0;s:13:"listitem_open";i:1;a:1:{i:0;i:1;}i:2;i:1095;}i:38;a:3:{i:0;s:16:"listcontent_open";i:1;a:0:{}i:2;i:1095;}i:39;a:3:{i:0;s:5:"cdata";i:1;a:1:{i:0;s:617:" Currículo ECP: Todos que foram concordam que foi realmente bom e que valeu a pena. Fabiano mostra os pontos debatidos no Ciclo e pede para os que estiveram presentes que revisem para que seja mandado para a lista. Cavalheiro sugere juntar ao documento a avaliação das cadeiras feita pelos alunos. Dante sugere falar com a Maria Zaida do DECORD. Thiago diz que o Ciclo deveria ser regularizado. Fabiano comenta da possibilidade de se fazer uma semana acadêmica da Computação. É sugerido incluir a lista de participantes do Ciclo. Dante comenta que essa discussão deve ser levada até o Diretor e Vice eleitos.";}i:2;i:1099;}i:40;a:3:{i:0;s:17:"listcontent_close";i:1;a:0:{}i:2;i:1716;}i:41;a:3:{i:0;s:14:"listitem_close";i:1;a:0:{}i:2;i:1716;}i:42;a:3:{i:0;s:11:"listu_close";i:1;a:0:{}i:2;i:1716;}i:43;a:3:{i:0;s:10:"listu_open";i:1;a:0:{}i:2;i:1717;}i:44;a:3:{i:0;s:13:"listitem_open";i:1;a:1:{i:0;i:1;}i:2;i:1717;}i:45;a:3:{i:0;s:16:"listcontent_open";i:1;a:0:{}i:2;i:1717;}i:46;a:3:{i:0;s:5:"cdata";i:1;a:1:{i:0;s:192:" Currículo CIC: Reunião da Coninf é no mesmo dia (23/06), então Weber, Álvaro e Palazzo não poderiam participar do Ciclo. Idéia sugerida: remarcar para 22/06, quinta-feira às 15h30min.";}i:2;i:1721;}i:47;a:3:{i:0;s:17:"listcontent_close";i:1;a:0:{}i:2;i:1913;}i:48;a:3:{i:0;s:14:"listitem_close";i:1;a:0:{}i:2;i:1913;}i:49;a:3:{i:0;s:11:"listu_close";i:1;a:0:{}i:2;i:1913;}i:50;a:3:{i:0;s:13:"section_close";i:1;a:0:{}i:2;i:1915;}i:51;a:3:{i:0;s:12:"section_edit";i:1;a:4:{i:0;i:1064;i:1;i:1914;i:2;i:2;i:3;s:18:"3)Ciclo de Debates";}i:2;i:1915;}i:52;a:3:{i:0;s:6:"header";i:1;a:3:{i:0;s:8:"4)ENAPET";i:1;i:2;i:2;i:1915;}i:2;i:1915;}i:53;a:3:{i:0;s:12:"section_open";i:1;a:1:{i:0;i:2;}i:2;i:1915;}i:54;a:3:{i:0;s:6:"p_open";i:1;a:0:{}i:2;i:1935;}i:55;a:3:{i:0;s:5:"cdata";i:1;a:1:{i:0;s:68:"
Pagamento de 50% do ônibus -&gt; caixa do PET faz a trasferência.";}i:2;i:1936;}i:56;a:3:{i:0;s:7:"p_close";i:1;a:0:{}i:2;i:2004;}i:57;a:3:{i:0;s:13:"section_close";i:1;a:0:{}i:2;i:2006;}i:58;a:3:{i:0;s:12:"section_edit";i:1;a:4:{i:0;i:1915;i:1;i:2005;i:2;i:2;i:3;s:8:"4)ENAPET";}i:2;i:2006;}i:59;a:3:{i:0;s:6:"header";i:1;a:3:{i:0;s:25:"5)Atividades de Extensão";i:1;i:2;i:2;i:2006;}i:2;i:2006;}i:60;a:3:{i:0;s:12:"section_open";i:1;a:1:{i:0;i:2;}i:2;i:2006;}i:61;a:3:{i:0;s:10:"listu_open";i:1;a:0:{}i:2;i:2044;}i:62;a:3:{i:0;s:13:"listitem_open";i:1;a:1:{i:0;i:1;}i:2;i:2044;}i:63;a:3:{i:0;s:16:"listcontent_open";i:1;a:0:{}i:2;i:2044;}i:64;a:3:{i:0;s:5:"cdata";i:1;a:1:{i:0;s:59:" Mandar e-mails avisando que os comrovantes estão prontos.";}i:2;i:2048;}i:65;a:3:{i:0;s:17:"listcontent_close";i:1;a:0:{}i:2;i:2107;}i:66;a:3:{i:0;s:14:"listitem_close";i:1;a:0:{}i:2;i:2107;}i:67;a:3:{i:0;s:13:"listitem_open";i:1;a:1:{i:0;i:1;}i:2;i:2107;}i:68;a:3:{i:0;s:16:"listcontent_open";i:1;a:0:{}i:2;i:2107;}i:69;a:3:{i:0;s:5:"cdata";i:1;a:1:{i:0;s:74:" Curso de Java: refazer o relatório -&gt; Estevão e Thiago encarregados.";}i:2;i:2111;}i:70;a:3:{i:0;s:17:"listcontent_close";i:1;a:0:{}i:2;i:2185;}i:71;a:3:{i:0;s:14:"listitem_close";i:1;a:0:{}i:2;i:2185;}i:72;a:3:{i:0;s:13:"listitem_open";i:1;a:1:{i:0;i:1;}i:2;i:2185;}i:73;a:3:{i:0;s:16:"listcontent_open";i:1;a:0:{}i:2;i:2185;}i:74;a:3:{i:0;s:5:"cdata";i:1;a:1:{i:0;s:10:" Curso de ";}i:2;i:2189;}i:75;a:3:{i:0;s:7:"acronym";i:1;a:1:{i:0;s:4:"HTML";}i:2;i:2199;}i:76;a:3:{i:0;s:5:"cdata";i:1;a:1:{i:0;s:69:": Thiago e Pablo irão ministrar as aulas, que terão introdução a ";}i:2;i:2203;}i:77;a:3:{i:0;s:7:"acronym";i:1;a:1:{i:0;s:3:"PHP";}i:2;i:2272;}i:78;a:3:{i:0;s:5:"cdata";i:1;a:1:{i:0;s:1:".";}i:2;i:2275;}i:79;a:3:{i:0;s:17:"listcontent_close";i:1;a:0:{}i:2;i:2276;}i:80;a:3:{i:0;s:14:"listitem_close";i:1;a:0:{}i:2;i:2276;}i:81;a:3:{i:0;s:13:"listitem_open";i:1;a:1:{i:0;i:1;}i:2;i:2276;}i:82;a:3:{i:0;s:16:"listcontent_open";i:1;a:0:{}i:2;i:2276;}i:83;a:3:{i:0;s:5:"cdata";i:1;a:1:{i:0;s:169:" Curso de Linux: Thiago relata que Sérgio disse que a procura seria de cerca de 100 pessoas; Sérgio que deve conseguir um laboratório , caso não consiga será no II.";}i:2;i:2280;}i:84;a:3:{i:0;s:17:"listcontent_close";i:1;a:0:{}i:2;i:2449;}i:85;a:3:{i:0;s:14:"listitem_close";i:1;a:0:{}i:2;i:2449;}i:86;a:3:{i:0;s:13:"listitem_open";i:1;a:1:{i:0;i:1;}i:2;i:2449;}i:87;a:3:{i:0;s:16:"listcontent_open";i:1;a:0:{}i:2;i:2449;}i:88;a:3:{i:0;s:5:"cdata";i:1;a:1:{i:0;s:91:" Pablo, Thiago e Marcus: Subcomissão para planejar e organizar as atividades de extensão.";}i:2;i:2453;}i:89;a:3:{i:0;s:17:"listcontent_close";i:1;a:0:{}i:2;i:2544;}i:90;a:3:{i:0;s:14:"listitem_close";i:1;a:0:{}i:2;i:2544;}i:91;a:3:{i:0;s:13:"listitem_open";i:1;a:1:{i:0;i:1;}i:2;i:2544;}i:92;a:3:{i:0;s:16:"listcontent_open";i:1;a:0:{}i:2;i:2544;}i:93;a:3:{i:0;s:5:"cdata";i:1;a:1:{i:0;s:75:" Registrar o Museu e o Ciclo(principalmente!) como atividades de extensão.";}i:2;i:2548;}i:94;a:3:{i:0;s:17:"listcontent_close";i:1;a:0:{}i:2;i:2623;}i:95;a:3:{i:0;s:14:"listitem_close";i:1;a:0:{}i:2;i:2623;}i:96;a:3:{i:0;s:13:"listitem_open";i:1;a:1:{i:0;i:1;}i:2;i:2623;}i:97;a:3:{i:0;s:16:"listcontent_open";i:1;a:0:{}i:2;i:2623;}i:98;a:3:{i:0;s:5:"cdata";i:1;a:1:{i:0;s:77:" Thiago e Pablo e devem se encontrar com Dante na sala dele dia 21/06 as 16h.";}i:2;i:2627;}i:99;a:3:{i:0;s:17:"listcontent_close";i:1;a:0:{}i:2;i:2704;}i:100;a:3:{i:0;s:14:"listitem_close";i:1;a:0:{}i:2;i:2704;}i:101;a:3:{i:0;s:13:"listitem_open";i:1;a:1:{i:0;i:1;}i:2;i:2704;}i:102;a:3:{i:0;s:16:"listcontent_open";i:1;a:0:{}i:2;i:2704;}i:103;a:3:{i:0;s:5:"cdata";i:1;a:1:{i:0;s:32:" Kaizen: para próxima reunião.";}i:2;i:2708;}i:104;a:3:{i:0;s:17:"listcontent_close";i:1;a:0:{}i:2;i:2740;}i:105;a:3:{i:0;s:14:"listitem_close";i:1;a:0:{}i:2;i:2740;}i:106;a:3:{i:0;s:13:"listitem_open";i:1;a:1:{i:0;i:1;}i:2;i:2740;}i:107;a:3:{i:0;s:16:"listcontent_open";i:1;a:0:{}i:2;i:2740;}i:108;a:3:{i:0;s:5:"cdata";i:1;a:1:{i:0;s:161:" Semana Nacional de Ciência e Tecnologia (16 a 23 de Outubro): divulgar o museu? ciclo de cinema de ficção científica? Robopet? -&gt; para próxima reunião.";}i:2;i:2744;}i:109;a:3:{i:0;s:17:"listcontent_close";i:1;a:0:{}i:2;i:2905;}i:110;a:3:{i:0;s:14:"listitem_close";i:1;a:0:{}i:2;i:2905;}i:111;a:3:{i:0;s:11:"listu_close";i:1;a:0:{}i:2;i:2905;}i:112;a:3:{i:0;s:13:"section_close";i:1;a:0:{}i:2;i:2907;}i:113;a:3:{i:0;s:12:"section_edit";i:1;a:4:{i:0;i:2006;i:1;i:2906;i:2;i:2;i:3;s:25:"5)Atividades de Extensão";}i:2;i:2907;}i:114;a:3:{i:0;s:6:"header";i:1;a:3:{i:0;s:27:"6)Envolvimento com Projetos";i:1;i:2;i:2;i:2907;}i:2;i:2907;}i:115;a:3:{i:0;s:12:"section_open";i:1;a:1:{i:0;i:2;}i:2;i:2907;}i:116;a:3:{i:0;s:10:"listu_open";i:1;a:0:{}i:2;i:2947;}i:117;a:3:{i:0;s:13:"listitem_open";i:1;a:1:{i:0;i:1;}i:2;i:2947;}i:118;a:3:{i:0;s:16:"listcontent_open";i:1;a:0:{}i:2;i:2947;}i:119;a:3:{i:0;s:5:"cdata";i:1;a:1:{i:0;s:67:" P2PSE: reunião dia 20/06 às 17h. Thiago pode ir, depois das 18h.";}i:2;i:2951;}i:120;a:3:{i:0;s:17:"listcontent_close";i:1;a:0:{}i:2;i:3018;}i:121;a:3:{i:0;s:14:"listitem_close";i:1;a:0:{}i:2;i:3018;}i:122;a:3:{i:0;s:13:"listitem_open";i:1;a:1:{i:0;i:1;}i:2;i:3018;}i:123;a:3:{i:0;s:16:"listcontent_open";i:1;a:0:{}i:2;i:3018;}i:124;a:3:{i:0;s:5:"cdata";i:1;a:1:{i:0;s:166:" Parceria com a Psico: inclusão social para pessoas com problemas psiquiátricos: necessitam aparentemente de consultoria técnica, esperar eles entrarem em contato.";}i:2;i:3022;}i:125;a:3:{i:0;s:17:"listcontent_close";i:1;a:0:{}i:2;i:3188;}i:126;a:3:{i:0;s:14:"listitem_close";i:1;a:0:{}i:2;i:3188;}i:127;a:3:{i:0;s:11:"listu_close";i:1;a:0:{}i:2;i:3188;}i:128;a:3:{i:0;s:13:"section_close";i:1;a:0:{}i:2;i:3190;}i:129;a:3:{i:0;s:12:"section_edit";i:1;a:4:{i:0;i:2907;i:1;i:3189;i:2;i:2;i:3;s:27:"6)Envolvimento com Projetos";}i:2;i:3190;}i:130;a:3:{i:0;s:6:"header";i:1;a:3:{i:0;s:32:"7)Cooperação Brasil-Austrália";i:1;i:2;i:2;i:3190;}i:2;i:3190;}i:131;a:3:{i:0;s:12:"section_open";i:1;a:1:{i:0;i:2;}i:2;i:3190;}i:132;a:3:{i:0;s:6:"p_open";i:1;a:0:{}i:2;i:3234;}i:133;a:3:{i:0;s:5:"cdata";i:1;a:1:{i:0;s:34:"
Flores irá conferir o documento.";}i:2;i:3235;}i:134;a:3:{i:0;s:7:"p_close";i:1;a:0:{}i:2;i:3269;}i:135;a:3:{i:0;s:13:"section_close";i:1;a:0:{}i:2;i:3271;}i:136;a:3:{i:0;s:12:"section_edit";i:1;a:4:{i:0;i:3190;i:1;i:3270;i:2;i:2;i:3;s:32:"7)Cooperação Brasil-Austrália";}i:2;i:3271;}i:137;a:3:{i:0;s:6:"header";i:1;a:3:{i:0;s:40:"8)Especificação de Notebook para P2PSE";i:1;i:2;i:2;i:3271;}i:2;i:3271;}i:138;a:3:{i:0;s:12:"section_open";i:1;a:1:{i:0;i:2;}i:2;i:3271;}i:139;a:3:{i:0;s:6:"p_open";i:1;a:0:{}i:2;i:3323;}i:140;a:3:{i:0;s:5:"cdata";i:1;a:1:{i:0;s:32:"
Thiago e Zambiasi pesquisarão.";}i:2;i:3324;}i:141;a:3:{i:0;s:7:"p_close";i:1;a:0:{}i:2;i:3356;}i:142;a:3:{i:0;s:13:"section_close";i:1;a:0:{}i:2;i:3358;}i:143;a:3:{i:0;s:12:"section_edit";i:1;a:4:{i:0;i:3271;i:1;i:3357;i:2;i:2;i:3;s:40:"8)Especificação de Notebook para P2PSE";}i:2;i:3358;}i:144;a:3:{i:0;s:6:"header";i:1;a:3:{i:0;s:22:"9)Na próxima reunião";i:1;i:2;i:2;i:3358;}i:2;i:3358;}i:145;a:3:{i:0;s:12:"section_open";i:1;a:1:{i:0;i:2;}i:2;i:3358;}i:146;a:3:{i:0;s:6:"p_open";i:1;a:0:{}i:2;i:3392;}i:147;a:3:{i:0;s:5:"cdata";i:1;a:1:{i:0;s:34:"
Discutir o que deve ser comprado.";}i:2;i:3393;}i:148;a:3:{i:0;s:7:"p_close";i:1;a:0:{}i:2;i:3427;}i:149;a:3:{i:0;s:13:"section_close";i:1;a:0:{}i:2;i:3429;}i:150;a:3:{i:0;s:12:"section_edit";i:1;a:4:{i:0;i:3358;i:1;i:3428;i:2;i:2;i:3;s:22:"9)Na próxima reunião";}i:2;i:3429;}i:151;a:3:{i:0;s:6:"header";i:1;a:3:{i:0;s:28:"10)Avaliação de Relatorios";i:1;i:2;i:2;i:3429;}i:2;i:3429;}i:152;a:3:{i:0;s:12:"section_open";i:1;a:1:{i:0;i:2;}i:2;i:3429;}i:153;a:3:{i:0;s:6:"p_open";i:1;a:0:{}i:2;i:3469;}i:154;a:3:{i:0;s:5:"cdata";i:1;a:1:{i:0;s:19:"
Dia 27/06 às 18h.";}i:2;i:3470;}i:155;a:3:{i:0;s:7:"p_close";i:1;a:0:{}i:2;i:3489;}i:156;a:3:{i:0;s:13:"section_close";i:1;a:0:{}i:2;i:3491;}i:157;a:3:{i:0;s:12:"section_edit";i:1;a:4:{i:0;i:3429;i:1;i:3490;i:2;i:2;i:3;s:28:"10)Avaliação de Relatorios";}i:2;i:3491;}i:158;a:3:{i:0;s:6:"header";i:1;a:3:{i:0;s:16:"11)Publicações";i:1;i:2;i:2;i:3491;}i:2;i:3491;}i:159;a:3:{i:0;s:12:"section_open";i:1;a:1:{i:0;i:2;}i:2;i:3491;}i:160;a:3:{i:0;s:6:"p_open";i:1;a:0:{}i:2;i:3519;}i:161;a:3:{i:0;s:5:"cdata";i:1;a:1:{i:0;s:25:"
Thiago fará o abstract.";}i:2;i:3520;}i:162;a:3:{i:0;s:7:"p_close";i:1;a:0:{}i:2;i:3545;}i:163;a:3:{i:0;s:13:"section_close";i:1;a:0:{}i:2;i:3546;}i:164;a:3:{i:0;s:12:"section_edit";i:1;a:4:{i:0;i:3491;i:1;i:0;i:2;i:2;i:3;s:16:"11)Publicações";}i:2;i:3546;}i:165;a:3:{i:0;s:12:"document_end";i:1;a:0:{}i:2;i:3546;}}