a:207:{i:0;a:3:{i:0;s:14:"document_start";i:1;a:0:{}i:2;i:0;}i:1;a:3:{i:0;s:6:"p_open";i:1;a:0:{}i:2;i:0;}i:2;a:3:{i:0;s:7:"p_close";i:1;a:0:{}i:2;i:1;}i:3;a:3:{i:0;s:12:"section_edit";i:1;a:4:{i:0;i:-1;i:1;i:0;i:2;i:1;i:3;s:0:"";}i:2;i:1;}i:4;a:3:{i:0;s:6:"header";i:1;a:3:{i:0;s:41:"Ata da Reunião de 04 de Novembro de 2008";i:1;i:1;i:2;i:1;}i:2;i:1;}i:5;a:3:{i:0;s:12:"section_open";i:1;a:1:{i:0;i:1;}i:2;i:1;}i:6;a:3:{i:0;s:10:"listu_open";i:1;a:0:{}i:2;i:57;}i:7;a:3:{i:0;s:13:"listitem_open";i:1;a:1:{i:0;i:1;}i:2;i:57;}i:8;a:3:{i:0;s:16:"listcontent_open";i:1;a:0:{}i:2;i:57;}i:9;a:3:{i:0;s:5:"cdata";i:1;a:1:{i:0;s:170:" Presentes: Antônio, Bruno Albrecht, Bruno Guedes, Bruno Jurkovski, Cassiana, Fábio, Felipe, Gabriel, Kauê, Leonardo, Lucas, Marcos, Matheus, Matheus Proença e Tyron;";}i:2;i:61;}i:10;a:3:{i:0;s:17:"listcontent_close";i:1;a:0:{}i:2;i:231;}i:11;a:3:{i:0;s:14:"listitem_close";i:1;a:0:{}i:2;i:231;}i:12;a:3:{i:0;s:13:"listitem_open";i:1;a:1:{i:0;i:1;}i:2;i:231;}i:13;a:3:{i:0;s:16:"listcontent_open";i:1;a:0:{}i:2;i:231;}i:14;a:3:{i:0;s:5:"cdata";i:1;a:1:{i:0;s:42:" Atrasados: Felipe chegou às 17:54 (aula)";}i:2;i:235;}i:15;a:3:{i:0;s:17:"listcontent_close";i:1;a:0:{}i:2;i:277;}i:16;a:3:{i:0;s:14:"listitem_close";i:1;a:0:{}i:2;i:277;}i:17;a:3:{i:0;s:13:"listitem_open";i:1;a:1:{i:0;i:1;}i:2;i:277;}i:18;a:3:{i:0;s:16:"listcontent_open";i:1;a:0:{}i:2;i:277;}i:19;a:3:{i:0;s:5:"cdata";i:1;a:1:{i:0;s:17:" Ausentes: Dante;";}i:2;i:281;}i:20;a:3:{i:0;s:17:"listcontent_close";i:1;a:0:{}i:2;i:298;}i:21;a:3:{i:0;s:14:"listitem_close";i:1;a:0:{}i:2;i:298;}i:22;a:3:{i:0;s:13:"listitem_open";i:1;a:1:{i:0;i:1;}i:2;i:298;}i:23;a:3:{i:0;s:16:"listcontent_open";i:1;a:0:{}i:2;i:298;}i:24;a:3:{i:0;s:5:"cdata";i:1;a:1:{i:0;s:51:" Saídas Adiantadas: Bruno J. e Fábio (curso de C)";}i:2;i:302;}i:25;a:3:{i:0;s:17:"listcontent_close";i:1;a:0:{}i:2;i:353;}i:26;a:3:{i:0;s:14:"listitem_close";i:1;a:0:{}i:2;i:353;}i:27;a:3:{i:0;s:13:"listitem_open";i:1;a:1:{i:0;i:1;}i:2;i:353;}i:28;a:3:{i:0;s:16:"listcontent_open";i:1;a:0:{}i:2;i:353;}i:29;a:3:{i:0;s:5:"cdata";i:1;a:1:{i:0;s:19:" Relator: Antônio.";}i:2;i:357;}i:30;a:3:{i:0;s:17:"listcontent_close";i:1;a:0:{}i:2;i:376;}i:31;a:3:{i:0;s:14:"listitem_close";i:1;a:0:{}i:2;i:376;}i:32;a:3:{i:0;s:11:"listu_close";i:1;a:0:{}i:2;i:376;}i:33;a:3:{i:0;s:13:"section_close";i:1;a:0:{}i:2;i:378;}i:34;a:3:{i:0;s:12:"section_edit";i:1;a:4:{i:0;i:1;i:1;i:377;i:2;i:1;i:3;s:41:"Ata da Reunião de 04 de Novembro de 2008";}i:2;i:378;}i:35;a:3:{i:0;s:6:"header";i:1;a:3:{i:0;s:42:"1. Dante ausente há 3 semanas (grupo PET)";i:1;i:2;i:2;i:378;}i:2;i:378;}i:36;a:3:{i:0;s:12:"section_open";i:1;a:1:{i:0;i:2;}i:2;i:378;}i:37;a:3:{i:0;s:10:"quote_open";i:1;a:0:{}i:2;i:433;}i:38;a:3:{i:0;s:5:"cdata";i:1;a:1:{i:0;s:73:" O grupo queria esclarecer porque o Dante está 3 semanas ausente do PET.";}i:2;i:435;}i:39;a:3:{i:0;s:11:"quote_close";i:1;a:0:{}i:2;i:508;}i:40;a:3:{i:0;s:13:"section_close";i:1;a:0:{}i:2;i:510;}i:41;a:3:{i:0;s:12:"section_edit";i:1;a:4:{i:0;i:378;i:1;i:509;i:2;i:2;i:3;s:42:"1. Dante ausente há 3 semanas (grupo PET)";}i:2;i:510;}i:42;a:3:{i:0;s:6:"header";i:1;a:3:{i:0;s:39:"2. Mesa da cafeteira (Cassiana e Tyron)";i:1;i:2;i:2;i:510;}i:2;i:510;}i:43;a:3:{i:0;s:12:"section_open";i:1;a:1:{i:0;i:2;}i:2;i:510;}i:44;a:3:{i:0;s:10:"listu_open";i:1;a:0:{}i:2;i:562;}i:45;a:3:{i:0;s:13:"listitem_open";i:1;a:1:{i:0;i:1;}i:2;i:562;}i:46;a:3:{i:0;s:16:"listcontent_open";i:1;a:0:{}i:2;i:562;}i:47;a:3:{i:0;s:5:"cdata";i:1;a:1:{i:0;s:9:" Xícaras";}i:2;i:566;}i:48;a:3:{i:0;s:17:"listcontent_close";i:1;a:0:{}i:2;i:575;}i:49;a:3:{i:0;s:14:"listitem_close";i:1;a:0:{}i:2;i:575;}i:50;a:3:{i:0;s:11:"listu_close";i:1;a:0:{}i:2;i:575;}i:51;a:3:{i:0;s:6:"p_open";i:1;a:0:{}i:2;i:575;}i:52;a:3:{i:0;s:5:"cdata";i:1;a:1:{i:0;s:58:"
Tem várias xícaras sujas e amontoadas em cima da mesa.
";}i:2;i:576;}i:53;a:3:{i:0;s:7:"p_close";i:1;a:0:{}i:2;i:634;}i:54;a:3:{i:0;s:10:"listu_open";i:1;a:0:{}i:2;i:634;}i:55;a:3:{i:0;s:13:"listitem_open";i:1;a:1:{i:0;i:1;}i:2;i:634;}i:56;a:3:{i:0;s:16:"listcontent_open";i:1;a:0:{}i:2;i:634;}i:57;a:3:{i:0;s:5:"cdata";i:1;a:1:{i:0;s:7:" Toalha";}i:2;i:638;}i:58;a:3:{i:0;s:17:"listcontent_close";i:1;a:0:{}i:2;i:645;}i:59;a:3:{i:0;s:14:"listitem_close";i:1;a:0:{}i:2;i:645;}i:60;a:3:{i:0;s:11:"listu_close";i:1;a:0:{}i:2;i:645;}i:61;a:3:{i:0;s:6:"p_open";i:1;a:0:{}i:2;i:645;}i:62;a:3:{i:0;s:5:"cdata";i:1;a:1:{i:0;s:58:"
A toalha que estava em baixo da cafeteira estava imunda.
";}i:2;i:646;}i:63;a:3:{i:0;s:7:"p_close";i:1;a:0:{}i:2;i:704;}i:64;a:3:{i:0;s:10:"listu_open";i:1;a:0:{}i:2;i:704;}i:65;a:3:{i:0;s:13:"listitem_open";i:1;a:1:{i:0;i:1;}i:2;i:704;}i:66;a:3:{i:0;s:16:"listcontent_open";i:1;a:0:{}i:2;i:704;}i:67;a:3:{i:0;s:5:"cdata";i:1;a:1:{i:0;s:18:" Garrafas de água";}i:2;i:708;}i:68;a:3:{i:0;s:17:"listcontent_close";i:1;a:0:{}i:2;i:726;}i:69;a:3:{i:0;s:14:"listitem_close";i:1;a:0:{}i:2;i:726;}i:70;a:3:{i:0;s:11:"listu_close";i:1;a:0:{}i:2;i:726;}i:71;a:3:{i:0;s:6:"p_open";i:1;a:0:{}i:2;i:726;}i:72;a:3:{i:0;s:5:"cdata";i:1;a:1:{i:0;s:62:"
Existem várias garrafas d'água vazias sem dono espalhados.
";}i:2;i:727;}i:73;a:3:{i:0;s:7:"p_close";i:1;a:0:{}i:2;i:789;}i:74;a:3:{i:0;s:10:"listu_open";i:1;a:0:{}i:2;i:789;}i:75;a:3:{i:0;s:13:"listitem_open";i:1;a:1:{i:0;i:1;}i:2;i:789;}i:76;a:3:{i:0;s:16:"listcontent_open";i:1;a:0:{}i:2;i:789;}i:77;a:3:{i:0;s:5:"cdata";i:1;a:1:{i:0;s:21:" Porta sabão/esponja";}i:2;i:793;}i:78;a:3:{i:0;s:17:"listcontent_close";i:1;a:0:{}i:2;i:814;}i:79;a:3:{i:0;s:14:"listitem_close";i:1;a:0:{}i:2;i:814;}i:80;a:3:{i:0;s:11:"listu_close";i:1;a:0:{}i:2;i:814;}i:81;a:3:{i:0;s:6:"p_open";i:1;a:0:{}i:2;i:814;}i:82;a:3:{i:0;s:5:"cdata";i:1;a:1:{i:0;s:74:"
Cassiana sugeriu comprar um porta sabão/esponja → bruno irá ver isso.";}i:2;i:815;}i:83;a:3:{i:0;s:7:"p_close";i:1;a:0:{}i:2;i:889;}i:84;a:3:{i:0;s:6:"p_open";i:1;a:0:{}i:2;i:889;}i:85;a:3:{i:0;s:5:"cdata";i:1;a:1:{i:0;s:60:"Bruno irá comprar um pote para por todas as coisas na mesa.";}i:2;i:891;}i:86;a:3:{i:0;s:7:"p_close";i:1;a:0:{}i:2;i:951;}i:87;a:3:{i:0;s:13:"section_close";i:1;a:0:{}i:2;i:953;}i:88;a:3:{i:0;s:12:"section_edit";i:1;a:4:{i:0;i:510;i:1;i:952;i:2;i:2;i:3;s:39:"2. Mesa da cafeteira (Cassiana e Tyron)";}i:2;i:953;}i:89;a:3:{i:0;s:6:"header";i:1;a:3:{i:0;s:10:"3. Câmera";i:1;i:2;i:2;i:953;}i:2;i:953;}i:90;a:3:{i:0;s:12:"section_open";i:1;a:1:{i:0;i:2;}i:2;i:953;}i:91;a:3:{i:0;s:10:"listu_open";i:1;a:0:{}i:2;i:976;}i:92;a:3:{i:0;s:13:"listitem_open";i:1;a:1:{i:0;i:1;}i:2;i:976;}i:93;a:3:{i:0;s:16:"listcontent_open";i:1;a:0:{}i:2;i:976;}i:94;a:3:{i:0;s:5:"cdata";i:1;a:1:{i:0;s:74:" Câmera encontrada. Espero não ter causado muitos inconvenientes. (mizu)";}i:2;i:980;}i:95;a:3:{i:0;s:17:"listcontent_close";i:1;a:0:{}i:2;i:1054;}i:96;a:3:{i:0;s:14:"listitem_close";i:1;a:0:{}i:2;i:1054;}i:97;a:3:{i:0;s:11:"listu_close";i:1;a:0:{}i:2;i:1054;}i:98;a:3:{i:0;s:10:"quote_open";i:1;a:0:{}i:2;i:1055;}i:99;a:3:{i:0;s:10:"quote_open";i:1;a:0:{}i:2;i:1055;}i:100;a:3:{i:0;s:5:"cdata";i:1;a:1:{i:0;s:25:" Mizu falou que esqueceu.";}i:2;i:1058;}i:101;a:3:{i:0;s:11:"quote_close";i:1;a:0:{}i:2;i:1083;}i:102;a:3:{i:0;s:11:"quote_close";i:1;a:0:{}i:2;i:1083;}i:103;a:3:{i:0;s:13:"section_close";i:1;a:0:{}i:2;i:1085;}i:104;a:3:{i:0;s:12:"section_edit";i:1;a:4:{i:0;i:953;i:1;i:1084;i:2;i:2;i:3;s:10:"3. Câmera";}i:2;i:1085;}i:105;a:3:{i:0;s:6:"header";i:1;a:3:{i:0;s:26:"4. Pontos de falta (Bruno)";i:1;i:2;i:2;i:1085;}i:2;i:1085;}i:106;a:3:{i:0;s:12:"section_open";i:1;a:1:{i:0;i:2;}i:2;i:1085;}i:107;a:3:{i:0;s:10:"listu_open";i:1;a:0:{}i:2;i:1124;}i:108;a:3:{i:0;s:13:"listitem_open";i:1;a:1:{i:0;i:1;}i:2;i:1124;}i:109;a:3:{i:0;s:16:"listcontent_open";i:1;a:0:{}i:2;i:1124;}i:110;a:3:{i:0;s:5:"cdata";i:1;a:1:{i:0;s:75:" Ponto de Falta esquecido para o Tyron (nao fez o relatorio mensal) (bruno)";}i:2;i:1128;}i:111;a:3:{i:0;s:17:"listcontent_close";i:1;a:0:{}i:2;i:1203;}i:112;a:3:{i:0;s:14:"listitem_close";i:1;a:0:{}i:2;i:1203;}i:113;a:3:{i:0;s:11:"listu_close";i:1;a:0:{}i:2;i:1203;}i:114;a:3:{i:0;s:6:"p_open";i:1;a:0:{}i:2;i:1203;}i:115;a:3:{i:0;s:5:"cdata";i:1;a:1:{i:0;s:37:"
Tyron irá ganhar o ponto de falta.
";}i:2;i:1204;}i:116;a:3:{i:0;s:7:"p_close";i:1;a:0:{}i:2;i:1241;}i:117;a:3:{i:0;s:10:"listu_open";i:1;a:0:{}i:2;i:1241;}i:118;a:3:{i:0;s:13:"listitem_open";i:1;a:1:{i:0;i:1;}i:2;i:1241;}i:119;a:3:{i:0;s:16:"listcontent_open";i:1;a:0:{}i:2;i:1241;}i:120;a:3:{i:0;s:5:"cdata";i:1;a:1:{i:0;s:43:" Pontos de falta: logador x TRAC (Cassiana)";}i:2;i:1245;}i:121;a:3:{i:0;s:17:"listcontent_close";i:1;a:0:{}i:2;i:1288;}i:122;a:3:{i:0;s:14:"listitem_close";i:1;a:0:{}i:2;i:1288;}i:123;a:3:{i:0;s:11:"listu_close";i:1;a:0:{}i:2;i:1288;}i:124;a:3:{i:0;s:6:"p_open";i:1;a:0:{}i:2;i:1288;}i:125;a:3:{i:0;s:5:"cdata";i:1;a:1:{i:0;s:109:"
Por que tem em dois lugares? O do logador é a que vale. Será uma sessão para ficar visível os pendentes.";}i:2;i:1289;}i:126;a:3:{i:0;s:7:"p_close";i:1;a:0:{}i:2;i:1398;}i:127;a:3:{i:0;s:13:"section_close";i:1;a:0:{}i:2;i:1400;}i:128;a:3:{i:0;s:12:"section_edit";i:1;a:4:{i:0;i:1085;i:1;i:1399;i:2;i:2;i:3;s:26:"4. Pontos de falta (Bruno)";}i:2;i:1400;}i:129;a:3:{i:0;s:6:"header";i:1;a:3:{i:0;s:38:"5. Aula Colégio Aplicação (Antonio)";i:1;i:2;i:2;i:1400;}i:2;i:1400;}i:130;a:3:{i:0;s:12:"section_open";i:1;a:1:{i:0;i:2;}i:2;i:1400;}i:131;a:3:{i:0;s:10:"listu_open";i:1;a:0:{}i:2;i:1451;}i:132;a:3:{i:0;s:13:"listitem_open";i:1;a:1:{i:0;i:1;}i:2;i:1451;}i:133;a:3:{i:0;s:16:"listcontent_open";i:1;a:0:{}i:2;i:1451;}i:134;a:3:{i:0;s:5:"cdata";i:1;a:1:{i:0;s:123:" O grupo decidiu que o não ia ser pago o robô com o dinheiro do grupo. Sugerir em dupla, e ir atrás de verba do RoboEDU.";}i:2;i:1455;}i:135;a:3:{i:0;s:17:"listcontent_close";i:1;a:0:{}i:2;i:1578;}i:136;a:3:{i:0;s:14:"listitem_close";i:1;a:0:{}i:2;i:1578;}i:137;a:3:{i:0;s:11:"listu_close";i:1;a:0:{}i:2;i:1578;}i:138;a:3:{i:0;s:13:"section_close";i:1;a:0:{}i:2;i:1580;}i:139;a:3:{i:0;s:12:"section_edit";i:1;a:4:{i:0;i:1400;i:1;i:1579;i:2;i:2;i:3;s:38:"5. Aula Colégio Aplicação (Antonio)";}i:2;i:1580;}i:140;a:3:{i:0;s:6:"header";i:1;a:3:{i:0;s:34:"6. Novo Local para o LRI (Antonio)";i:1;i:2;i:2;i:1580;}i:2;i:1580;}i:141;a:3:{i:0;s:12:"section_open";i:1;a:1:{i:0;i:2;}i:2;i:1580;}i:142;a:3:{i:0;s:6:"p_open";i:1;a:0:{}i:2;i:1626;}i:143;a:3:{i:0;s:5:"cdata";i:1;a:1:{i:0;s:391:"
Antonio Comentou que o LRI pode ser mudado de lugar. Para as salas de reunião no mesmo prédio. O motivo para a mudança é a requisição do grupo de computação gráfica que quer uma sala mais comprida. O grupo concordou com a mudança, mas sugeriu que o instituto conseguisse um depósito para colocar várias coisas que não são mais usadas no LRI (que podem ser usadas futuramente).";}i:2;i:1627;}i:144;a:3:{i:0;s:7:"p_close";i:1;a:0:{}i:2;i:2018;}i:145;a:3:{i:0;s:13:"section_close";i:1;a:0:{}i:2;i:2020;}i:146;a:3:{i:0;s:12:"section_edit";i:1;a:4:{i:0;i:1580;i:1;i:2019;i:2;i:2;i:3;s:34:"6. Novo Local para o LRI (Antonio)";}i:2;i:2020;}i:147;a:3:{i:0;s:6:"header";i:1;a:3:{i:0;s:43:"7. Caixa organizadora para o NXT (cassiana)";i:1;i:2;i:2;i:2020;}i:2;i:2020;}i:148;a:3:{i:0;s:12:"section_open";i:1;a:1:{i:0;i:2;}i:2;i:2020;}i:149;a:3:{i:0;s:6:"p_open";i:1;a:0:{}i:2;i:2075;}i:150;a:3:{i:0;s:5:"cdata";i:1;a:1:{i:0;s:98:"
Cassiana falou que as peças do lego estão muito desorganizadas. Cassiana irá comprar os potes.";}i:2;i:2076;}i:151;a:3:{i:0;s:7:"p_close";i:1;a:0:{}i:2;i:2174;}i:152;a:3:{i:0;s:13:"section_close";i:1;a:0:{}i:2;i:2176;}i:153;a:3:{i:0;s:12:"section_edit";i:1;a:4:{i:0;i:2020;i:1;i:2175;i:2;i:2;i:3;s:43:"7. Caixa organizadora para o NXT (cassiana)";}i:2;i:2176;}i:154;a:3:{i:0;s:6:"header";i:1;a:3:{i:0;s:40:"8. Organização dos Desktops (Cassiana)";i:1;i:2;i:2;i:2176;}i:2;i:2176;}i:155;a:3:{i:0;s:12:"section_open";i:1;a:1:{i:0;i:2;}i:2;i:2176;}i:156;a:3:{i:0;s:6:"p_open";i:1;a:0:{}i:2;i:2228;}i:157;a:3:{i:0;s:5:"cdata";i:1;a:1:{i:0;s:384:"
Cassiana notou que os desktops estão muitos 'sujos' de novo. Ficou com 'pena' de deletar os arquivos. O grupo falou que tu que tiver lá pode ser deletado. Cassiana falou também que organizou a pasta da semana acadêmica. Reclamou que tinha coisas muito 'aleatórias' no PET-docs, ou seja, pastas muito desorganizadas. Proença (responsável) e Chies (secretária) irão organizar.";}i:2;i:2229;}i:158;a:3:{i:0;s:7:"p_close";i:1;a:0:{}i:2;i:2613;}i:159;a:3:{i:0;s:13:"section_close";i:1;a:0:{}i:2;i:2615;}i:160;a:3:{i:0;s:12:"section_edit";i:1;a:4:{i:0;i:2176;i:1;i:2614;i:2;i:2;i:3;s:40:"8. Organização dos Desktops (Cassiana)";}i:2;i:2615;}i:161;a:3:{i:0;s:6:"header";i:1;a:3:{i:0;s:18:"9. Backup Servidor";i:1;i:2;i:2;i:2615;}i:2;i:2615;}i:162;a:3:{i:0;s:12:"section_open";i:1;a:1:{i:0;i:2;}i:2;i:2615;}i:163;a:3:{i:0;s:6:"p_open";i:1;a:0:{}i:2;i:2645;}i:164;a:3:{i:0;s:5:"cdata";i:1;a:1:{i:0;s:208:"
Tyron quis saber se há backup dos arquivos do servidor. O grupo propôs comprar um HD externo. Proença irá ir atrás dos preços do HD, e ficará responsável pelo Backup que será feito uma vez por mês.";}i:2;i:2646;}i:165;a:3:{i:0;s:7:"p_close";i:1;a:0:{}i:2;i:2854;}i:166;a:3:{i:0;s:13:"section_close";i:1;a:0:{}i:2;i:2856;}i:167;a:3:{i:0;s:12:"section_edit";i:1;a:4:{i:0;i:2615;i:1;i:2855;i:2;i:2;i:3;s:18:"9. Backup Servidor";}i:2;i:2856;}i:168;a:3:{i:0;s:6:"header";i:1;a:3:{i:0;s:30:"10. Projeto next year (Marcos)";i:1;i:2;i:2;i:2856;}i:2;i:2856;}i:169;a:3:{i:0;s:12:"section_open";i:1;a:1:{i:0;i:2;}i:2;i:2856;}i:170;a:3:{i:0;s:6:"p_open";i:1;a:0:{}i:2;i:2898;}i:171;a:3:{i:0;s:5:"cdata";i:1;a:1:{i:0;s:108:"
Cavinato falou que surgiu outros interessados para o curso de C. Uma nova edição será feita ano que vem.";}i:2;i:2899;}i:172;a:3:{i:0;s:7:"p_close";i:1;a:0:{}i:2;i:3007;}i:173;a:3:{i:0;s:13:"section_close";i:1;a:0:{}i:2;i:3009;}i:174;a:3:{i:0;s:12:"section_edit";i:1;a:4:{i:0;i:2856;i:1;i:3008;i:2;i:2;i:3;s:30:"10. Projeto next year (Marcos)";}i:2;i:3009;}i:175;a:3:{i:0;s:6:"header";i:1;a:3:{i:0;s:49:"11. Interpet (Guedes): Marcar sala, enviar email.";i:1;i:2;i:2;i:3009;}i:2;i:3009;}i:176;a:3:{i:0;s:12:"section_open";i:1;a:1:{i:0;i:2;}i:2;i:3009;}i:177;a:3:{i:0;s:10:"quote_open";i:1;a:0:{}i:2;i:3071;}i:178;a:3:{i:0;s:5:"cdata";i:1;a:1:{i:0;s:137:" Guedes perguntou sobre marcar sala para o interpet. Cassiana irá marcar a sala amanhã (05/11) e mandará e-mail para as listas do PET.";}i:2;i:3073;}i:179;a:3:{i:0;s:11:"quote_close";i:1;a:0:{}i:2;i:3210;}i:180;a:3:{i:0;s:13:"section_close";i:1;a:0:{}i:2;i:3212;}i:181;a:3:{i:0;s:12:"section_edit";i:1;a:4:{i:0;i:3009;i:1;i:3211;i:2;i:2;i:3;s:49:"11. Interpet (Guedes): Marcar sala, enviar email.";}i:2;i:3212;}i:182;a:3:{i:0;s:6:"header";i:1;a:3:{i:0;s:30:"12. Uso Abusivo da Sala do PET";i:1;i:2;i:2;i:3212;}i:2;i:3212;}i:183;a:3:{i:0;s:12:"section_open";i:1;a:1:{i:0;i:2;}i:2;i:3212;}i:184;a:3:{i:0;s:10:"quote_open";i:1;a:0:{}i:2;i:3255;}i:185;a:3:{i:0;s:5:"cdata";i:1;a:1:{i:0;s:250:" Tyron observou que tinha muitos não-petianos na sala do PET, causando uma super ocupação da sala. Isso incomoda a manutenção da concentração na sala. Foi comentado também que causa um constrangimento pedir pras pessoas sair dos computadores.";}i:2;i:3257;}i:186;a:3:{i:0;s:11:"quote_close";i:1;a:0:{}i:2;i:3507;}i:187;a:3:{i:0;s:6:"p_open";i:1;a:0:{}i:2;i:3507;}i:188;a:3:{i:0;s:5:"cdata";i:1;a:1:{i:0;s:529:"
Após uma longa discussão (1 hora), foi decidido que apenas ex-petianos e petianos podem freqüentar a sala do PET. O petianos presentes na reunião ficaram encarregados de avisar seus amigos. Marcos Cavinato ficou de fazer um cartaz (folha de ofício) para colocar na porta avisando sobre o assunto. Em relação às músicas e conversas na sala do PET, foi decidido que cada petiano deve usar bom senso, e que tambem deve-se chamar a atenção de qualquer um que esteja prejudicando a concentração de qualquer outro colega.";}i:2;i:3508;}i:189;a:3:{i:0;s:7:"p_close";i:1;a:0:{}i:2;i:4037;}i:190;a:3:{i:0;s:13:"section_close";i:1;a:0:{}i:2;i:4039;}i:191;a:3:{i:0;s:12:"section_edit";i:1;a:4:{i:0;i:3212;i:1;i:4038;i:2;i:2;i:3;s:30:"12. Uso Abusivo da Sala do PET";}i:2;i:4039;}i:192;a:3:{i:0;s:6:"header";i:1;a:3:{i:0;s:30:"13. PET Mobilização (Marcos)";i:1;i:2;i:2;i:4039;}i:2;i:4039;}i:193;a:3:{i:0;s:12:"section_open";i:1;a:1:{i:0;i:2;}i:2;i:4039;}i:194;a:3:{i:0;s:6:"p_open";i:1;a:0:{}i:2;i:4081;}i:195;a:3:{i:0;s:5:"cdata";i:1;a:1:{i:0;s:33:"
Leonardo irá ir nessa reunião.";}i:2;i:4082;}i:196;a:3:{i:0;s:7:"p_close";i:1;a:0:{}i:2;i:4115;}i:197;a:3:{i:0;s:13:"section_close";i:1;a:0:{}i:2;i:4117;}i:198;a:3:{i:0;s:12:"section_edit";i:1;a:4:{i:0;i:4039;i:1;i:4116;i:2;i:2;i:3;s:30:"13. PET Mobilização (Marcos)";}i:2;i:4117;}i:199;a:3:{i:0;s:6:"header";i:1;a:3:{i:0;s:25:"14. Campus Party (Marcos)";i:1;i:2;i:2;i:4117;}i:2;i:4117;}i:200;a:3:{i:0;s:12:"section_open";i:1;a:1:{i:0;i:2;}i:2;i:4117;}i:201;a:3:{i:0;s:6:"p_open";i:1;a:0:{}i:2;i:4154;}i:202;a:3:{i:0;s:5:"cdata";i:1;a:1:{i:0;s:222:"
8 petianos já realizaram o pagamento. Horas na campus party: a princípio valerá 12 horas, mas os petianos que forem deverão fazer um relatório. Em relação às passagens aéreas, foi adiado para a próxima reunião.";}i:2;i:4155;}i:203;a:3:{i:0;s:7:"p_close";i:1;a:0:{}i:2;i:4377;}i:204;a:3:{i:0;s:13:"section_close";i:1;a:0:{}i:2;i:4378;}i:205;a:3:{i:0;s:12:"section_edit";i:1;a:4:{i:0;i:4117;i:1;i:0;i:2;i:2;i:3;s:25:"14. Campus Party (Marcos)";}i:2;i:4378;}i:206;a:3:{i:0;s:12:"document_end";i:1;a:0:{}i:2;i:4378;}}