a:150:{i:0;a:3:{i:0;s:14:"document_start";i:1;a:0:{}i:2;i:0;}i:1;a:3:{i:0;s:6:"p_open";i:1;a:0:{}i:2;i:0;}i:2;a:3:{i:0;s:7:"p_close";i:1;a:0:{}i:2;i:1;}i:3;a:3:{i:0;s:12:"section_edit";i:1;a:4:{i:0;i:-1;i:1;i:0;i:2;i:1;i:3;s:0:"";}i:2;i:1;}i:4;a:3:{i:0;s:6:"header";i:1;a:3:{i:0;s:29:"Ata da Reunião de 05/04/2006";i:1;i:1;i:2;i:1;}i:2;i:1;}i:5;a:3:{i:0;s:12:"section_open";i:1;a:1:{i:0;i:1;}i:2;i:1;}i:6;a:3:{i:0;s:6:"p_open";i:1;a:0:{}i:2;i:44;}i:7;a:3:{i:0;s:5:"cdata";i:1;a:1:{i:0;s:161:"
Presentes: Alexandre, Dante, Eduardo, Estevão, Fabiano, Felipe, Gabriela, Lucas Cavalheiro, Lucas Mizusaki, Marcelo, Marcos, Nondillo, Ricardo, Thiago, Vicente";}i:2;i:45;}i:8;a:3:{i:0;s:7:"p_close";i:1;a:0:{}i:2;i:206;}i:9;a:3:{i:0;s:6:"p_open";i:1;a:0:{}i:2;i:206;}i:10;a:3:{i:0;s:5:"cdata";i:1;a:1:{i:0;s:11:"Ausentes: -";}i:2;i:208;}i:11;a:3:{i:0;s:7:"p_close";i:1;a:0:{}i:2;i:219;}i:12;a:3:{i:0;s:6:"p_open";i:1;a:0:{}i:2;i:219;}i:13;a:3:{i:0;s:5:"cdata";i:1;a:1:{i:0;s:15:"Relator: Felipe";}i:2;i:221;}i:14;a:3:{i:0;s:7:"p_close";i:1;a:0:{}i:2;i:236;}i:15;a:3:{i:0;s:13:"section_close";i:1;a:0:{}i:2;i:238;}i:16;a:3:{i:0;s:12:"section_edit";i:1;a:4:{i:0;i:1;i:1;i:237;i:2;i:1;i:3;s:29:"Ata da Reunião de 05/04/2006";}i:2;i:238;}i:17;a:3:{i:0;s:6:"header";i:1;a:3:{i:0;s:32:"1. Recepção dos não-bolsistas";i:1;i:2;i:2;i:238;}i:2;i:238;}i:18;a:3:{i:0;s:12:"section_open";i:1;a:1:{i:0;i:2;}i:2;i:238;}i:19;a:3:{i:0;s:6:"p_open";i:1;a:0:{}i:2;i:282;}i:20;a:3:{i:0;s:5:"cdata";i:1;a:1:{i:0;s:611:"
Foram apresentados dois novos petianos, que entram como não-bolsistas: Gabriela e Lucas Mizusaki. Eles participaram da seleção dos novos bolsistas em Março, mas não haviam sido escolhidos. Como demonstraram interesse em participar como não bolsistas, o grupo PET Computação aceitou e eles entraram no grupo. O grupo se apresenta a eles, e eles ao grupo. Fabiano fala da diferença entre colaborador e voluntário. Ambos dizem que querem ser voluntários, isto é, vão ter os mesmos direitos e deveres dos outros petianos, como fazer as 12 horas, participar das reuniões semanais e ter direito a voto.";}i:2;i:283;}i:21;a:3:{i:0;s:7:"p_close";i:1;a:0:{}i:2;i:894;}i:22;a:3:{i:0;s:13:"section_close";i:1;a:0:{}i:2;i:896;}i:23;a:3:{i:0;s:12:"section_edit";i:1;a:4:{i:0;i:238;i:1;i:895;i:2;i:2;i:3;s:32:"1. Recepção dos não-bolsistas";}i:2;i:896;}i:24;a:3:{i:0;s:6:"header";i:1;a:3:{i:0;s:18:"2. Novos padrinhos";i:1;i:2;i:2;i:896;}i:2;i:896;}i:25;a:3:{i:0;s:12:"section_open";i:1;a:1:{i:0;i:2;}i:2;i:896;}i:26;a:3:{i:0;s:6:"p_open";i:1;a:0:{}i:2;i:926;}i:27;a:3:{i:0;s:5:"cdata";i:1;a:1:{i:0;s:144:"
Foram escolhidos os padrinhos dos novos petianos. Felipe será o padrinho de Gabriela, enquanto que Vicente será o padrinho de Lucas Mizusaki.";}i:2;i:927;}i:28;a:3:{i:0;s:7:"p_close";i:1;a:0:{}i:2;i:1071;}i:29;a:3:{i:0;s:13:"section_close";i:1;a:0:{}i:2;i:1073;}i:30;a:3:{i:0;s:12:"section_edit";i:1;a:4:{i:0;i:896;i:1;i:1072;i:2;i:2;i:3;s:18:"2. Novos padrinhos";}i:2;i:1073;}i:31;a:3:{i:0;s:6:"header";i:1;a:3:{i:0;s:12:"3. TechRobot";i:1;i:2;i:2;i:1073;}i:2;i:1073;}i:32;a:3:{i:0;s:12:"section_open";i:1;a:1:{i:0;i:2;}i:2;i:1073;}i:33;a:3:{i:0;s:6:"p_open";i:1;a:0:{}i:2;i:1097;}i:34;a:3:{i:0;s:5:"cdata";i:1;a:1:{i:0;s:99:"
Marcos trouxe para a sala do PET a carcaça do computador que havia sido 'saqueado' na Globaltech.";}i:2;i:1098;}i:35;a:3:{i:0;s:7:"p_close";i:1;a:0:{}i:2;i:1197;}i:36;a:3:{i:0;s:13:"section_close";i:1;a:0:{}i:2;i:1199;}i:37;a:3:{i:0;s:12:"section_edit";i:1;a:4:{i:0;i:1073;i:1;i:1198;i:2;i:2;i:3;s:12:"3. TechRobot";}i:2;i:1199;}i:38;a:3:{i:0;s:6:"header";i:1;a:3:{i:0;s:36:"4. Cumprimento do horário x Feriado";i:1;i:2;i:2;i:1199;}i:2;i:1199;}i:39;a:3:{i:0;s:12:"section_open";i:1;a:1:{i:0;i:2;}i:2;i:1199;}i:40;a:3:{i:0;s:6:"p_open";i:1;a:0:{}i:2;i:1247;}i:41;a:3:{i:0;s:5:"cdata";i:1;a:1:{i:0;s:826:"
Marcos comenta que terão dois feriados na sexta-feira no mês, e ele faz quase metade das suas horas nesse dia e, portanto, poderia ser prejudicado com isso. Fabiano comenta que antigamente o combinado era que a pessoa podia solicitar as horas que diz que faz (no Trac) no dia do feriado como pendentes. Ele e Nondillo sugerem outra opção: que não seja solicitada hora nenhuma e a pessoa tente fazer as horas necessárias nos outros dias do mês. Lucas Cavalheiro sugere que, temporariamente, a pessoa possa pedir 50% dessas horas. O grupo não aceita. Ocorre então uma votação para decidir. Opção 1: manter como está, isto é, a pessoa solicita as horas pendentes do feriado; opção 2: a pessoa não pode solicitar e tem que fazer as horas em outros dias do mês. Foi feito voto aberto, com o seguinte resultado:
";}i:2;i:1248;}i:42;a:3:{i:0;s:7:"p_close";i:1;a:0:{}i:2;i:2074;}i:43;a:3:{i:0;s:10:"listu_open";i:1;a:0:{}i:2;i:2074;}i:44;a:3:{i:0;s:13:"listitem_open";i:1;a:1:{i:0;i:1;}i:2;i:2074;}i:45;a:3:{i:0;s:16:"listcontent_open";i:1;a:0:{}i:2;i:2074;}i:46;a:3:{i:0;s:5:"cdata";i:1;a:1:{i:0;s:24:" Opção 1 -&gt; 0 votos";}i:2;i:2078;}i:47;a:3:{i:0;s:17:"listcontent_close";i:1;a:0:{}i:2;i:2102;}i:48;a:3:{i:0;s:14:"listitem_close";i:1;a:0:{}i:2;i:2102;}i:49;a:3:{i:0;s:13:"listitem_open";i:1;a:1:{i:0;i:1;}i:2;i:2102;}i:50;a:3:{i:0;s:16:"listcontent_open";i:1;a:0:{}i:2;i:2102;}i:51;a:3:{i:0;s:5:"cdata";i:1;a:1:{i:0;s:25:" Opção 2 -&gt; 15 votos";}i:2;i:2106;}i:52;a:3:{i:0;s:17:"listcontent_close";i:1;a:0:{}i:2;i:2131;}i:53;a:3:{i:0;s:14:"listitem_close";i:1;a:0:{}i:2;i:2131;}i:54;a:3:{i:0;s:13:"listitem_open";i:1;a:1:{i:0;i:1;}i:2;i:2131;}i:55;a:3:{i:0;s:16:"listcontent_open";i:1;a:0:{}i:2;i:2131;}i:56;a:3:{i:0;s:5:"cdata";i:1;a:1:{i:0;s:27:" Abstenções -&gt; 0 votos";}i:2;i:2135;}i:57;a:3:{i:0;s:17:"listcontent_close";i:1;a:0:{}i:2;i:2162;}i:58;a:3:{i:0;s:14:"listitem_close";i:1;a:0:{}i:2;i:2162;}i:59;a:3:{i:0;s:11:"listu_close";i:1;a:0:{}i:2;i:2162;}i:60;a:3:{i:0;s:6:"p_open";i:1;a:0:{}i:2;i:2162;}i:61;a:3:{i:0;s:5:"cdata";i:1;a:1:{i:0;s:120:"
Assim sendo, a opção 2 é escolhida, e todos devem fazer as horas do mês normalmente, independentemente de feriados.";}i:2;i:2163;}i:62;a:3:{i:0;s:7:"p_close";i:1;a:0:{}i:2;i:2283;}i:63;a:3:{i:0;s:13:"section_close";i:1;a:0:{}i:2;i:2285;}i:64;a:3:{i:0;s:12:"section_edit";i:1;a:4:{i:0;i:1199;i:1;i:2284;i:2;i:2;i:3;s:36:"4. Cumprimento do horário x Feriado";}i:2;i:2285;}i:65;a:3:{i:0;s:6:"header";i:1;a:3:{i:0;s:21:"5. Horário dos Novos";i:1;i:2;i:2;i:2285;}i:2;i:2285;}i:66;a:3:{i:0;s:12:"section_open";i:1;a:1:{i:0;i:2;}i:2;i:2285;}i:67;a:3:{i:0;s:6:"p_open";i:1;a:0:{}i:2;i:2318;}i:68;a:3:{i:0;s:5:"cdata";i:1;a:1:{i:0;s:101:"
Ficou decido que os novos terão que fazer as horas proporcionalmente ao dia em que entraram no PET.";}i:2;i:2319;}i:69;a:3:{i:0;s:7:"p_close";i:1;a:0:{}i:2;i:2420;}i:70;a:3:{i:0;s:13:"section_close";i:1;a:0:{}i:2;i:2422;}i:71;a:3:{i:0;s:12:"section_edit";i:1;a:4:{i:0;i:2285;i:1;i:2421;i:2;i:2;i:3;s:21:"5. Horário dos Novos";}i:2;i:2422;}i:72;a:3:{i:0;s:6:"header";i:1;a:3:{i:0;s:31:"6. Organização da sala do PET";i:1;i:2;i:2;i:2422;}i:2;i:2422;}i:73;a:3:{i:0;s:12:"section_open";i:1;a:1:{i:0;i:2;}i:2;i:2422;}i:74;a:3:{i:0;s:6:"p_open";i:1;a:0:{}i:2;i:2465;}i:75;a:3:{i:0;s:5:"cdata";i:1;a:1:{i:0;s:273:"
Fabiano comenta que a sala anda muito desorganizada, e que devemos ajeitar o espaço que temos. Deve-se fazer uma organização no armário, mural, etc. Estevão e Thiago farão isso. Eles dizem para retirar documentos importantes que estão lá, pois serão jogados fora.";}i:2;i:2466;}i:76;a:3:{i:0;s:7:"p_close";i:1;a:0:{}i:2;i:2739;}i:77;a:3:{i:0;s:13:"section_close";i:1;a:0:{}i:2;i:2741;}i:78;a:3:{i:0;s:12:"section_edit";i:1;a:4:{i:0;i:2422;i:1;i:2740;i:2;i:2;i:3;s:31:"6. Organização da sala do PET";}i:2;i:2741;}i:79;a:3:{i:0;s:6:"header";i:1;a:3:{i:0;s:8:"7. Museu";i:1;i:2;i:2;i:2741;}i:2;i:2741;}i:80;a:3:{i:0;s:12:"section_open";i:1;a:1:{i:0;i:2;}i:2;i:2741;}i:81;a:3:{i:0;s:6:"p_open";i:1;a:0:{}i:2;i:2761;}i:82;a:3:{i:0;s:5:"cdata";i:1;a:1:{i:0;s:433:"
Lucas Cavalheiro comenta da sala onde será exposto o Museu na Portas Abertas – sala do Coffee Break – pois alguns petianos tinham tentado ir lá dar uma olhada, mas a mulher da limpeza não havia deixado entrar, pois não havia autorização. Dante diz para falar com a Silvânia. Ele diz também que devemos colocar as peças na sala somente perto da data, por motivos de segurança. As peças prontas serão colocadas no LRI.";}i:2;i:2762;}i:83;a:3:{i:0;s:7:"p_close";i:1;a:0:{}i:2;i:3195;}i:84;a:3:{i:0;s:13:"section_close";i:1;a:0:{}i:2;i:3197;}i:85;a:3:{i:0;s:12:"section_edit";i:1;a:4:{i:0;i:2741;i:1;i:3196;i:2;i:2;i:3;s:8:"7. Museu";}i:2;i:3197;}i:86;a:3:{i:0;s:6:"header";i:1;a:3:{i:0;s:16:"8. SulPET/EnaPET";i:1;i:2;i:2;i:3197;}i:2;i:3197;}i:87;a:3:{i:0;s:12:"section_open";i:1;a:1:{i:0;i:2;}i:2;i:3197;}i:88;a:3:{i:0;s:6:"p_open";i:1;a:0:{}i:2;i:3225;}i:89;a:3:{i:0;s:5:"cdata";i:1;a:1:{i:0;s:596:"
Lembra-se que o SulPET será realizado nos dias 20 a 23 de abril. Perguntou-se se Gabriela e Lucas Mizusaki iriam. Porém, eles deram a mesma desculpa (que tem prova nos dois dias seguintes) dos seus colegas de Engenharia de Computação (Alexandre, Estevão, Ricardo, Lucas Cavalheiro) para não ir. Eduardo, Marcelo e Thiago disseram que não vão, pois irão ao Fórum de Software Livre, que ocorre na mesma data. Irão, então, ao SulPET Felipe, Marcos e Nondillo, além de Vinão, ex-petiano. Após, lembra-se que haverá EnaPET em Florianópolis em julho e todos dizem que vão comparecer.";}i:2;i:3226;}i:90;a:3:{i:0;s:7:"p_close";i:1;a:0:{}i:2;i:3822;}i:91;a:3:{i:0;s:13:"section_close";i:1;a:0:{}i:2;i:3824;}i:92;a:3:{i:0;s:12:"section_edit";i:1;a:4:{i:0;i:3197;i:1;i:3823;i:2;i:2;i:3;s:16:"8. SulPET/EnaPET";}i:2;i:3824;}i:93;a:3:{i:0;s:6:"header";i:1;a:3:{i:0;s:11:"9. InterPET";i:1;i:2;i:2;i:3824;}i:2;i:3824;}i:94;a:3:{i:0;s:12:"section_open";i:1;a:1:{i:0;i:2;}i:2;i:3824;}i:95;a:3:{i:0;s:6:"p_open";i:1;a:0:{}i:2;i:3847;}i:96;a:3:{i:0;s:5:"cdata";i:1;a:1:{i:0;s:120:"
É lembrado que ocorrerá InterPET aqui na Informática dia 12/04 às 19h, sobre o SulPET. Marcos e Thiago deverão ir.";}i:2;i:3848;}i:97;a:3:{i:0;s:7:"p_close";i:1;a:0:{}i:2;i:3968;}i:98;a:3:{i:0;s:13:"section_close";i:1;a:0:{}i:2;i:3970;}i:99;a:3:{i:0;s:12:"section_edit";i:1;a:4:{i:0;i:3824;i:1;i:3969;i:2;i:2;i:3;s:11:"9. InterPET";}i:2;i:3970;}i:100;a:3:{i:0;s:6:"header";i:1;a:3:{i:0;s:19:"10. Motiva-te, PET!";i:1;i:2;i:2;i:3970;}i:2;i:3970;}i:101;a:3:{i:0;s:12:"section_open";i:1;a:1:{i:0;i:2;}i:2;i:3970;}i:102;a:3:{i:0;s:6:"p_open";i:1;a:0:{}i:2;i:4001;}i:103;a:3:{i:0;s:5:"cdata";i:1;a:1:{i:0;s:283:"
Fabiano leu uma reportagem em uma revista com o Bernardinho sobre motivação, que é essencial em um grupo para ele trabalhar bem. Assim, foi sugerida uma série de coisas, que serão descritas nos próximos itens. Além disso, Fabiano recomendou para que todos leiam a reportagem.";}i:2;i:4002;}i:104;a:3:{i:0;s:7:"p_close";i:1;a:0:{}i:2;i:4285;}i:105;a:3:{i:0;s:13:"section_close";i:1;a:0:{}i:2;i:4287;}i:106;a:3:{i:0;s:12:"section_edit";i:1;a:4:{i:0;i:3970;i:1;i:4286;i:2;i:2;i:3;s:19:"10. Motiva-te, PET!";}i:2;i:4287;}i:107;a:3:{i:0;s:6:"header";i:1;a:3:{i:0;s:19:"11. Futebol e Pizza";i:1;i:2;i:2;i:4287;}i:2;i:4287;}i:108;a:3:{i:0;s:12:"section_open";i:1;a:1:{i:0;i:2;}i:2;i:4287;}i:109;a:3:{i:0;s:6:"p_open";i:1;a:0:{}i:2;i:4318;}i:110;a:3:{i:0;s:5:"cdata";i:1;a:1:{i:0;s:306:"
Foi sugerido, para integração e motivação do grupo, que marcássemos um jogo de futebol seguido de uma ida a uma pizzaria. A princípio, será dia 13/04 (quinta) às 19:00. Lucas Cavalheiro ficou de marcar a quadra. Eduardo vai procurar a pizzaria. Devem dar resposta de preferência até sexta-feira.";}i:2;i:4319;}i:111;a:3:{i:0;s:7:"p_close";i:1;a:0:{}i:2;i:4625;}i:112;a:3:{i:0;s:13:"section_close";i:1;a:0:{}i:2;i:4627;}i:113;a:3:{i:0;s:12:"section_edit";i:1;a:4:{i:0;i:4287;i:1;i:4626;i:2;i:2;i:3;s:19:"11. Futebol e Pizza";}i:2;i:4627;}i:114;a:3:{i:0;s:6:"header";i:1;a:3:{i:0;s:32:"12. Camiseta do PET Computação";i:1;i:2;i:2;i:4627;}i:2;i:4627;}i:115;a:3:{i:0;s:12:"section_open";i:1;a:1:{i:0;i:2;}i:2;i:4627;}i:116;a:3:{i:0;s:6:"p_open";i:1;a:0:{}i:2;i:4671;}i:117;a:3:{i:0;s:5:"cdata";i:1;a:1:{i:0;s:377:"
Fabiano falou para fazermos uma nova camiseta para o PET Computação. É provável que fique o mesmo modelo, só mudando a cor, mas todos estão encorajados a pensar em um modelo novo. Dante comenta que as camisetas devem ser de cor igual para todos, para não ocorrer o problema de alguém ficar com a sobra. Lucas Cavalheiro irá ver o preço das camisetas em uma gráfica.";}i:2;i:4672;}i:118;a:3:{i:0;s:7:"p_close";i:1;a:0:{}i:2;i:5049;}i:119;a:3:{i:0;s:13:"section_close";i:1;a:0:{}i:2;i:5051;}i:120;a:3:{i:0;s:12:"section_edit";i:1;a:4:{i:0;i:4627;i:1;i:5050;i:2;i:2;i:3;s:32:"12. Camiseta do PET Computação";}i:2;i:5051;}i:121;a:3:{i:0;s:6:"header";i:1;a:3:{i:0;s:35:"13. Avaliação Mensal dos Petianos";i:1;i:2;i:2;i:5051;}i:2;i:5051;}i:122;a:3:{i:0;s:12:"section_open";i:1;a:1:{i:0;i:2;}i:2;i:5051;}i:123;a:3:{i:0;s:6:"p_open";i:1;a:0:{}i:2;i:5098;}i:124;a:3:{i:0;s:5:"cdata";i:1;a:1:{i:0;s:829:"
Fabiano lembra de um ponto de pauta de dezembro, que vinha sendo adiado: a avaliação mensal de cada petiano, destacando aspectos positivos e negativos. Fabiano lembra que mandou um e-mail para a lista do pet, contendo o relatório mensal de cada um e que acha que poucos se interessaram em olhar (na verdade, foi ele quem se esqueceu de anexar o arquivo). Fabiano acha melhor que essa avaliação seja feita fora da reunião semanal para não sobrecarregá-la. Ele irá procurar um horário onde todos podem. É discutido como seria implementada a avaliação e Dante comenta que seria interessante fazer isso na forma de uma dinâmica onde um falaria do outro. Temos que avaliar quanto tempo isso levaria. Dante diz que vê com bons olhos essa iniciativa. Fabiano vai estudar as alternativas sobre como faremos a avaliação.";}i:2;i:5099;}i:125;a:3:{i:0;s:7:"p_close";i:1;a:0:{}i:2;i:5928;}i:126;a:3:{i:0;s:13:"section_close";i:1;a:0:{}i:2;i:5930;}i:127;a:3:{i:0;s:12:"section_edit";i:1;a:4:{i:0;i:5051;i:1;i:5929;i:2;i:2;i:3;s:35:"13. Avaliação Mensal dos Petianos";}i:2;i:5930;}i:128;a:3:{i:0;s:6:"header";i:1;a:3:{i:0;s:25:"14. Tarefas Burocráticas";i:1;i:2;i:2;i:5930;}i:2;i:5930;}i:129;a:3:{i:0;s:12:"section_open";i:1;a:1:{i:0;i:2;}i:2;i:5930;}i:130;a:3:{i:0;s:6:"p_open";i:1;a:0:{}i:2;i:5967;}i:131;a:3:{i:0;s:5:"cdata";i:1;a:1:{i:0;s:1126:"
Thiago comenta que há um excesso de tarefas burocráticas. Ele diz que esse excesso prejudica o desempenho total, e atrasam os projetos. Comenta-se que alguns petianos estão sobrecarregados de tarefas burocráticas e, por isso, não conseguem desenvolver outros tipos de trabalho. Fabiano comenta que não encostou um dedo no RoboPET nesse mês (março) por causa disso. Nondillo comenta que devemos botar na lista de tarefas burocrática, que está no Trac, as atividades que realizamos. Dante diz que muitas dessas tarefas acabam contribuindo na nossa formação. Foi comentado que algumas tarefas realmente são inerentes para o bom funcionamento do grupo e que não há como fugir. É questionado se, por exemplo, o museu seria tarefa do PET. Dante comenta que Estevão, Felipe, Marcos e Vicente foram à sua sala para conversar sobre isso, e ficou decidido que ficaríamos tratando do museu até o Portas Abertas. Dante diz que gostou da iniciativa deles de irem lá. Ainda sobre Extensão, Dante comenta que foram abertas 4 vagas para professores no II, também por causa das tarefas de Extensão realizadas pelo PET.";}i:2;i:5968;}i:132;a:3:{i:0;s:7:"p_close";i:1;a:0:{}i:2;i:7094;}i:133;a:3:{i:0;s:13:"section_close";i:1;a:0:{}i:2;i:7096;}i:134;a:3:{i:0;s:12:"section_edit";i:1;a:4:{i:0;i:5930;i:1;i:7095;i:2;i:2;i:3;s:25:"14. Tarefas Burocráticas";}i:2;i:7096;}i:135;a:3:{i:0;s:6:"header";i:1;a:3:{i:0;s:21:"15. Mini-curso de GTK";i:1;i:2;i:2;i:7096;}i:2;i:7096;}i:136;a:3:{i:0;s:12:"section_open";i:1;a:1:{i:0;i:2;}i:2;i:7096;}i:137;a:3:{i:0;s:6:"p_open";i:1;a:0:{}i:2;i:7129;}i:138;a:3:{i:0;s:5:"cdata";i:1;a:1:{i:0;s:435:"
Thiago conta que ele e Diego (ex-petiano) farão um curso de GTK+, biblioteca para desenvolvimento de interfaces gráficas portáveis, que ele aprendeu enquanto fazia os simuladores de Arquitetura de Computadores. Ele comenta que todos deveriam tentar fazer esse ciclo de pesquisa, ensino e extensão. Marcos concorda e diz que também pensa em fazer um curso sobre as ferramentas que vai aprender no projeto de computação gráfica.";}i:2;i:7130;}i:139;a:3:{i:0;s:7:"p_close";i:1;a:0:{}i:2;i:7565;}i:140;a:3:{i:0;s:13:"section_close";i:1;a:0:{}i:2;i:7567;}i:141;a:3:{i:0;s:12:"section_edit";i:1;a:4:{i:0;i:7096;i:1;i:7566;i:2;i:2;i:3;s:21:"15. Mini-curso de GTK";}i:2;i:7567;}i:142;a:3:{i:0;s:6:"header";i:1;a:3:{i:0;s:22:"16. Atividade Cultural";i:1;i:2;i:2;i:7567;}i:2;i:7567;}i:143;a:3:{i:0;s:12:"section_open";i:1;a:1:{i:0;i:2;}i:2;i:7567;}i:144;a:3:{i:0;s:6:"p_open";i:1;a:0:{}i:2;i:7601;}i:145;a:3:{i:0;s:5:"cdata";i:1;a:1:{i:0;s:122:"
É lembrado da nossa Atividade Cultural, que será na segunda dia 10 na usina do gasômetro às 19h para irmos ao teatro.";}i:2;i:7602;}i:146;a:3:{i:0;s:7:"p_close";i:1;a:0:{}i:2;i:7724;}i:147;a:3:{i:0;s:13:"section_close";i:1;a:0:{}i:2;i:7725;}i:148;a:3:{i:0;s:12:"section_edit";i:1;a:4:{i:0;i:7567;i:1;i:0;i:2;i:2;i:3;s:22:"16. Atividade Cultural";}i:2;i:7725;}i:149;a:3:{i:0;s:12:"document_end";i:1;a:0:{}i:2;i:7725;}}