a:78:{i:0;a:3:{i:0;s:14:"document_start";i:1;a:0:{}i:2;i:0;}i:1;a:3:{i:0;s:6:"p_open";i:1;a:0:{}i:2;i:0;}i:2;a:3:{i:0;s:7:"p_close";i:1;a:0:{}i:2;i:1;}i:3;a:3:{i:0;s:12:"section_edit";i:1;a:4:{i:0;i:-1;i:1;i:0;i:2;i:1;i:3;s:0:"";}i:2;i:1;}i:4;a:3:{i:0;s:6:"header";i:1;a:3:{i:0;s:29:"Ata da reunião de 17/05/2006";i:1;i:2;i:2;i:1;}i:2;i:1;}i:5;a:3:{i:0;s:12:"section_open";i:1;a:1:{i:0;i:2;}i:2;i:1;}i:6;a:3:{i:0;s:6:"p_open";i:1;a:0:{}i:2;i:42;}i:7;a:3:{i:0;s:5:"cdata";i:1;a:1:{i:0;s:153:"
Presentes: Alexandre, Eduardo, Estevão, Fabiano, Felipe, Gabriela, Lucas Cavalheiro, Lucas Mizusaki, Marcelo, Marcos, Nondillo, Pablo, Ricardo e Thiago";}i:2;i:43;}i:8;a:3:{i:0;s:7:"p_close";i:1;a:0:{}i:2;i:196;}i:9;a:3:{i:0;s:6:"p_open";i:1;a:0:{}i:2;i:196;}i:10;a:3:{i:0;s:5:"cdata";i:1;a:1:{i:0;s:25:"Ausentes: Professor Dante";}i:2;i:198;}i:11;a:3:{i:0;s:7:"p_close";i:1;a:0:{}i:2;i:223;}i:12;a:3:{i:0;s:6:"p_open";i:1;a:0:{}i:2;i:223;}i:13;a:3:{i:0;s:5:"cdata";i:1;a:1:{i:0;s:23:"Relator: Lucas Mizusaki";}i:2;i:225;}i:14;a:3:{i:0;s:7:"p_close";i:1;a:0:{}i:2;i:248;}i:15;a:3:{i:0;s:13:"section_close";i:1;a:0:{}i:2;i:250;}i:16;a:3:{i:0;s:12:"section_edit";i:1;a:4:{i:0;i:1;i:1;i:249;i:2;i:2;i:3;s:29:"Ata da reunião de 17/05/2006";}i:2;i:250;}i:17;a:3:{i:0;s:6:"header";i:1;a:3:{i:0;s:17:"1)Limpeza da sala";i:1;i:2;i:2;i:250;}i:2;i:250;}i:18;a:3:{i:0;s:12:"section_open";i:1;a:1:{i:0;i:2;}i:2;i:250;}i:19;a:3:{i:0;s:6:"p_open";i:1;a:0:{}i:2;i:279;}i:20;a:3:{i:0;s:5:"cdata";i:1;a:1:{i:0;s:261:"
Estevão varreu a sala antes da reunião. Ficou resolvido com as faxineiras que seria feita a limpeza toda quarta-feira de manhã (ou ao menos uma vez por semana); devemos reclamar diretamente para as faxineiras ou levar para a secretaria em caso de problemas.";}i:2;i:280;}i:21;a:3:{i:0;s:7:"p_close";i:1;a:0:{}i:2;i:541;}i:22;a:3:{i:0;s:13:"section_close";i:1;a:0:{}i:2;i:543;}i:23;a:3:{i:0;s:12:"section_edit";i:1;a:4:{i:0;i:250;i:1;i:542;i:2;i:2;i:3;s:17:"1)Limpeza da sala";}i:2;i:543;}i:24;a:3:{i:0;s:6:"header";i:1;a:3:{i:0;s:16:"2)Portas Abertas";i:1;i:2;i:2;i:543;}i:2;i:543;}i:25;a:3:{i:0;s:12:"section_open";i:1;a:1:{i:0;i:2;}i:2;i:543;}i:26;a:3:{i:0;s:6:"p_open";i:1;a:0:{}i:2;i:571;}i:27;a:3:{i:0;s:5:"cdata";i:1;a:1:{i:0;s:675:"
Marcos ressaltou a participação e o sucesso do pessoal envolvido com o museu, mesmo com a correria de última hora. Ele comentou que o projeto deu certo graças ao estabelecimento de uma meta para o programa do Portas Abertas. Fabiano também comentou que as estandes de dúvidas não receberam muitas visitas, por causa das palestras (que já esclareceram muitas das dúvidas dos visitantes sobre os cursos) e que deveríamos continuar com a iniciativa do Museu da informática ao menos para algumas visitas ou demonstrações, principalmente para os alunos de Arq II. Segundo Marcelo, a única crítica recebida ao Museu foi a falta de uma escala nas fotos dos cartazes.";}i:2;i:572;}i:28;a:3:{i:0;s:7:"p_close";i:1;a:0:{}i:2;i:1247;}i:29;a:3:{i:0;s:13:"section_close";i:1;a:0:{}i:2;i:1249;}i:30;a:3:{i:0;s:12:"section_edit";i:1;a:4:{i:0;i:543;i:1;i:1248;i:2;i:2;i:3;s:16:"2)Portas Abertas";}i:2;i:1249;}i:31;a:3:{i:0;s:6:"header";i:1;a:3:{i:0;s:13:"3)Site do Pet";i:1;i:2;i:2;i:1249;}i:2;i:1249;}i:32;a:3:{i:0;s:12:"section_open";i:1;a:1:{i:0;i:2;}i:2;i:1249;}i:33;a:3:{i:0;s:6:"p_open";i:1;a:0:{}i:2;i:1274;}i:34;a:3:{i:0;s:5:"cdata";i:1;a:1:{i:0;s:245:"
Pablo foi ao CPD para negociar um domínio para uma página de todos os PETs da UFRGS para que cada um dos grupos possua uma pasta própria. Ficou decidido que usar o nosso próprio zservidor não era o mais adequado e a iniciativa foi apoiada.";}i:2;i:1275;}i:35;a:3:{i:0;s:7:"p_close";i:1;a:0:{}i:2;i:1520;}i:36;a:3:{i:0;s:13:"section_close";i:1;a:0:{}i:2;i:1522;}i:37;a:3:{i:0;s:12:"section_edit";i:1;a:4:{i:0;i:1249;i:1;i:1521;i:2;i:2;i:3;s:13:"3)Site do Pet";}i:2;i:1522;}i:38;a:3:{i:0;s:6:"header";i:1;a:3:{i:0;s:27:"4)Material para a cafeteira";i:1;i:2;i:2;i:1522;}i:2;i:1522;}i:39;a:3:{i:0;s:12:"section_open";i:1;a:1:{i:0;i:2;}i:2;i:1522;}i:40;a:3:{i:0;s:6:"p_open";i:1;a:0:{}i:2;i:1561;}i:41;a:3:{i:0;s:5:"cdata";i:1;a:1:{i:0;s:149:"
Como a cafeteira está com poucos copos e sem açúcar à algum tempo, foi decidido pela compra de novos materiais (mais copos, açúcar e um pano).";}i:2;i:1562;}i:42;a:3:{i:0;s:7:"p_close";i:1;a:0:{}i:2;i:1711;}i:43;a:3:{i:0;s:13:"section_close";i:1;a:0:{}i:2;i:1713;}i:44;a:3:{i:0;s:12:"section_edit";i:1;a:4:{i:0;i:1522;i:1;i:1712;i:2;i:2;i:3;s:27:"4)Material para a cafeteira";}i:2;i:1713;}i:45;a:3:{i:0;s:6:"header";i:1;a:3:{i:0;s:37:"5)Horas pendentes do ciclo de debates";i:1;i:2;i:2;i:1713;}i:2;i:1713;}i:46;a:3:{i:0;s:12:"section_open";i:1;a:1:{i:0;i:2;}i:2;i:1713;}i:47;a:3:{i:0;s:6:"p_open";i:1;a:0:{}i:2;i:1762;}i:48;a:3:{i:0;s:5:"cdata";i:1;a:1:{i:0;s:383:"
Marcelo queria verificar se as horas pendentes do ciclo são válidas para o mês. Fica decidido que caso faltem horas para o pessoal envolvido, será realizada uma avaliação para o caso. Thiago abordou o problema da falta de alunos para prestar depoimento na palestra de mobilidade acadêmica. Agora, ele vai mandar um e-mail para a lista de graduação pedindo por voluntários.";}i:2;i:1763;}i:49;a:3:{i:0;s:7:"p_close";i:1;a:0:{}i:2;i:2146;}i:50;a:3:{i:0;s:13:"section_close";i:1;a:0:{}i:2;i:2148;}i:51;a:3:{i:0;s:12:"section_edit";i:1;a:4:{i:0;i:1713;i:1;i:2147;i:2;i:2;i:3;s:37:"5)Horas pendentes do ciclo de debates";}i:2;i:2148;}i:52;a:3:{i:0;s:6:"header";i:1;a:3:{i:0;s:55:"6)Data e Hora para o Interpetão e proposta para o Tema";i:1;i:2;i:2;i:2148;}i:2;i:2148;}i:53;a:3:{i:0;s:12:"section_open";i:1;a:1:{i:0;i:2;}i:2;i:2148;}i:54;a:3:{i:0;s:6:"p_open";i:1;a:0:{}i:2;i:2215;}i:55;a:3:{i:0;s:5:"cdata";i:1;a:1:{i:0;s:291:"
O encontro foi passado para o dia 10 às 9:00 no PET Odonto, e é esperado que cada grupo leve um tema sobre dinâmica de grupo para ser debatido. Foram propostos dois temas para o encontro: o trac (pelo Thiago) e a rotatividade (pelo Marcos). O tema escolhido foi o trac, sob o título de ";}i:2;i:2216;}i:56;a:3:{i:0;s:18:"doublequoteopening";i:1;a:0:{}i:2;i:2507;}i:57;a:3:{i:0;s:5:"cdata";i:1;a:1:{i:0;s:48:"ferramentas que os grupos usam para se organizar";}i:2;i:2508;}i:58;a:3:{i:0;s:18:"doublequoteclosing";i:1;a:0:{}i:2;i:2556;}i:59;a:3:{i:0;s:5:"cdata";i:1;a:1:{i:0;s:36:", que será apresentado pelo Thiago.";}i:2;i:2557;}i:60;a:3:{i:0;s:7:"p_close";i:1;a:0:{}i:2;i:2593;}i:61;a:3:{i:0;s:13:"section_close";i:1;a:0:{}i:2;i:2595;}i:62;a:3:{i:0;s:12:"section_edit";i:1;a:4:{i:0;i:2148;i:1;i:2594;i:2;i:2;i:3;s:55:"6)Data e Hora para o Interpetão e proposta para o Tema";}i:2;i:2595;}i:63;a:3:{i:0;s:6:"header";i:1;a:3:{i:0;s:24:"7)Curso de Linux no CEUE";i:1;i:2;i:2;i:2595;}i:2;i:2595;}i:64;a:3:{i:0;s:12:"section_open";i:1;a:1:{i:0;i:2;}i:2;i:2595;}i:65;a:3:{i:0;s:6:"p_open";i:1;a:0:{}i:2;i:2631;}i:66;a:3:{i:0;s:5:"cdata";i:1;a:1:{i:0;s:617:"
Segundo o Fabioano, Sérgio, o administrador das redes do CEUE, que dá aulas de inglês no curso pré-vestibular deles, está interessado em dar um curso para melhorar a base de informática para os alunos. O curso seria sobre Linux e poderia ser dado por nós (já possuímos um material). Fabiano também comentou que eles estariam montando um laboratório no CEUE para o curso, e Thiago propôs que fizéssemos o curso misto com a informática (pela procura qe há no II). Será feita uma reunião com o Sérgio para planejar o curso que será administrado por Marcelo e Thiago provavelmente no semestre que vem.";}i:2;i:2632;}i:67;a:3:{i:0;s:7:"p_close";i:1;a:0:{}i:2;i:3249;}i:68;a:3:{i:0;s:13:"section_close";i:1;a:0:{}i:2;i:3251;}i:69;a:3:{i:0;s:12:"section_edit";i:1;a:4:{i:0;i:2595;i:1;i:3250;i:2;i:2;i:3;s:24:"7)Curso de Linux no CEUE";}i:2;i:3251;}i:70;a:3:{i:0;s:6:"header";i:1;a:3:{i:0;s:12:"9)Seminário";i:1;i:2;i:2;i:3251;}i:2;i:3251;}i:71;a:3:{i:0;s:12:"section_open";i:1;a:1:{i:0;i:2;}i:2;i:3251;}i:72;a:3:{i:0;s:6:"p_open";i:1;a:0:{}i:2;i:3275;}i:73;a:3:{i:0;s:5:"cdata";i:1;a:1:{i:0;s:63:"
Fabiano finalmente apresentou seu seminário sobre a Gasolina.";}i:2;i:3276;}i:74;a:3:{i:0;s:7:"p_close";i:1;a:0:{}i:2;i:3339;}i:75;a:3:{i:0;s:13:"section_close";i:1;a:0:{}i:2;i:3340;}i:76;a:3:{i:0;s:12:"section_edit";i:1;a:4:{i:0;i:3251;i:1;i:0;i:2;i:2;i:3;s:12:"9)Seminário";}i:2;i:3340;}i:77;a:3:{i:0;s:12:"document_end";i:1;a:0:{}i:2;i:3340;}}