a:138:{i:0;a:3:{i:0;s:14:"document_start";i:1;a:0:{}i:2;i:0;}i:1;a:3:{i:0;s:6:"p_open";i:1;a:0:{}i:2;i:0;}i:2;a:3:{i:0;s:7:"p_close";i:1;a:0:{}i:2;i:1;}i:3;a:3:{i:0;s:12:"section_edit";i:1;a:4:{i:0;i:-1;i:1;i:0;i:2;i:1;i:3;s:0:"";}i:2;i:1;}i:4;a:3:{i:0;s:6:"header";i:1;a:3:{i:0;s:51:"Ata da runião ordinária do grupo PET Computação";i:1;i:1;i:2;i:1;}i:2;i:1;}i:5;a:3:{i:0;s:12:"section_open";i:1;a:1:{i:0;i:1;}i:2;i:1;}i:6;a:3:{i:0;s:6:"p_open";i:1;a:0:{}i:2;i:66;}i:7;a:3:{i:0;s:5:"cdata";i:1;a:1:{i:0;s:17:"
Data: 09/11/2005";}i:2;i:67;}i:8;a:3:{i:0;s:7:"p_close";i:1;a:0:{}i:2;i:84;}i:9;a:3:{i:0;s:6:"p_open";i:1;a:0:{}i:2;i:84;}i:10;a:3:{i:0;s:5:"cdata";i:1;a:1:{i:0;s:24:"Relator: Rafael Nondillo";}i:2;i:86;}i:11;a:3:{i:0;s:7:"p_close";i:1;a:0:{}i:2;i:110;}i:12;a:3:{i:0;s:6:"p_open";i:1;a:0:{}i:2;i:110;}i:13;a:3:{i:0;s:5:"cdata";i:1;a:1:{i:0;s:42:"Ausencias justificadas: Mateus e Maurício";}i:2;i:112;}i:14;a:3:{i:0;s:7:"p_close";i:1;a:0:{}i:2;i:154;}i:15;a:3:{i:0;s:13:"section_close";i:1;a:0:{}i:2;i:156;}i:16;a:3:{i:0;s:12:"section_edit";i:1;a:4:{i:0;i:1;i:1;i:155;i:2;i:1;i:3;s:51:"Ata da runião ordinária do grupo PET Computação";}i:2;i:156;}i:17;a:3:{i:0;s:6:"header";i:1;a:3:{i:0;s:27:"Dinheiro do curso de linux:";i:1;i:3;i:2;i:156;}i:2;i:156;}i:18;a:3:{i:0;s:12:"section_open";i:1;a:1:{i:0;i:3;}i:2;i:156;}i:19;a:3:{i:0;s:6:"p_open";i:1;a:0:{}i:2;i:193;}i:20;a:3:{i:0;s:5:"cdata";i:1;a:1:{i:0;s:209:"
Irigon deixou R$ 190,00 no PET e o dinheiro sumiu. Será feita uma procura detalhada pelo dinheiro. Se este não for encontrado Paulo deverá ser ressarcido pelo PET em R$ 90,00, que foram os custos do curso.";}i:2;i:194;}i:21;a:3:{i:0;s:7:"p_close";i:1;a:0:{}i:2;i:403;}i:22;a:3:{i:0;s:13:"section_close";i:1;a:0:{}i:2;i:405;}i:23;a:3:{i:0;s:12:"section_edit";i:1;a:4:{i:0;i:156;i:1;i:404;i:2;i:3;i:3;s:27:"Dinheiro do curso de linux:";}i:2;i:405;}i:24;a:3:{i:0;s:6:"header";i:1;a:3:{i:0;s:12:"Impressoras:";i:1;i:3;i:2;i:405;}i:2;i:405;}i:25;a:3:{i:0;s:12:"section_open";i:1;a:1:{i:0;i:3;}i:2;i:405;}i:26;a:3:{i:0;s:6:"p_open";i:1;a:0:{}i:2;i:427;}i:27;a:3:{i:0;s:5:"cdata";i:1;a:1:{i:0;s:208:"
Thiago foi reclamar e não há previsão para resolver a situação. Petianos não estão sendo considerados bolsistas. Thiago tentará novamente resolver o problema entrando em contato com os responsáveis.";}i:2;i:428;}i:28;a:3:{i:0;s:7:"p_close";i:1;a:0:{}i:2;i:636;}i:29;a:3:{i:0;s:13:"section_close";i:1;a:0:{}i:2;i:638;}i:30;a:3:{i:0;s:12:"section_edit";i:1;a:4:{i:0;i:405;i:1;i:637;i:2;i:3;i:3;s:12:"Impressoras:";}i:2;i:638;}i:31;a:3:{i:0;s:6:"header";i:1;a:3:{i:0;s:14:"Ofício Ramal:";i:1;i:3;i:2;i:638;}i:2;i:638;}i:32;a:3:{i:0;s:12:"section_open";i:1;a:1:{i:0;i:3;}i:2;i:638;}i:33;a:3:{i:0;s:6:"p_open";i:1;a:0:{}i:2;i:662;}i:34;a:3:{i:0;s:5:"cdata";i:1;a:1:{i:0;s:83:"
Thiago e Maurício vão solicitar novamente o ramal junto ao diretor do instituto.";}i:2;i:663;}i:35;a:3:{i:0;s:7:"p_close";i:1;a:0:{}i:2;i:746;}i:36;a:3:{i:0;s:13:"section_close";i:1;a:0:{}i:2;i:748;}i:37;a:3:{i:0;s:12:"section_edit";i:1;a:4:{i:0;i:638;i:1;i:747;i:2;i:3;i:3;s:14:"Ofício Ramal:";}i:2;i:748;}i:38;a:3:{i:0;s:6:"header";i:1;a:3:{i:0;s:12:"Interpetão:";i:1;i:3;i:2;i:748;}i:2;i:748;}i:39;a:3:{i:0;s:12:"section_open";i:1;a:1:{i:0;i:3;}i:2;i:748;}i:40;a:3:{i:0;s:6:"p_open";i:1;a:0:{}i:2;i:770;}i:41;a:3:{i:0;s:5:"cdata";i:1;a:1:{i:0;s:82:"
Muitos não podem do dia 19/11. Paulo e Diego vão sugerir que seja no dia 26/11.";}i:2;i:771;}i:42;a:3:{i:0;s:7:"p_close";i:1;a:0:{}i:2;i:853;}i:43;a:3:{i:0;s:13:"section_close";i:1;a:0:{}i:2;i:855;}i:44;a:3:{i:0;s:12:"section_edit";i:1;a:4:{i:0;i:748;i:1;i:854;i:2;i:3;i:3;s:12:"Interpetão:";}i:2;i:855;}i:45;a:3:{i:0;s:6:"header";i:1;a:3:{i:0;s:17:"Horas duplicadas:";i:1;i:3;i:2;i:855;}i:2;i:855;}i:46;a:3:{i:0;s:12:"section_open";i:1;a:1:{i:0;i:3;}i:2;i:855;}i:47;a:3:{i:0;s:6:"p_open";i:1;a:0:{}i:2;i:882;}i:48;a:3:{i:0;s:5:"cdata";i:1;a:1:{i:0;s:128:"
Excluindo-se as horas duplicadas, Maurício não completou 48h. Faltaram 20 min para o paulo, que recuperará no próximo mês.";}i:2;i:883;}i:49;a:3:{i:0;s:7:"p_close";i:1;a:0:{}i:2;i:1011;}i:50;a:3:{i:0;s:13:"section_close";i:1;a:0:{}i:2;i:1013;}i:51;a:3:{i:0;s:12:"section_edit";i:1;a:4:{i:0;i:855;i:1;i:1012;i:2;i:3;i:3;s:17:"Horas duplicadas:";}i:2;i:1013;}i:52;a:3:{i:0;s:6:"header";i:1;a:3:{i:0;s:30:"Visita ao Colégio Anne Frank:";i:1;i:3;i:2;i:1013;}i:2;i:1013;}i:53;a:3:{i:0;s:12:"section_open";i:1;a:1:{i:0;i:3;}i:2;i:1013;}i:54;a:3:{i:0;s:6:"p_open";i:1;a:0:{}i:2;i:1053;}i:55;a:3:{i:0;s:5:"cdata";i:1;a:1:{i:0;s:243:"
Nova reunião marcada para o dia 22/11 para avaliar o nível e interesse dos alunos. Thiago e Diego irão. Thiago procurou bibliografia para trabalhar com os alunos e irá analisar melhor o projeto antes de decidir se aceita a tarefa ou não.";}i:2;i:1054;}i:56;a:3:{i:0;s:7:"p_close";i:1;a:0:{}i:2;i:1297;}i:57;a:3:{i:0;s:13:"section_close";i:1;a:0:{}i:2;i:1299;}i:58;a:3:{i:0;s:12:"section_edit";i:1;a:4:{i:0;i:1013;i:1;i:1298;i:2;i:3;i:3;s:30:"Visita ao Colégio Anne Frank:";}i:2;i:1299;}i:59;a:3:{i:0;s:6:"header";i:1;a:3:{i:0;s:44:"LEI do PET e portaria que regulamenta o PET:";i:1;i:3;i:2;i:1299;}i:2;i:1299;}i:60;a:3:{i:0;s:12:"section_open";i:1;a:1:{i:0;i:3;}i:2;i:1299;}i:61;a:3:{i:0;s:6:"p_open";i:1;a:0:{}i:2;i:1353;}i:62;a:3:{i:0;s:5:"cdata";i:1;a:1:{i:0;s:137:"
Todos devem ler para discussão em 2 semanas. Chamou-se atenção sobre um ponto: todos devem apresentar um projeto de pesquisa por ano.";}i:2;i:1354;}i:63;a:3:{i:0;s:7:"p_close";i:1;a:0:{}i:2;i:1491;}i:64;a:3:{i:0;s:13:"section_close";i:1;a:0:{}i:2;i:1493;}i:65;a:3:{i:0;s:12:"section_edit";i:1;a:4:{i:0;i:1299;i:1;i:1492;i:2;i:3;i:3;s:44:"LEI do PET e portaria que regulamenta o PET:";}i:2;i:1493;}i:66;a:3:{i:0;s:6:"header";i:1;a:3:{i:0;s:36:"Planejamnto de atividades culturais:";i:1;i:3;i:2;i:1493;}i:2;i:1493;}i:67;a:3:{i:0;s:12:"section_open";i:1;a:1:{i:0;i:3;}i:2;i:1493;}i:68;a:3:{i:0;s:6:"p_open";i:1;a:0:{}i:2;i:1539;}i:69;a:3:{i:0;s:5:"cdata";i:1;a:1:{i:0;s:25:"
Nondillo sugere o livro ";}i:2;i:1540;}i:70;a:3:{i:0;s:18:"doublequoteopening";i:1;a:0:{}i:2;i:1565;}i:71;a:3:{i:0;s:5:"cdata";i:1;a:1:{i:0;s:18:"A Utopia do Brasil";}i:2;i:1566;}i:72;a:3:{i:0;s:18:"doublequoteclosing";i:1;a:0:{}i:2;i:1584;}i:73;a:3:{i:0;s:5:"cdata";i:1;a:1:{i:0;s:156:" de Legrand para próxima leitura. Discussão dia 21/12. Robert, Paula, Nondillo e Fabiano lerão o livro. Nondillo irá comprar o livro para o PET. Dante: ";}i:2;i:1585;}i:74;a:3:{i:0;s:18:"doublequoteopening";i:1;a:0:{}i:2;i:1741;}i:75;a:3:{i:0;s:5:"cdata";i:1;a:1:{i:0;s:33:"O importante é abrir horizontes!";}i:2;i:1742;}i:76;a:3:{i:0;s:18:"doublequoteclosing";i:1;a:0:{}i:2;i:1775;}i:77;a:3:{i:0;s:5:"cdata";i:1;a:1:{i:0;s:1:".";}i:2;i:1776;}i:78;a:3:{i:0;s:7:"p_close";i:1;a:0:{}i:2;i:1777;}i:79;a:3:{i:0;s:13:"section_close";i:1;a:0:{}i:2;i:1779;}i:80;a:3:{i:0;s:12:"section_edit";i:1;a:4:{i:0;i:1493;i:1;i:1778;i:2;i:3;i:3;s:36:"Planejamnto de atividades culturais:";}i:2;i:1779;}i:81;a:3:{i:0;s:6:"header";i:1;a:3:{i:0;s:14:"Curso de HTML:";i:1;i:3;i:2;i:1779;}i:2;i:1779;}i:82;a:3:{i:0;s:12:"section_open";i:1;a:1:{i:0;i:3;}i:2;i:1779;}i:83;a:3:{i:0;s:6:"p_open";i:1;a:0:{}i:2;i:1803;}i:84;a:3:{i:0;s:5:"cdata";i:1;a:1:{i:0;s:249:"
Prefeitura demonstrou interesse. Fica definido um curso de 16h, sendo cobrado R$ 50,00 para pessoas de fora da UFRGS e R$ 15,00 para alunos da universidade. Gustavo e Paula vão ministrar o curso para 25 alunos nos dias 15/12, 16/12, 19/12 e 20/12.";}i:2;i:1804;}i:85;a:3:{i:0;s:7:"p_close";i:1;a:0:{}i:2;i:2053;}i:86;a:3:{i:0;s:13:"section_close";i:1;a:0:{}i:2;i:2055;}i:87;a:3:{i:0;s:12:"section_edit";i:1;a:4:{i:0;i:1779;i:1;i:2054;i:2;i:3;i:3;s:14:"Curso de HTML:";}i:2;i:2055;}i:88;a:3:{i:0;s:6:"header";i:1;a:3:{i:0;s:40:"Preenchimento de atividades de extensao:";i:1;i:3;i:2;i:2055;}i:2;i:2055;}i:89;a:3:{i:0;s:12:"section_open";i:1;a:1:{i:0;i:3;}i:2;i:2055;}i:90;a:3:{i:0;s:6:"p_open";i:1;a:0:{}i:2;i:2105;}i:91;a:3:{i:0;s:5:"cdata";i:1;a:1:{i:0;s:184:"
As atividades realizadas na SNCT, o curso de linux e o curso de java deverão ser cadastradas no sistema até 24/12/2005. Os responsáveis pelas atividades devem fazer os relatórios.";}i:2;i:2106;}i:92;a:3:{i:0;s:7:"p_close";i:1;a:0:{}i:2;i:2290;}i:93;a:3:{i:0;s:13:"section_close";i:1;a:0:{}i:2;i:2292;}i:94;a:3:{i:0;s:12:"section_edit";i:1;a:4:{i:0;i:2055;i:1;i:2291;i:2;i:3;i:3;s:40:"Preenchimento de atividades de extensao:";}i:2;i:2292;}i:95;a:3:{i:0;s:6:"header";i:1;a:3:{i:0;s:64:"Auxílio a sistematização de documentos PET em posse do tutor:";i:1;i:3;i:2;i:2292;}i:2;i:2292;}i:96;a:3:{i:0;s:12:"section_open";i:1;a:1:{i:0;i:3;}i:2;i:2292;}i:97;a:3:{i:0;s:6:"p_open";i:1;a:0:{}i:2;i:2366;}i:98;a:3:{i:0;s:5:"cdata";i:1;a:1:{i:0;s:49:"
Atividade burocrática. Paulo fica responsável.";}i:2;i:2367;}i:99;a:3:{i:0;s:7:"p_close";i:1;a:0:{}i:2;i:2416;}i:100;a:3:{i:0;s:13:"section_close";i:1;a:0:{}i:2;i:2418;}i:101;a:3:{i:0;s:12:"section_edit";i:1;a:4:{i:0;i:2292;i:1;i:2417;i:2;i:3;i:3;s:64:"Auxílio a sistematização de documentos PET em posse do tutor:";}i:2;i:2418;}i:102;a:3:{i:0;s:6:"header";i:1;a:3:{i:0;s:63:"Encaminhamento para discussao do documento Reflexao sobre o II:";i:1;i:3;i:2;i:2418;}i:2;i:2418;}i:103;a:3:{i:0;s:12:"section_open";i:1;a:1:{i:0;i:3;}i:2;i:2418;}i:104;a:3:{i:0;s:6:"p_open";i:1;a:0:{}i:2;i:2491;}i:105;a:3:{i:0;s:5:"cdata";i:1;a:1:{i:0;s:24:"
Sugestão de reflexão.";}i:2;i:2492;}i:106;a:3:{i:0;s:7:"p_close";i:1;a:0:{}i:2;i:2516;}i:107;a:3:{i:0;s:13:"section_close";i:1;a:0:{}i:2;i:2518;}i:108;a:3:{i:0;s:12:"section_edit";i:1;a:4:{i:0;i:2418;i:1;i:2517;i:2;i:3;i:3;s:63:"Encaminhamento para discussao do documento Reflexao sobre o II:";}i:2;i:2518;}i:109;a:3:{i:0;s:6:"header";i:1;a:3:{i:0;s:26:"Novo projeto de robótica:";i:1;i:3;i:2;i:2518;}i:2;i:2518;}i:110;a:3:{i:0;s:12:"section_open";i:1;a:1:{i:0;i:3;}i:2;i:2518;}i:111;a:3:{i:0;s:6:"p_open";i:1;a:0:{}i:2;i:2554;}i:112;a:3:{i:0;s:5:"cdata";i:1;a:1:{i:0;s:136:"
Surgiu a possibilidade de uma nova pesquisa no PET (Braço robótico). Há interesse do Robert e Nondillo, mas nada ainda foi definido.";}i:2;i:2555;}i:113;a:3:{i:0;s:7:"p_close";i:1;a:0:{}i:2;i:2691;}i:114;a:3:{i:0;s:13:"section_close";i:1;a:0:{}i:2;i:2693;}i:115;a:3:{i:0;s:12:"section_edit";i:1;a:4:{i:0;i:2518;i:1;i:2692;i:2;i:3;i:3;s:26:"Novo projeto de robótica:";}i:2;i:2693;}i:116;a:3:{i:0;s:6:"header";i:1;a:3:{i:0;s:29:"Reforma de currículo da ECP:";i:1;i:3;i:2;i:2693;}i:2;i:2693;}i:117;a:3:{i:0;s:12:"section_open";i:1;a:1:{i:0;i:3;}i:2;i:2693;}i:118;a:3:{i:0;s:6:"p_open";i:1;a:0:{}i:2;i:2732;}i:119;a:3:{i:0;s:5:"cdata";i:1;a:1:{i:0;s:291:"
Nondillo auxiliará Dante na criação de um ofício para solicitar alterações no currículo da ECP, mais precisamente abrindo pré-requisitos da cadeira de Robótica II, a qual conta com pouquíssimos alunos atualmente, simbolizando, de certa forma, um desperdício de dinheiro público.";}i:2;i:2733;}i:120;a:3:{i:0;s:7:"p_close";i:1;a:0:{}i:2;i:3024;}i:121;a:3:{i:0;s:13:"section_close";i:1;a:0:{}i:2;i:3026;}i:122;a:3:{i:0;s:12:"section_edit";i:1;a:4:{i:0;i:2693;i:1;i:3025;i:2;i:3;i:3;s:29:"Reforma de currículo da ECP:";}i:2;i:3026;}i:123;a:3:{i:0;s:6:"header";i:1;a:3:{i:0;s:27:"Reforma do estatuto e RI's:";i:1;i:3;i:2;i:3026;}i:2;i:3026;}i:124;a:3:{i:0;s:12:"section_open";i:1;a:1:{i:0;i:3;}i:2;i:3026;}i:125;a:3:{i:0;s:6:"p_open";i:1;a:0:{}i:2;i:3063;}i:126;a:3:{i:0;s:5:"cdata";i:1;a:1:{i:0;s:134:"
Muita discussão. Os documentos foram encaminhados por e-mail para todos lerem e a discussão deverá continuar na próxima reunião.";}i:2;i:3064;}i:127;a:3:{i:0;s:7:"p_close";i:1;a:0:{}i:2;i:3198;}i:128;a:3:{i:0;s:13:"section_close";i:1;a:0:{}i:2;i:3200;}i:129;a:3:{i:0;s:12:"section_edit";i:1;a:4:{i:0;i:3026;i:1;i:3199;i:2;i:3;i:3;s:27:"Reforma do estatuto e RI's:";}i:2;i:3200;}i:130;a:3:{i:0;s:6:"header";i:1;a:3:{i:0;s:67:"Formato de intercambio de documentos e informacoes oficiais do PET:";i:1;i:3;i:2;i:3200;}i:2;i:3200;}i:131;a:3:{i:0;s:12:"section_open";i:1;a:1:{i:0;i:3;}i:2;i:3200;}i:132;a:3:{i:0;s:6:"p_open";i:1;a:0:{}i:2;i:3277;}i:133;a:3:{i:0;s:5:"cdata";i:1;a:1:{i:0;s:56:"
Discussão sobre formatos, mas nenhuma decisão tomada.";}i:2;i:3278;}i:134;a:3:{i:0;s:7:"p_close";i:1;a:0:{}i:2;i:3334;}i:135;a:3:{i:0;s:13:"section_close";i:1;a:0:{}i:2;i:3335;}i:136;a:3:{i:0;s:12:"section_edit";i:1;a:4:{i:0;i:3200;i:1;i:0;i:2;i:3;i:3;s:67:"Formato de intercambio de documentos e informacoes oficiais do PET:";}i:2;i:3335;}i:137;a:3:{i:0;s:12:"document_end";i:1;a:0:{}i:2;i:3335;}}