a:110:{i:0;a:3:{i:0;s:14:"document_start";i:1;a:0:{}i:2;i:0;}i:1;a:3:{i:0;s:6:"p_open";i:1;a:0:{}i:2;i:0;}i:2;a:3:{i:0;s:7:"p_close";i:1;a:0:{}i:2;i:1;}i:3;a:3:{i:0;s:12:"section_edit";i:1;a:4:{i:0;i:-1;i:1;i:0;i:2;i:1;i:3;s:0:"";}i:2;i:1;}i:4;a:3:{i:0;s:6:"header";i:1;a:3:{i:0;s:29:"Ata da reunião de 19/04/2006";i:1;i:2;i:2;i:1;}i:2;i:1;}i:5;a:3:{i:0;s:12:"section_open";i:1;a:1:{i:0;i:2;}i:2;i:1;}i:6;a:3:{i:0;s:6:"p_open";i:1;a:0:{}i:2;i:42;}i:7;a:3:{i:0;s:5:"cdata";i:1;a:1:{i:0;s:140:"
Presentes:Alexandre, Dante, Estevão, Fabiano, Felipe, Gabriela, Lucas Cavalheiro, Lucas Mizusaki, Marcelo, Marcos, Nondillo,Pablo, Ricardo";}i:2;i:43;}i:8;a:3:{i:0;s:7:"p_close";i:1;a:0:{}i:2;i:183;}i:9;a:3:{i:0;s:6:"p_open";i:1;a:0:{}i:2;i:183;}i:10;a:3:{i:0;s:5:"cdata";i:1;a:1:{i:0;s:26:"Ausentes: Eduardo e Thiago";}i:2;i:185;}i:11;a:3:{i:0;s:7:"p_close";i:1;a:0:{}i:2;i:211;}i:12;a:3:{i:0;s:6:"p_open";i:1;a:0:{}i:2;i:211;}i:13;a:3:{i:0;s:5:"cdata";i:1;a:1:{i:0;s:15:"Relator:Marcelo";}i:2;i:213;}i:14;a:3:{i:0;s:7:"p_close";i:1;a:0:{}i:2;i:228;}i:15;a:3:{i:0;s:13:"section_close";i:1;a:0:{}i:2;i:230;}i:16;a:3:{i:0;s:12:"section_edit";i:1;a:4:{i:0;i:1;i:1;i:229;i:2;i:2;i:3;s:29:"Ata da reunião de 19/04/2006";}i:2;i:230;}i:17;a:3:{i:0;s:6:"header";i:1;a:3:{i:0;s:32:"1)Apresentação do novo petiano";i:1;i:2;i:2;i:230;}i:2;i:230;}i:18;a:3:{i:0;s:12:"section_open";i:1;a:1:{i:0;i:2;}i:2;i:230;}i:19;a:3:{i:0;s:6:"p_open";i:1;a:0:{}i:2;i:274;}i:20;a:3:{i:0;s:5:"cdata";i:1;a:1:{i:0;s:303:"
Foi apresentado ao grupo o novo petiano, devido ao desligamento do Vicente, seu nome é Pablo e cursa o sexto semestre de CIC.Tem programação WEB e banco de dados como áreas de interesse.Posteriormente, os integrantes do grupo se apresentaram ao Pablo.Ficou decidido que Estevão apadrinhará Pablo.";}i:2;i:275;}i:21;a:3:{i:0;s:7:"p_close";i:1;a:0:{}i:2;i:578;}i:22;a:3:{i:0;s:13:"section_close";i:1;a:0:{}i:2;i:580;}i:23;a:3:{i:0;s:12:"section_edit";i:1;a:4:{i:0;i:230;i:1;i:579;i:2;i:2;i:3;s:32:"1)Apresentação do novo petiano";}i:2;i:580;}i:24;a:3:{i:0;s:6:"header";i:1;a:3:{i:0;s:50:"2)Conferência Municipal de Ciência e Tecnologia:";i:1;i:2;i:2;i:580;}i:2;i:580;}i:25;a:3:{i:0;s:12:"section_open";i:1;a:1:{i:0;i:2;}i:2;i:580;}i:26;a:3:{i:0;s:6:"p_open";i:1;a:0:{}i:2;i:642;}i:27;a:3:{i:0;s:5:"cdata";i:1;a:1:{i:0;s:403:"
Dante fala que a conferência será dia 17/05 em POA.Nela serão definidas as prioridades do município nesta área.Dante pergunta ao grupo se alguém tem interesse em ir ao evneto, mas depois lembra-se que acontecerá problemas em ir a Pré-Conferência, visto que será no mesmo dia que os ciclos de debates.Fica decidido que o grupo terá possibilidade de ir ao evento, mas isso dependerá do turno.";}i:2;i:643;}i:28;a:3:{i:0;s:7:"p_close";i:1;a:0:{}i:2;i:1046;}i:29;a:3:{i:0;s:13:"section_close";i:1;a:0:{}i:2;i:1048;}i:30;a:3:{i:0;s:12:"section_edit";i:1;a:4:{i:0;i:580;i:1;i:1047;i:2;i:2;i:3;s:50:"2)Conferência Municipal de Ciência e Tecnologia:";}i:2;i:1048;}i:31;a:3:{i:0;s:6:"header";i:1;a:3:{i:0;s:18:"3)Cafeteira no PET";i:1;i:2;i:2;i:1048;}i:2;i:1048;}i:32;a:3:{i:0;s:12:"section_open";i:1;a:1:{i:0;i:2;}i:2;i:1048;}i:33;a:3:{i:0;s:6:"p_open";i:1;a:0:{}i:2;i:1078;}i:34;a:3:{i:0;s:5:"cdata";i:1;a:1:{i:0;s:16:"
Dante fala que ";}i:2;i:1079;}i:35;a:3:{i:0;s:18:"doublequoteopening";i:1;a:0:{}i:2;i:1095;}i:36;a:3:{i:0;s:5:"cdata";i:1;a:1:{i:0;s:5:"quase";}i:2;i:1096;}i:37;a:3:{i:0;s:18:"doublequoteclosing";i:1;a:0:{}i:2;i:1101;}i:38;a:3:{i:0;s:5:"cdata";i:1;a:1:{i:0;s:36:" conseguiu uma cafeteira pro PET na ";}i:2;i:1102;}i:39;a:3:{i:0;s:12:"internallink";i:1;a:2:{i:0;s:20:"/trac/wiki/TechRobot";i:1;s:10:"TechRobot?";}i:2;i:1138;}i:40;a:3:{i:0;s:5:"cdata";i:1;a:1:{i:0;s:274:", mas que ela já tinha sido anteriormente doada.Fabiano comenta sobre uma possível proposta de troca de material de consumo(folhas) pela cafeteira, que , por sinal, está sendo mal utilizada.Fabiano diz a Dante que irá tentar negociar novamente a cafeteira com André da ";}i:2;i:1173;}i:41;a:3:{i:0;s:12:"internallink";i:1;a:2:{i:0;s:20:"/trac/wiki/TechRobot";i:1;s:10:"TechRobot?";}i:2;i:1447;}i:42;a:3:{i:0;s:5:"cdata";i:1;a:1:{i:0;s:113:".Por sua vez, Dante enviará um e-mail para Leoci perguntando quando poderão retirar os equipamentos da sala da ";}i:2;i:1482;}i:43;a:3:{i:0;s:12:"internallink";i:1;a:2:{i:0;s:20:"/trac/wiki/TechRobot";i:1;s:10:"TechRobot?";}i:2;i:1595;}i:44;a:3:{i:0;s:5:"cdata";i:1;a:1:{i:0;s:150:". Neste meio tempo, Dante garante ao grupo que será realizado até a próxima semana o pagamento das Bolsas atrasadas de Janeiro, Fevereiro e Março.";}i:2;i:1630;}i:45;a:3:{i:0;s:7:"p_close";i:1;a:0:{}i:2;i:1780;}i:46;a:3:{i:0;s:13:"section_close";i:1;a:0:{}i:2;i:1782;}i:47;a:3:{i:0;s:12:"section_edit";i:1;a:4:{i:0;i:1048;i:1;i:1781;i:2;i:2;i:3;s:18:"3)Cafeteira no PET";}i:2;i:1782;}i:48;a:3:{i:0;s:6:"header";i:1;a:3:{i:0;s:18:"4)Faltas do Thiago";i:1;i:2;i:2;i:1782;}i:2;i:1782;}i:49;a:3:{i:0;s:12:"section_open";i:1;a:1:{i:0;i:2;}i:2;i:1782;}i:50;a:3:{i:0;s:6:"p_open";i:1;a:0:{}i:2;i:1812;}i:51;a:3:{i:0;s:5:"cdata";i:1;a:1:{i:0;s:159:"
Fabiano fala ao grupo que enviou e-mail ao Thiago solicitando as atividades da semana, mas Thiago não as colocou.Isso será colocado no histórico de faltas.";}i:2;i:1813;}i:52;a:3:{i:0;s:7:"p_close";i:1;a:0:{}i:2;i:1972;}i:53;a:3:{i:0;s:13:"section_close";i:1;a:0:{}i:2;i:1974;}i:54;a:3:{i:0;s:12:"section_edit";i:1;a:4:{i:0;i:1782;i:1;i:1973;i:2;i:2;i:3;s:18:"4)Faltas do Thiago";}i:2;i:1974;}i:55;a:3:{i:0;s:6:"header";i:1;a:3:{i:0;s:15:"5)Bolsa dos EUA";i:1;i:2;i:2;i:1974;}i:2;i:1974;}i:56;a:3:{i:0;s:12:"section_open";i:1;a:1:{i:0;i:2;}i:2;i:1974;}i:57;a:3:{i:0;s:6:"p_open";i:1;a:0:{}i:2;i:2001;}i:58;a:3:{i:0;s:5:"cdata";i:1;a:1:{i:0;s:347:"
Dante fala sobre a desistência, na última hora, da universidade dos EUA em conceder bolsas.Mesmo a proposta sendo muito boa, o que custou horas de trabalho de Dante, prof. Manuel e Thiago, não terá seguimento as bolsas. Dante considera isso uma grande falta de profissionalismo, visto que esforçaram-se muito para fazer isso em tempo hábil.";}i:2;i:2002;}i:59;a:3:{i:0;s:7:"p_close";i:1;a:0:{}i:2;i:2349;}i:60;a:3:{i:0;s:13:"section_close";i:1;a:0:{}i:2;i:2351;}i:61;a:3:{i:0;s:12:"section_edit";i:1;a:4:{i:0;i:1974;i:1;i:2350;i:2;i:2;i:3;s:15:"5)Bolsa dos EUA";}i:2;i:2351;}i:62;a:3:{i:0;s:6:"header";i:1;a:3:{i:0;s:8:"6)SulPET";i:1;i:2;i:2;i:2351;}i:2;i:2351;}i:63;a:3:{i:0;s:12:"section_open";i:1;a:1:{i:0;i:2;}i:2;i:2351;}i:64;a:3:{i:0;s:6:"p_open";i:1;a:0:{}i:2;i:2371;}i:65;a:3:{i:0;s:5:"cdata";i:1;a:1:{i:0;s:42:"
Felipe pergunta sobre horas pendentes no ";}i:2;i:2372;}i:66;a:3:{i:0;s:13:"camelcaselink";i:1;a:1:{i:0;s:6:"SulPET";}i:2;i:2414;}i:67;a:3:{i:0;s:5:"cdata";i:1;a:1:{i:0;s:356:".É decidido pelo grupo quem quem participará neste evento ganhará 6h pendentes.Posteriormente, Marcelo pergunta como ficará a situação daqueles que forem ao Fórum de Software Livre.Comenta-se sobre a possibilidade de Thiago, visto que apresentou trabalho, possivelmente ganhará-las.Aos outros, se faltarem horas no mês, será decidido caso a caso.";}i:2;i:2420;}i:68;a:3:{i:0;s:7:"p_close";i:1;a:0:{}i:2;i:2776;}i:69;a:3:{i:0;s:13:"section_close";i:1;a:0:{}i:2;i:2778;}i:70;a:3:{i:0;s:12:"section_edit";i:1;a:4:{i:0;i:2351;i:1;i:2777;i:2;i:2;i:3;s:8:"6)SulPET";}i:2;i:2778;}i:71;a:3:{i:0;s:6:"header";i:1;a:3:{i:0;s:19:"7)Texto sobre o PET";i:1;i:2;i:2;i:2778;}i:2;i:2778;}i:72;a:3:{i:0;s:12:"section_open";i:1;a:1:{i:0;i:2;}i:2;i:2778;}i:73;a:3:{i:0;s:6:"p_open";i:1;a:0:{}i:2;i:2809;}i:74;a:3:{i:0;s:5:"cdata";i:1;a:1:{i:0;s:233:"
Marcelo comenta que leu um texto na Internet sobre a história e objetivos do PET, escrito pelo seu criador.Recomenda a todos que o leiam.Flores diz que já o leu.Fabiano comenta que tem um livro que conta muito bem essa história: ";}i:2;i:2810;}i:75;a:3:{i:0;s:18:"doublequoteopening";i:1;a:0:{}i:2;i:3043;}i:76;a:3:{i:0;s:5:"cdata";i:1;a:1:{i:0;s:28:"Qualidade no ensino superior";}i:2;i:3044;}i:77;a:3:{i:0;s:18:"doublequoteclosing";i:1;a:0:{}i:2;i:3072;}i:78;a:3:{i:0;s:5:"cdata";i:1;a:1:{i:0;s:242:".Dante fala que ao longo do tempo o grupo evoluiu muito, ficou muito mais social, e que deve ter Ensino, Pesquisa e Extensão.Dante critica o criador do programa, que mesmo sendo colunista da VEja, nunca escreveu sequer uma linha sobre o PET.";}i:2;i:3073;}i:79;a:3:{i:0;s:7:"p_close";i:1;a:0:{}i:2;i:3315;}i:80;a:3:{i:0;s:13:"section_close";i:1;a:0:{}i:2;i:3317;}i:81;a:3:{i:0;s:12:"section_edit";i:1;a:4:{i:0;i:2778;i:1;i:3316;i:2;i:2;i:3;s:19:"7)Texto sobre o PET";}i:2;i:3317;}i:82;a:3:{i:0;s:6:"header";i:1;a:3:{i:0;s:41:"8)Comentários sobre a confraternização";i:1;i:2;i:2;i:3317;}i:2;i:3317;}i:83;a:3:{i:0;s:12:"section_open";i:1;a:1:{i:0;i:2;}i:2;i:3317;}i:84;a:3:{i:0;s:6:"p_open";i:1;a:0:{}i:2;i:3370;}i:85;a:3:{i:0;s:5:"cdata";i:1;a:1:{i:0;s:271:"
Fabiano elogia a organização da confraternização e comenta sobre os fracassos da outra confraternização.Também diz que Vicente estava disestimulado.Marcos e Marcelo comentam que conversaram com ele, e ele está cheio de dúvidas, pensando até em trocar de curso.";}i:2;i:3371;}i:86;a:3:{i:0;s:7:"p_close";i:1;a:0:{}i:2;i:3642;}i:87;a:3:{i:0;s:13:"section_close";i:1;a:0:{}i:2;i:3644;}i:88;a:3:{i:0;s:12:"section_edit";i:1;a:4:{i:0;i:3317;i:1;i:3643;i:2;i:2;i:3;s:41:"8)Comentários sobre a confraternização";}i:2;i:3644;}i:89;a:3:{i:0;s:6:"header";i:1;a:3:{i:0;s:21:"9)Ciclos de Extensão";i:1;i:2;i:2;i:3644;}i:2;i:3644;}i:90;a:3:{i:0;s:12:"section_open";i:1;a:1:{i:0;i:2;}i:2;i:3644;}i:91;a:3:{i:0;s:6:"p_open";i:1;a:0:{}i:2;i:3677;}i:92;a:3:{i:0;s:5:"cdata";i:1;a:1:{i:0;s:267:"
Nondillo fala que serão 4 dias de debates: *No primeiro, terá relatos dos alunos brasileiros e franceses das experiências Brasil-&gt;França e França-&gt;Brasil.Além disso, terá uma apresentação de uma mulher da CAPES. *No segundo, será discutida o assunto ";}i:2;i:3678;}i:93;a:3:{i:0;s:18:"doublequoteopening";i:1;a:0:{}i:2;i:3945;}i:94;a:3:{i:0;s:5:"cdata";i:1;a:1:{i:0;s:21:"Mobilidade Acadêmica";}i:2;i:3946;}i:95;a:3:{i:0;s:18:"doublequoteclosing";i:1;a:0:{}i:2;i:3967;}i:96;a:3:{i:0;s:5:"cdata";i:1;a:1:{i:0;s:490:". *Já no terceiro e quarto dia, um será dedicado ao curso CIC e outro ECP.Terá participação dos membros das Comgrad's.Alunos poderão sugerir mudanças nos currículos. Dante fala que até quarta que vem tudo já deve estar organizado(programação definitiva).Este ciclo de palestras valerá um crédito, para 40 pessoas inscritas(provavelmente, 20 da CIC e 20 da ECP).Já o primeiro e segundo dia serão abertos ao público.Dante pede que o grupo faça um marketing sobre esse ciclo.";}i:2;i:3968;}i:97;a:3:{i:0;s:7:"p_close";i:1;a:0:{}i:2;i:4458;}i:98;a:3:{i:0;s:13:"section_close";i:1;a:0:{}i:2;i:4460;}i:99;a:3:{i:0;s:12:"section_edit";i:1;a:4:{i:0;i:3644;i:1;i:4459;i:2;i:2;i:3;s:21:"9)Ciclos de Extensão";}i:2;i:4460;}i:100;a:3:{i:0;s:6:"header";i:1;a:3:{i:0;s:8:"10)Museu";i:1;i:2;i:2;i:4460;}i:2;i:4460;}i:101;a:3:{i:0;s:12:"section_open";i:1;a:1:{i:0;i:2;}i:2;i:4460;}i:102;a:3:{i:0;s:6:"p_open";i:1;a:0:{}i:2;i:4480;}i:103;a:3:{i:0;s:5:"cdata";i:1;a:1:{i:0;s:658:"
Petianos relatam sobre a reunião com o prof. Cabral sobre o museu.Dizem que Cabral foi muitom útil, relatando sobre algumas peças que o grupo desconhecia.Após, os petianos comentam que Cabral pediu ao grupo para dar maior ênfase as coisas que funcionam e as que não funcionam, somente dar ênfase as que tenham maior relevância. Marcelo e Lucas C. perguntam a Dante se é para dar mais ênfase nos artigos para o público mais leigo ou informatas.É decidido, informalmente, que será dada maior ênfase ao público mais leigo, ou seja, artigos mais históricos do que citando como funcionam as peças. Dante pede ao grupo para mandar um e-mail para ";}i:2;i:4481;}i:104;a:3:{i:0;s:9:"emaillink";i:1;a:2:{i:0;s:33:"mailto:alexandro.bof@inf.ufrgs.br";i:1;s:26:"alexandro.bof@inf.ufrgs.br";}i:2;i:5139;}i:105;a:3:{i:0;s:5:"cdata";i:1;a:1:{i:0;s:305:" com o catálago atual das peças.Também pede para que o grupo decida o que será mostrado, layout etc. É para ser feita até a próxima reunião uma descrição inicial da mostra.Dante também comenta que poderão ser liberados para a construção do museu de informática da UFRGS R$15 mi(ou R$4,4mi).";}i:2;i:5203;}i:106;a:3:{i:0;s:7:"p_close";i:1;a:0:{}i:2;i:5508;}i:107;a:3:{i:0;s:13:"section_close";i:1;a:0:{}i:2;i:5509;}i:108;a:3:{i:0;s:12:"section_edit";i:1;a:4:{i:0;i:4460;i:1;i:0;i:2;i:2;i:3;s:8:"10)Museu";}i:2;i:5509;}i:109;a:3:{i:0;s:12:"document_end";i:1;a:0:{}i:2;i:5509;}}