a:45:{i:0;a:3:{i:0;s:14:"document_start";i:1;a:0:{}i:2;i:0;}i:1;a:3:{i:0;s:6:"p_open";i:1;a:0:{}i:2;i:0;}i:2;a:3:{i:0;s:7:"p_close";i:1;a:0:{}i:2;i:1;}i:3;a:3:{i:0;s:12:"section_edit";i:1;a:4:{i:0;i:-1;i:1;i:0;i:2;i:1;i:3;s:0:"";}i:2;i:1;}i:4;a:3:{i:0;s:6:"header";i:1;a:3:{i:0;s:8:"Pagemove";i:1;i:1;i:2;i:1;}i:2;i:1;}i:5;a:3:{i:0;s:12:"section_open";i:1;a:1:{i:0;i:1;}i:2;i:1;}i:6;a:3:{i:0;s:6:"p_open";i:1;a:0:{}i:2;i:23;}i:7;a:3:{i:0;s:5:"cdata";i:1;a:1:{i:0;s:102:"
This plugin allows you to move and/or rename the current document within the following restrictions.
";}i:2;i:24;}i:8;a:3:{i:0;s:7:"p_close";i:1;a:0:{}i:2;i:126;}i:9;a:3:{i:0;s:10:"listu_open";i:1;a:0:{}i:2;i:126;}i:10;a:3:{i:0;s:13:"listitem_open";i:1;a:1:{i:0;i:1;}i:2;i:126;}i:11;a:3:{i:0;s:16:"listcontent_open";i:1;a:0:{}i:2;i:126;}i:12;a:3:{i:0;s:5:"cdata";i:1;a:1:{i:0;s:32:" You cannot move the start page.";}i:2;i:130;}i:13;a:3:{i:0;s:17:"listcontent_close";i:1;a:0:{}i:2;i:162;}i:14;a:3:{i:0;s:14:"listitem_close";i:1;a:0:{}i:2;i:162;}i:15;a:3:{i:0;s:13:"listitem_open";i:1;a:1:{i:0;i:1;}i:2;i:162;}i:16;a:3:{i:0;s:16:"listcontent_open";i:1;a:0:{}i:2;i:162;}i:17;a:3:{i:0;s:5:"cdata";i:1;a:1:{i:0;s:95:" You must have edit permission for the document and any documents that point to it (backlinks).";}i:2;i:166;}i:18;a:3:{i:0;s:17:"listcontent_close";i:1;a:0:{}i:2;i:261;}i:19;a:3:{i:0;s:14:"listitem_close";i:1;a:0:{}i:2;i:261;}i:20;a:3:{i:0;s:13:"listitem_open";i:1;a:1:{i:0;i:1;}i:2;i:261;}i:21;a:3:{i:0;s:16:"listcontent_open";i:1;a:0:{}i:2;i:261;}i:22;a:3:{i:0;s:5:"cdata";i:1;a:1:{i:0;s:62:" The document and its' backlinks cannot be locked for editing.";}i:2;i:265;}i:23;a:3:{i:0;s:17:"listcontent_close";i:1;a:0:{}i:2;i:327;}i:24;a:3:{i:0;s:14:"listitem_close";i:1;a:0:{}i:2;i:327;}i:25;a:3:{i:0;s:13:"listitem_open";i:1;a:1:{i:0;i:1;}i:2;i:327;}i:26;a:3:{i:0;s:16:"listcontent_open";i:1;a:0:{}i:2;i:327;}i:27;a:3:{i:0;s:5:"cdata";i:1;a:1:{i:0;s:75:" For moving a file you also need create permission in the target directory.";}i:2;i:331;}i:28;a:3:{i:0;s:17:"listcontent_close";i:1;a:0:{}i:2;i:406;}i:29;a:3:{i:0;s:14:"listitem_close";i:1;a:0:{}i:2;i:406;}i:30;a:3:{i:0;s:13:"listitem_open";i:1;a:1:{i:0;i:1;}i:2;i:406;}i:31;a:3:{i:0;s:16:"listcontent_open";i:1;a:0:{}i:2;i:406;}i:32;a:3:{i:0;s:5:"cdata";i:1;a:1:{i:0;s:96:" You cannot move the document to a namespace where a document with the same name already exists.";}i:2;i:410;}i:33;a:3:{i:0;s:17:"listcontent_close";i:1;a:0:{}i:2;i:506;}i:34;a:3:{i:0;s:14:"listitem_close";i:1;a:0:{}i:2;i:506;}i:35;a:3:{i:0;s:11:"listu_close";i:1;a:0:{}i:2;i:506;}i:36;a:3:{i:0;s:6:"p_open";i:1;a:0:{}i:2;i:506;}i:37;a:3:{i:0;s:5:"cdata";i:1;a:1:{i:0;s:89:"
All links to and from the page will be updated to reflect the new location and/or name.
";}i:2;i:507;}i:38;a:3:{i:0;s:9:"linebreak";i:1;a:0:{}i:2;i:596;}i:39;a:3:{i:0;s:5:"cdata";i:1;a:1:{i:0;s:1:"
";}i:2;i:598;}i:40;a:3:{i:0;s:9:"linebreak";i:1;a:0:{}i:2;i:599;}i:41;a:3:{i:0;s:5:"cdata";i:1;a:1:{i:0;s:1:"
";}i:2;i:601;}i:42;a:3:{i:0;s:7:"p_close";i:1;a:0:{}i:2;i:601;}i:43;a:3:{i:0;s:13:"section_close";i:1;a:0:{}i:2;i:601;}i:44;a:3:{i:0;s:12:"document_end";i:1;a:0:{}i:2;i:601;}}