a:237:{i:0;a:3:{i:0;s:14:"document_start";i:1;a:0:{}i:2;i:0;}i:1;a:3:{i:0;s:6:"p_open";i:1;a:0:{}i:2;i:0;}i:2;a:3:{i:0;s:5:"cdata";i:1;a:1:{i:0;s:29:"Ata da reunião de 31/10/2006";}i:2;i:1;}i:3;a:3:{i:0;s:7:"p_close";i:1;a:0:{}i:2;i:30;}i:4;a:3:{i:0;s:6:"p_open";i:1;a:0:{}i:2;i:30;}i:5;a:3:{i:0;s:5:"cdata";i:1;a:1:{i:0;s:141:"Presentes: Vítor,Bruno, Antônio, Dante, Fabiano, Felipe, Ismael, Gabriela, Lucas Mizusaki, Marcelo, Marcos, Pablo, Portal, Ricardo, Thiago.";}i:2;i:32;}i:6;a:3:{i:0;s:7:"p_close";i:1;a:0:{}i:2;i:173;}i:7;a:3:{i:0;s:6:"p_open";i:1;a:0:{}i:2;i:173;}i:8;a:3:{i:0;s:5:"cdata";i:1;a:1:{i:0;s:20:"Ausentes: Alexandre.";}i:2;i:175;}i:9;a:3:{i:0;s:7:"p_close";i:1;a:0:{}i:2;i:195;}i:10;a:3:{i:0;s:6:"p_open";i:1;a:0:{}i:2;i:195;}i:11;a:3:{i:0;s:5:"cdata";i:1;a:1:{i:0;s:16:"Relator: Marcos.";}i:2;i:197;}i:12;a:3:{i:0;s:7:"p_close";i:1;a:0:{}i:2;i:213;}i:13;a:3:{i:0;s:6:"p_open";i:1;a:0:{}i:2;i:213;}i:14;a:3:{i:0;s:5:"cdata";i:1;a:1:{i:0;s:35:"1) Apresentação dos voluntários
";}i:2;i:215;}i:15;a:3:{i:0;s:7:"p_close";i:1;a:0:{}i:2;i:250;}i:16;a:3:{i:0;s:10:"quote_open";i:1;a:0:{}i:2;i:250;}i:17;a:3:{i:0;s:5:"cdata";i:1;a:1:{i:0;s:380:" Flores relata as situações que levaram à admissão de dois voluntários e que houve bastante procura. Todos os petianos, inclusive os voluntários, se apresentaram. Mizusaki será padrinho do Bruno e Ricardo será padrinho de Vítor. Flores salienta que os novos devem criar suas contas no servidor e que os padrinhos devem ajudar os novos a se ambientarem ao ambiente do PET.";}i:2;i:252;}i:18;a:3:{i:0;s:11:"quote_close";i:1;a:0:{}i:2;i:632;}i:19;a:3:{i:0;s:6:"p_open";i:1;a:0:{}i:2;i:632;}i:20;a:3:{i:0;s:5:"cdata";i:1;a:1:{i:0;s:35:"
2) Termo de compromisso dos novos
";}i:2;i:633;}i:21;a:3:{i:0;s:7:"p_close";i:1;a:0:{}i:2;i:668;}i:22;a:3:{i:0;s:10:"quote_open";i:1;a:0:{}i:2;i:668;}i:23;a:3:{i:0;s:5:"cdata";i:1;a:1:{i:0;s:143:" Gabi avisa que os termos de compromisso estão prontos e que falta somente o Dante assinar. Flores irá entregar os termos amanhã na PROGRAD.";}i:2;i:670;}i:24;a:3:{i:0;s:11:"quote_close";i:1;a:0:{}i:2;i:813;}i:25;a:3:{i:0;s:6:"p_open";i:1;a:0:{}i:2;i:813;}i:26;a:3:{i:0;s:5:"cdata";i:1;a:1:{i:0;s:44:"
3) Entrega do resto do material de consumo
";}i:2;i:814;}i:27;a:3:{i:0;s:7:"p_close";i:1;a:0:{}i:2;i:858;}i:28;a:3:{i:0;s:10:"quote_open";i:1;a:0:{}i:2;i:858;}i:29;a:3:{i:0;s:5:"cdata";i:1;a:1:{i:0;s:275:" Marcos relata que o resto do material de consumo chegou e que já foi entregue. Gabi comenta que ainda falta um carregador dos quatro que foram pedidos. Gabi e o Flores irão verificar junto à PROGRAD se esse itens não foram entregues ou se não chegaram à ser comprados.";}i:2;i:860;}i:30;a:3:{i:0;s:11:"quote_close";i:1;a:0:{}i:2;i:1135;}i:31;a:3:{i:0;s:6:"p_open";i:1;a:0:{}i:2;i:1135;}i:32;a:3:{i:0;s:5:"cdata";i:1;a:1:{i:0;s:21:"
4) Desktops Windows
";}i:2;i:1136;}i:33;a:3:{i:0;s:7:"p_close";i:1;a:0:{}i:2;i:1157;}i:34;a:3:{i:0;s:10:"quote_open";i:1;a:0:{}i:2;i:1157;}i:35;a:3:{i:0;s:5:"cdata";i:1;a:1:{i:0;s:167:" Mizusaki avisa que irá limpar os desktops dos Windows na próxima terça-feira, sendo que qualquer coisa que for importante deve ser guardada nas pastas apropriadas.";}i:2;i:1159;}i:36;a:3:{i:0;s:11:"quote_close";i:1;a:0:{}i:2;i:1326;}i:37;a:3:{i:0;s:6:"p_open";i:1;a:0:{}i:2;i:1326;}i:38;a:3:{i:0;s:5:"cdata";i:1;a:1:{i:0;s:22:"
5) Próximo InterPET
";}i:2;i:1327;}i:39;a:3:{i:0;s:7:"p_close";i:1;a:0:{}i:2;i:1349;}i:40;a:3:{i:0;s:10:"quote_open";i:1;a:0:{}i:2;i:1349;}i:41;a:3:{i:0;s:5:"cdata";i:1;a:1:{i:0;s:210:" Flores avisa que no próximo dia 6/11 haverá InterPET na Sociais,onde ele e Marcelo irão. A pauta será o Salão de Graduação. Flores explica para os voluntários o que é o InterPET, o SulPÈT e o EnaPET.";}i:2;i:1351;}i:42;a:3:{i:0;s:11:"quote_close";i:1;a:0:{}i:2;i:1561;}i:43;a:3:{i:0;s:6:"p_open";i:1;a:0:{}i:2;i:1561;}i:44;a:3:{i:0;s:5:"cdata";i:1;a:1:{i:0;s:36:"
6) Comentários sobre o SIC da PUC
";}i:2;i:1562;}i:45;a:3:{i:0;s:7:"p_close";i:1;a:0:{}i:2;i:1598;}i:46;a:3:{i:0;s:10:"quote_open";i:1;a:0:{}i:2;i:1598;}i:47;a:3:{i:0;s:5:"cdata";i:1;a:1:{i:0;s:166:" Marcelo comenta sobre sua experiência no Salão da PUC, salientando que achou entediante ficar ao lado do postêr. A apresentação despertou interesse de quem viu.";}i:2;i:1600;}i:48;a:3:{i:0;s:11:"quote_close";i:1;a:0:{}i:2;i:1766;}i:49;a:3:{i:0;s:6:"p_open";i:1;a:0:{}i:2;i:1766;}i:50;a:3:{i:0;s:5:"cdata";i:1;a:1:{i:0;s:42:"
7) Comentários sobre palestra da Kaizen
";}i:2;i:1767;}i:51;a:3:{i:0;s:7:"p_close";i:1;a:0:{}i:2;i:1809;}i:52;a:3:{i:0;s:10:"quote_open";i:1;a:0:{}i:2;i:1809;}i:53;a:3:{i:0;s:5:"cdata";i:1;a:1:{i:0;s:223:" Marcelo relata sobre a palestra da Kaizen, dizendo que foi muito interessante, que teve um público consideravél e bem diversificado. Também salienta que o tempo acabou ficando curto, porém o horário foi bem escolhido.";}i:2;i:1811;}i:54;a:3:{i:0;s:11:"quote_close";i:1;a:0:{}i:2;i:2034;}i:55;a:3:{i:0;s:6:"p_open";i:1;a:0:{}i:2;i:2034;}i:56;a:3:{i:0;s:5:"cdata";i:1;a:1:{i:0;s:30:"
8) Reunião do Comitê Local
";}i:2;i:2035;}i:57;a:3:{i:0;s:7:"p_close";i:1;a:0:{}i:2;i:2065;}i:58;a:3:{i:0;s:10:"quote_open";i:1;a:0:{}i:2;i:2065;}i:59;a:3:{i:0;s:5:"cdata";i:1;a:1:{i:0;s:140:" Marcos relatou o que foi discutido na reunião co comitê local, além de explicar para os novos o que é o CLA. Os pontos debatidos foram:";}i:2;i:2067;}i:60;a:3:{i:0;s:11:"quote_close";i:1;a:0:{}i:2;i:2207;}i:61;a:3:{i:0;s:10:"listu_open";i:1;a:0:{}i:2;i:2208;}i:62;a:3:{i:0;s:13:"listitem_open";i:1;a:1:{i:0;i:1;}i:2;i:2208;}i:63;a:3:{i:0;s:16:"listcontent_open";i:1;a:0:{}i:2;i:2208;}i:64;a:3:{i:0;s:5:"cdata";i:1;a:1:{i:0;s:150:" Todos os grupos deveriam inserir suas atividades no planejamento institucional e Dante como representante deveria assinar o documento lá na PROGRAD.";}i:2;i:2212;}i:65;a:3:{i:0;s:17:"listcontent_close";i:1;a:0:{}i:2;i:2362;}i:66;a:3:{i:0;s:14:"listitem_close";i:1;a:0:{}i:2;i:2362;}i:67;a:3:{i:0;s:13:"listitem_open";i:1;a:1:{i:0;i:1;}i:2;i:2362;}i:68;a:3:{i:0;s:16:"listcontent_open";i:1;a:0:{}i:2;i:2362;}i:69;a:3:{i:0;s:5:"cdata";i:1;a:1:{i:0;s:80:" Foi proposto que cada grupo cria-se um postêr seu para o Salão de Graduação";}i:2;i:2366;}i:70;a:3:{i:0;s:17:"listcontent_close";i:1;a:0:{}i:2;i:2446;}i:71;a:3:{i:0;s:14:"listitem_close";i:1;a:0:{}i:2;i:2446;}i:72;a:3:{i:0;s:13:"listitem_open";i:1;a:1:{i:0;i:1;}i:2;i:2446;}i:73;a:3:{i:0;s:16:"listcontent_open";i:1;a:0:{}i:2;i:2446;}i:74;a:3:{i:0;s:5:"cdata";i:1;a:1:{i:0;s:111:" Os grupos deveriam incrementar seus resumos para o Salão de Graduação com o nome dos integrantes e do tutor";}i:2;i:2450;}i:75;a:3:{i:0;s:17:"listcontent_close";i:1;a:0:{}i:2;i:2561;}i:76;a:3:{i:0;s:14:"listitem_close";i:1;a:0:{}i:2;i:2561;}i:77;a:3:{i:0;s:13:"listitem_open";i:1;a:1:{i:0;i:1;}i:2;i:2561;}i:78;a:3:{i:0;s:16:"listcontent_open";i:1;a:0:{}i:2;i:2561;}i:79;a:3:{i:0;s:5:"cdata";i:1;a:1:{i:0;s:215:" Foi proposto que a apresentação no Salão de Graduação seja avaliada por ex-tutores e pró-reitores convidados, e que seus comentários sejam repassados aos grupos numa reunião na manhã seguinte, no dia 22/11";}i:2;i:2565;}i:80;a:3:{i:0;s:17:"listcontent_close";i:1;a:0:{}i:2;i:2780;}i:81;a:3:{i:0;s:14:"listitem_close";i:1;a:0:{}i:2;i:2780;}i:82;a:3:{i:0;s:11:"listu_close";i:1;a:0:{}i:2;i:2780;}i:83;a:3:{i:0;s:6:"p_open";i:1;a:0:{}i:2;i:2780;}i:84;a:3:{i:0;s:5:"cdata";i:1;a:1:{i:0;s:17:"
10) Site do LRI
";}i:2;i:2781;}i:85;a:3:{i:0;s:7:"p_close";i:1;a:0:{}i:2;i:2798;}i:86;a:3:{i:0;s:10:"quote_open";i:1;a:0:{}i:2;i:2798;}i:87;a:3:{i:0;s:5:"cdata";i:1;a:1:{i:0;s:114:" Marcos relata que foi falar com a administradora da rede e que ela não encontrou uma pasta relativa ao domínio ";}i:2;i:2800;}i:88;a:3:{i:0;s:12:"externallink";i:1;a:2:{i:0;s:28:"http://www.inf.ufrgs.br/~lri";i:1;s:21:"www.inf.ufrgs.br/~lri";}i:2;i:2914;}i:89;a:3:{i:0;s:5:"cdata";i:1;a:1:{i:0;s:118:", logo não existe um site, ou se existia, já foi destruído.Não foi vista necessidade de se fazer um site para LRI.";}i:2;i:2935;}i:90;a:3:{i:0;s:11:"quote_close";i:1;a:0:{}i:2;i:3053;}i:91;a:3:{i:0;s:6:"p_open";i:1;a:0:{}i:2;i:3053;}i:92;a:3:{i:0;s:5:"cdata";i:1;a:1:{i:0;s:66:"
11) Reunião da comissão encarregada pelo Salão de Graduação
";}i:2;i:3054;}i:93;a:3:{i:0;s:7:"p_close";i:1;a:0:{}i:2;i:3120;}i:94;a:3:{i:0;s:10:"quote_open";i:1;a:0:{}i:2;i:3120;}i:95;a:3:{i:0;s:5:"cdata";i:1;a:1:{i:0;s:85:" Flores relata sobre a reunião da comissão encarregada pelo Salão de Graduação :";}i:2;i:3122;}i:96;a:3:{i:0;s:11:"quote_close";i:1;a:0:{}i:2;i:3207;}i:97;a:3:{i:0;s:10:"listu_open";i:1;a:0:{}i:2;i:3208;}i:98;a:3:{i:0;s:13:"listitem_open";i:1;a:1:{i:0;i:1;}i:2;i:3208;}i:99;a:3:{i:0;s:16:"listcontent_open";i:1;a:0:{}i:2;i:3208;}i:100;a:3:{i:0;s:5:"cdata";i:1;a:1:{i:0;s:106:" Deverão ser convidados ex-tutores de Porto Alegre, Rio Grande ou Santa Maria para a avalição no Salão";}i:2;i:3212;}i:101;a:3:{i:0;s:17:"listcontent_close";i:1;a:0:{}i:2;i:3318;}i:102;a:3:{i:0;s:14:"listitem_close";i:1;a:0:{}i:2;i:3318;}i:103;a:3:{i:0;s:13:"listitem_open";i:1;a:1:{i:0;i:1;}i:2;i:3318;}i:104;a:3:{i:0;s:16:"listcontent_open";i:1;a:0:{}i:2;i:3318;}i:105;a:3:{i:0;s:5:"cdata";i:1;a:1:{i:0;s:105:" Na manhã seguinte, um ou dois representantes por grupo irão para a reunião para ouvir os comentários";}i:2;i:3322;}i:106;a:3:{i:0;s:17:"listcontent_close";i:1;a:0:{}i:2;i:3427;}i:107;a:3:{i:0;s:14:"listitem_close";i:1;a:0:{}i:2;i:3427;}i:108;a:3:{i:0;s:13:"listitem_open";i:1;a:1:{i:0;i:1;}i:2;i:3427;}i:109;a:3:{i:0;s:16:"listcontent_open";i:1;a:0:{}i:2;i:3427;}i:110;a:3:{i:0;s:5:"cdata";i:1;a:1:{i:0;s:111:" Devido ao fato de ser mais um turno que os petianos perderiam, essa avaliação ficou ainda por ser confirmada";}i:2;i:3431;}i:111;a:3:{i:0;s:17:"listcontent_close";i:1;a:0:{}i:2;i:3542;}i:112;a:3:{i:0;s:14:"listitem_close";i:1;a:0:{}i:2;i:3542;}i:113;a:3:{i:0;s:13:"listitem_open";i:1;a:1:{i:0;i:1;}i:2;i:3542;}i:114;a:3:{i:0;s:16:"listcontent_open";i:1;a:0:{}i:2;i:3542;}i:115;a:3:{i:0;s:5:"cdata";i:1;a:1:{i:0;s:92:" O Daniel da Geografia irá apresentar o postêr institucional e falar sober o PET no Salão";}i:2;i:3546;}i:116;a:3:{i:0;s:17:"listcontent_close";i:1;a:0:{}i:2;i:3638;}i:117;a:3:{i:0;s:14:"listitem_close";i:1;a:0:{}i:2;i:3638;}i:118;a:3:{i:0;s:13:"listitem_open";i:1;a:1:{i:0;i:1;}i:2;i:3638;}i:119;a:3:{i:0;s:16:"listcontent_open";i:1;a:0:{}i:2;i:3638;}i:120;a:3:{i:0;s:5:"cdata";i:1;a:1:{i:0;s:61:" Cada grupo terá 15 minutos para falar sobre as suas ações";}i:2;i:3642;}i:121;a:3:{i:0;s:17:"listcontent_close";i:1;a:0:{}i:2;i:3703;}i:122;a:3:{i:0;s:14:"listitem_close";i:1;a:0:{}i:2;i:3703;}i:123;a:3:{i:0;s:13:"listitem_open";i:1;a:1:{i:0;i:1;}i:2;i:3703;}i:124;a:3:{i:0;s:16:"listcontent_open";i:1;a:0:{}i:2;i:3703;}i:125;a:3:{i:0;s:5:"cdata";i:1;a:1:{i:0;s:48:" A professora Iguatemy mandará um representante";}i:2;i:3707;}i:126;a:3:{i:0;s:17:"listcontent_close";i:1;a:0:{}i:2;i:3755;}i:127;a:3:{i:0;s:14:"listitem_close";i:1;a:0:{}i:2;i:3755;}i:128;a:3:{i:0;s:13:"listitem_open";i:1;a:1:{i:0;i:1;}i:2;i:3755;}i:129;a:3:{i:0;s:16:"listcontent_open";i:1;a:0:{}i:2;i:3755;}i:130;a:3:{i:0;s:5:"cdata";i:1;a:1:{i:0;s:57:" O PET terá o horário da 14h até as 16h pra apresentar";}i:2;i:3759;}i:131;a:3:{i:0;s:17:"listcontent_close";i:1;a:0:{}i:2;i:3816;}i:132;a:3:{i:0;s:14:"listitem_close";i:1;a:0:{}i:2;i:3816;}i:133;a:3:{i:0;s:11:"listu_close";i:1;a:0:{}i:2;i:3816;}i:134;a:3:{i:0;s:6:"p_open";i:1;a:0:{}i:2;i:3816;}i:135;a:3:{i:0;s:5:"cdata";i:1;a:1:{i:0;s:34:"
12) Avaliação do Grupo - Dante
";}i:2;i:3817;}i:136;a:3:{i:0;s:7:"p_close";i:1;a:0:{}i:2;i:3851;}i:137;a:3:{i:0;s:10:"quote_open";i:1;a:0:{}i:2;i:3851;}i:138;a:3:{i:0;s:5:"cdata";i:1;a:1:{i:0;s:41:" Foi passado para daqui a duas reuniões.";}i:2;i:3853;}i:139;a:3:{i:0;s:11:"quote_close";i:1;a:0:{}i:2;i:3894;}i:140;a:3:{i:0;s:6:"p_open";i:1;a:0:{}i:2;i:3894;}i:141;a:3:{i:0;s:5:"cdata";i:1;a:1:{i:0;s:34:"
13) Avaliação do Dante - Grupo
";}i:2;i:3895;}i:142;a:3:{i:0;s:7:"p_close";i:1;a:0:{}i:2;i:3929;}i:143;a:3:{i:0;s:10:"quote_open";i:1;a:0:{}i:2;i:3929;}i:144;a:3:{i:0;s:5:"cdata";i:1;a:1:{i:0;s:41:" Foi passado para daqui a duas reuniões.";}i:2;i:3931;}i:145;a:3:{i:0;s:11:"quote_close";i:1;a:0:{}i:2;i:3972;}i:146;a:3:{i:0;s:6:"p_open";i:1;a:0:{}i:2;i:3972;}i:147;a:3:{i:0;s:5:"cdata";i:1;a:1:{i:0;s:31:"
14) Chaves do armário do PET
";}i:2;i:3973;}i:148;a:3:{i:0;s:7:"p_close";i:1;a:0:{}i:2;i:4004;}i:149;a:3:{i:0;s:10:"quote_open";i:1;a:0:{}i:2;i:4004;}i:150;a:3:{i:0;s:5:"cdata";i:1;a:1:{i:0;s:174:" As chaves do Estevão, Pablo e Cavalheiro foram passadas para o Portal,Ismael e Antônio. Fabiano ficou encarregado de fazer as chaves para os voluntário e as chave do LRI.";}i:2;i:4006;}i:151;a:3:{i:0;s:11:"quote_close";i:1;a:0:{}i:2;i:4180;}i:152;a:3:{i:0;s:6:"p_open";i:1;a:0:{}i:2;i:4180;}i:153;a:3:{i:0;s:5:"cdata";i:1;a:1:{i:0;s:28:"
15) Reunião sobre o museu
";}i:2;i:4181;}i:154;a:3:{i:0;s:7:"p_close";i:1;a:0:{}i:2;i:4209;}i:155;a:3:{i:0;s:10:"quote_open";i:1;a:0:{}i:2;i:4209;}i:156;a:3:{i:0;s:5:"cdata";i:1;a:1:{i:0;s:313:" Marcelo relata sobre a reunião . Dante comenta que pode pedir recursos para o museu para os deputados federais e senadores gaúchos . Portal, Vítor e Ismael ficaram encarregados de fazer um documento relativo ao museu para mandar para os parlamentares. Marcelo e Flores irão assistir a criação do documento.";}i:2;i:4211;}i:157;a:3:{i:0;s:11:"quote_close";i:1;a:0:{}i:2;i:4524;}i:158;a:3:{i:0;s:6:"p_open";i:1;a:0:{}i:2;i:4524;}i:159;a:3:{i:0;s:5:"cdata";i:1;a:1:{i:0;s:37:"
16) Comemoração 18 anos do dia 14
";}i:2;i:4525;}i:160;a:3:{i:0;s:7:"p_close";i:1;a:0:{}i:2;i:4562;}i:161;a:3:{i:0;s:10:"quote_open";i:1;a:0:{}i:2;i:4562;}i:162;a:3:{i:0;s:5:"cdata";i:1;a:1:{i:0;s:208:" Marcos relata que houve pouquissímas respostas aos emails pro Mini-Salão. Dante deu a idéia de somente convidar os destaques da informática. Também foi dada a idéia de se conversar com os orientadores.";}i:2;i:4564;}i:163;a:3:{i:0;s:11:"quote_close";i:1;a:0:{}i:2;i:4772;}i:164;a:3:{i:0;s:10:"quote_open";i:1;a:0:{}i:2;i:4773;}i:165;a:3:{i:0;s:5:"cdata";i:1;a:1:{i:0;s:201:" Em relação com a palestra/debate, houve resposta do Marcelo Messa da Kaizen e de Diego Velasquez. Dante comentou em convidar a professor Giraffa da PUC, ex-petianos e o delegado da SBC no instituto.";}i:2;i:4775;}i:166;a:3:{i:0;s:11:"quote_close";i:1;a:0:{}i:2;i:4976;}i:167;a:3:{i:0;s:10:"quote_open";i:1;a:0:{}i:2;i:4977;}i:168;a:3:{i:0;s:5:"cdata";i:1;a:1:{i:0;s:27:" Em relação ao dia 14/11:";}i:2;i:4979;}i:169;a:3:{i:0;s:11:"quote_close";i:1;a:0:{}i:2;i:5006;}i:170;a:3:{i:0;s:10:"listu_open";i:1;a:0:{}i:2;i:5007;}i:171;a:3:{i:0;s:13:"listitem_open";i:1;a:1:{i:0;i:1;}i:2;i:5007;}i:172;a:3:{i:0;s:16:"listcontent_open";i:1;a:0:{}i:2;i:5007;}i:173;a:3:{i:0;s:5:"cdata";i:1;a:1:{i:0;s:45:" Haverá um painel sobre o PET com o nome de ";}i:2;i:5011;}i:174;a:3:{i:0;s:18:"doublequoteopening";i:1;a:0:{}i:2;i:5056;}i:175;a:3:{i:0;s:5:"cdata";i:1;a:1:{i:0;s:61:"Contribuições do PET para a Universidade e para a Sociedade";}i:2;i:5057;}i:176;a:3:{i:0;s:18:"doublequoteclosing";i:1;a:0:{}i:2;i:5118;}i:177;a:3:{i:0;s:17:"listcontent_close";i:1;a:0:{}i:2;i:5119;}i:178;a:3:{i:0;s:14:"listitem_close";i:1;a:0:{}i:2;i:5119;}i:179;a:3:{i:0;s:13:"listitem_open";i:1;a:1:{i:0;i:1;}i:2;i:5119;}i:180;a:3:{i:0;s:16:"listcontent_open";i:1;a:0:{}i:2;i:5119;}i:181;a:3:{i:0;s:5:"cdata";i:1;a:1:{i:0;s:78:" Lançamento para a sociedade do Museu de Informática e Computação da UFRGS";}i:2;i:5123;}i:182;a:3:{i:0;s:17:"listcontent_close";i:1;a:0:{}i:2;i:5201;}i:183;a:3:{i:0;s:14:"listitem_close";i:1;a:0:{}i:2;i:5201;}i:184;a:3:{i:0;s:13:"listitem_open";i:1;a:1:{i:0;i:1;}i:2;i:5201;}i:185;a:3:{i:0;s:16:"listcontent_open";i:1;a:0:{}i:2;i:5201;}i:186;a:3:{i:0;s:5:"cdata";i:1;a:1:{i:0;s:74:" Pessoas a serem convidadas: Iguatemy, Manuela, Maria do Rosário e Benemi";}i:2;i:5205;}i:187;a:3:{i:0;s:17:"listcontent_close";i:1;a:0:{}i:2;i:5279;}i:188;a:3:{i:0;s:14:"listitem_close";i:1;a:0:{}i:2;i:5279;}i:189;a:3:{i:0;s:13:"listitem_open";i:1;a:1:{i:0;i:1;}i:2;i:5279;}i:190;a:3:{i:0;s:16:"listcontent_open";i:1;a:0:{}i:2;i:5279;}i:191;a:3:{i:0;s:5:"cdata";i:1;a:1:{i:0;s:100:" Marcos ficou encarregado de mandar email para todos os ex-petianos relativo ao eventos do dia 14/11";}i:2;i:5283;}i:192;a:3:{i:0;s:17:"listcontent_close";i:1;a:0:{}i:2;i:5383;}i:193;a:3:{i:0;s:14:"listitem_close";i:1;a:0:{}i:2;i:5383;}i:194;a:3:{i:0;s:13:"listitem_open";i:1;a:1:{i:0;i:1;}i:2;i:5383;}i:195;a:3:{i:0;s:16:"listcontent_open";i:1;a:0:{}i:2;i:5383;}i:196;a:3:{i:0;s:5:"cdata";i:1;a:1:{i:0;s:103:" Bruno, Antônio e Ismael ficaram encarregado de mandar um ofício ou email para os convidados ilustres";}i:2;i:5387;}i:197;a:3:{i:0;s:17:"listcontent_close";i:1;a:0:{}i:2;i:5490;}i:198;a:3:{i:0;s:14:"listitem_close";i:1;a:0:{}i:2;i:5490;}i:199;a:3:{i:0;s:11:"listu_close";i:1;a:0:{}i:2;i:5490;}i:200;a:3:{i:0;s:6:"p_open";i:1;a:0:{}i:2;i:5490;}i:201;a:3:{i:0;s:5:"cdata";i:1;a:1:{i:0;s:23:"
17) Encontro na ETCOM
";}i:2;i:5491;}i:202;a:3:{i:0;s:7:"p_close";i:1;a:0:{}i:2;i:5514;}i:203;a:3:{i:0;s:10:"quote_open";i:1;a:0:{}i:2;i:5514;}i:204;a:3:{i:0;s:5:"cdata";i:1;a:1:{i:0;s:287:" Thiago relata sobre as atividades na escola técnica. Dante deu uma palestra sobre robótica e Thiago e Mizusaki falaram sobre programação e sobre Ruby, e mostraram o robô . No próximo encontro os assuntos a serem abordados serão o gravador de PIC e o sistema de rádio do RoboEDU.";}i:2;i:5516;}i:205;a:3:{i:0;s:11:"quote_close";i:1;a:0:{}i:2;i:5803;}i:206;a:3:{i:0;s:6:"p_open";i:1;a:0:{}i:2;i:5803;}i:207;a:3:{i:0;s:5:"cdata";i:1;a:1:{i:0;s:40:"
18) Manutenção do computador do NELE
";}i:2;i:5804;}i:208;a:3:{i:0;s:7:"p_close";i:1;a:0:{}i:2;i:5844;}i:209;a:3:{i:0;s:10:"quote_open";i:1;a:0:{}i:2;i:5844;}i:210;a:3:{i:0;s:5:"cdata";i:1;a:1:{i:0;s:232:" Ricardo e Antônio foram ao NELE conferir um HUB queimado que eles tinham, e viram que o fusível queimou, porém não foi possivel determinar se houve dano ao HUB. Eles irão comprar o fusível e retornar para terminar o conserto.";}i:2;i:5846;}i:211;a:3:{i:0;s:11:"quote_close";i:1;a:0:{}i:2;i:6078;}i:212;a:3:{i:0;s:6:"p_open";i:1;a:0:{}i:2;i:6078;}i:213;a:3:{i:0;s:5:"cdata";i:1;a:1:{i:0;s:21:"
19) Compras RoboEDU
";}i:2;i:6079;}i:214;a:3:{i:0;s:7:"p_close";i:1;a:0:{}i:2;i:6100;}i:215;a:3:{i:0;s:10:"quote_open";i:1;a:0:{}i:2;i:6100;}i:216;a:3:{i:0;s:5:"cdata";i:1;a:1:{i:0;s:295:" Dante comenta que conseguiu um dinheiro a mais para entregar ao Instituto, visto que o Instituto sempre recebe uma parte dos dinheiros destinados à projetos. Além disso, todos os materiais permanentes deverão ser detalhados o quanto antes a fim de que os materias pedidos sejam os recebidos.";}i:2;i:6102;}i:217;a:3:{i:0;s:11:"quote_close";i:1;a:0:{}i:2;i:6397;}i:218;a:3:{i:0;s:6:"p_open";i:1;a:0:{}i:2;i:6397;}i:219;a:3:{i:0;s:5:"cdata";i:1;a:1:{i:0;s:20:"
20) Portal CENAPET
";}i:2;i:6398;}i:220;a:3:{i:0;s:7:"p_close";i:1;a:0:{}i:2;i:6418;}i:221;a:3:{i:0;s:10:"quote_open";i:1;a:0:{}i:2;i:6418;}i:222;a:3:{i:0;s:5:"cdata";i:1;a:1:{i:0;s:352:" Dante pede como que está a situação com o Portal CENAPET, Pablo diz que ainda não recebeu resposta da USP-São Carlos. Dante comenta que pretende mostrar o portal na próxima reunião em Brasília, e que desejaria que o portal estivesse operante. Pablo diz que irá repassar todas as informações para Antônio relativos ao site e ao site do PET.";}i:2;i:6420;}i:223;a:3:{i:0;s:11:"quote_close";i:1;a:0:{}i:2;i:6772;}i:224;a:3:{i:0;s:6:"p_open";i:1;a:0:{}i:2;i:6772;}i:225;a:3:{i:0;s:5:"cdata";i:1;a:1:{i:0;s:26:"
21) Comentário do Pablo
";}i:2;i:6773;}i:226;a:3:{i:0;s:7:"p_close";i:1;a:0:{}i:2;i:6799;}i:227;a:3:{i:0;s:10:"quote_open";i:1;a:0:{}i:2;i:6799;}i:228;a:3:{i:0;s:5:"cdata";i:1;a:1:{i:0;s:302:" Pablo comenta que não virá mais ao PET depois dessa reunião, e salienta para os novos aproveitarem seu tempo no PET, que é uma bolsa que dá oportunidade de pesquisa nas aŕeas de interesse da pessoa e que dá a possibilidade de ministrar cursos. Dante comenta da participação de Pablo no grupo.";}i:2;i:6801;}i:229;a:3:{i:0;s:11:"quote_close";i:1;a:0:{}i:2;i:7103;}i:230;a:3:{i:0;s:6:"p_open";i:1;a:0:{}i:2;i:7103;}i:231;a:3:{i:0;s:5:"cdata";i:1;a:1:{i:0;s:24:"
22) Atividade Cultural
";}i:2;i:7104;}i:232;a:3:{i:0;s:7:"p_close";i:1;a:0:{}i:2;i:7128;}i:233;a:3:{i:0;s:10:"quote_open";i:1;a:0:{}i:2;i:7128;}i:234;a:3:{i:0;s:5:"cdata";i:1;a:1:{i:0;s:223:" Flores vai passar o pen-drive para que Marcos possa passar os filmes para a pasta temp do computador Gabriela, a fim de ser possível a gravação em CD dos filmes. Foi proposto que em Dezembro o grupo possa ir ver a OSPA.";}i:2;i:7130;}i:235;a:3:{i:0;s:11:"quote_close";i:1;a:0:{}i:2;i:7353;}i:236;a:3:{i:0;s:12:"document_end";i:1;a:0:{}i:2;i:7353;}}