a:191:{i:0;a:3:{i:0;s:14:"document_start";i:1;a:0:{}i:2;i:0;}i:1;a:3:{i:0;s:6:"p_open";i:1;a:0:{}i:2;i:0;}i:2;a:3:{i:0;s:7:"p_close";i:1;a:0:{}i:2;i:1;}i:3;a:3:{i:0;s:12:"section_edit";i:1;a:4:{i:0;i:-1;i:1;i:0;i:2;i:1;i:3;s:0:"";}i:2;i:1;}i:4;a:3:{i:0;s:6:"header";i:1;a:3:{i:0;s:29:"Ata da Reunião de 15/08/2006";i:1;i:1;i:2;i:1;}i:2;i:1;}i:5;a:3:{i:0;s:12:"section_open";i:1;a:1:{i:0;i:1;}i:2;i:1;}i:6;a:3:{i:0;s:6:"p_open";i:1;a:0:{}i:2;i:44;}i:7;a:3:{i:0;s:5:"cdata";i:1;a:1:{i:0;s:132:"
Presentes: Alexandre, Dante, Estevão, Fabiano, Felipe, Gabriela, Lucas Cavalheiro, Lucas Mizusaki, Marcelo, Marcos, Pablo, Ricardo";}i:2;i:45;}i:8;a:3:{i:0;s:7:"p_close";i:1;a:0:{}i:2;i:177;}i:9;a:3:{i:0;s:6:"p_open";i:1;a:0:{}i:2;i:177;}i:10;a:3:{i:0;s:5:"cdata";i:1;a:1:{i:0;s:16:"Ausentes: Thiago";}i:2;i:179;}i:11;a:3:{i:0;s:7:"p_close";i:1;a:0:{}i:2;i:195;}i:12;a:3:{i:0;s:6:"p_open";i:1;a:0:{}i:2;i:195;}i:13;a:3:{i:0;s:5:"cdata";i:1;a:1:{i:0;s:25:"Relator: Marcelo Zambiasi";}i:2;i:197;}i:14;a:3:{i:0;s:7:"p_close";i:1;a:0:{}i:2;i:222;}i:15;a:3:{i:0;s:13:"section_close";i:1;a:0:{}i:2;i:224;}i:16;a:3:{i:0;s:12:"section_edit";i:1;a:4:{i:0;i:1;i:1;i:223;i:2;i:1;i:3;s:29:"Ata da Reunião de 15/08/2006";}i:2;i:224;}i:17;a:3:{i:0;s:6:"header";i:1;a:3:{i:0;s:9:"1. Pet-Br";i:1;i:2;i:2;i:224;}i:2;i:224;}i:18;a:3:{i:0;s:12:"section_open";i:1;a:1:{i:0;i:2;}i:2;i:224;}i:19;a:3:{i:0;s:6:"p_open";i:1;a:0:{}i:2;i:245;}i:20;a:3:{i:0;s:5:"cdata";i:1;a:1:{i:0;s:400:"
Mizusaki fala que queria acompanhar a lista de e-mails PET-Br. O grupo concorda que todos devem ter a possibilidade de ler a lista. Estevão fica responsável por criar uma conta no G-mail comum em que todo mundo terá a possibilidade de ler, mas a cada mês, uma pessoa diferente do grupo terá que, obrigatoriamente, acompanhar a lista. Marcos será o responsável pelas leituras no primeiro mês.";}i:2;i:246;}i:21;a:3:{i:0;s:7:"p_close";i:1;a:0:{}i:2;i:646;}i:22;a:3:{i:0;s:13:"section_close";i:1;a:0:{}i:2;i:648;}i:23;a:3:{i:0;s:12:"section_edit";i:1;a:4:{i:0;i:224;i:1;i:647;i:2;i:2;i:3;s:9:"1. Pet-Br";}i:2;i:648;}i:24;a:3:{i:0;s:6:"header";i:1;a:3:{i:0;s:20:"2. Horários no TRAC";i:1;i:2;i:2;i:648;}i:2;i:648;}i:25;a:3:{i:0;s:12:"section_open";i:1;a:1:{i:0;i:2;}i:2;i:648;}i:26;a:3:{i:0;s:6:"p_open";i:1;a:0:{}i:2;i:680;}i:27;a:3:{i:0;s:5:"cdata";i:1;a:1:{i:0;s:72:"
Flores pede a todos que coloquem seus horários desse semestre no TRAC.";}i:2;i:681;}i:28;a:3:{i:0;s:7:"p_close";i:1;a:0:{}i:2;i:753;}i:29;a:3:{i:0;s:13:"section_close";i:1;a:0:{}i:2;i:755;}i:30;a:3:{i:0;s:12:"section_edit";i:1;a:4:{i:0;i:648;i:1;i:754;i:2;i:2;i:3;s:20:"2. Horários no TRAC";}i:2;i:755;}i:31;a:3:{i:0;s:6:"header";i:1;a:3:{i:0;s:40:"3. Relatório de atividades anual do MEC";i:1;i:2;i:2;i:755;}i:2;i:755;}i:32;a:3:{i:0;s:12:"section_open";i:1;a:1:{i:0;i:2;}i:2;i:755;}i:33;a:3:{i:0;s:6:"p_open";i:1;a:0:{}i:2;i:807;}i:34;a:3:{i:0;s:5:"cdata";i:1;a:1:{i:0;s:526:"
O prazo para ser enviado é 15/SET.Dante fala que o grupo deve fazer isso em até 2 semanas. Por isso, fica solicitado que na próxima reunião cada um traga sugestões de atividades a serem incluídas no relatórios(Ensino/Pesquisa/Extensão). Flores, Marcelo e Fabiano ficam responsáveis por fazer o preenchimento do documento, por terem horários compatíveis. Sobre o índice de desempenho, devemos ver qual o melhor método e, para isso, Flores enviará e-mails para os outros PET's pedindo sugestões ou propondo algo.";}i:2;i:808;}i:35;a:3:{i:0;s:7:"p_close";i:1;a:0:{}i:2;i:1334;}i:36;a:3:{i:0;s:13:"section_close";i:1;a:0:{}i:2;i:1336;}i:37;a:3:{i:0;s:12:"section_edit";i:1;a:4:{i:0;i:755;i:1;i:1335;i:2;i:2;i:3;s:40:"3. Relatório de atividades anual do MEC";}i:2;i:1336;}i:38;a:3:{i:0;s:6:"header";i:1;a:3:{i:0;s:33:"4. Reprovações Lucas Cavalheiro";i:1;i:2;i:2;i:1336;}i:2;i:1336;}i:39;a:3:{i:0;s:12:"section_open";i:1;a:1:{i:0;i:2;}i:2;i:1336;}i:40;a:3:{i:0;s:6:"p_open";i:1;a:0:{}i:2;i:1381;}i:41;a:3:{i:0;s:5:"cdata";i:1;a:1:{i:0;s:229:"
Lucas fala que teve duas reprovações no semestre.Ele informa que terá uma reunião com Ezequiel para discutir isso. Gabriela também cita ter uma reprovação e que seu indíce, do semestre da reprovação, ficou abaixo de 6.";}i:2;i:1382;}i:42;a:3:{i:0;s:7:"p_close";i:1;a:0:{}i:2;i:1611;}i:43;a:3:{i:0;s:13:"section_close";i:1;a:0:{}i:2;i:1613;}i:44;a:3:{i:0;s:12:"section_edit";i:1;a:4:{i:0;i:1336;i:1;i:1612;i:2;i:2;i:3;s:33:"4. Reprovações Lucas Cavalheiro";}i:2;i:1613;}i:45;a:3:{i:0;s:6:"header";i:1;a:3:{i:0;s:33:"5. PET Psico Configuração de PC";i:1;i:2;i:2;i:1613;}i:2;i:1613;}i:46;a:3:{i:0;s:12:"section_open";i:1;a:1:{i:0;i:2;}i:2;i:1613;}i:47;a:3:{i:0;s:6:"p_open";i:1;a:0:{}i:2;i:1658;}i:48;a:3:{i:0;s:5:"cdata";i:1;a:1:{i:0;s:288:"
Fabiano disse que o PET Psico solicitou ajuda para compra ou upgrade de um PC. Dante comenta ter esquecido de pedir a lista de lojas onde é comprado o material de consumo ao Ezequiel. Fabiano fica responsável por dar uma ajuda ao PET Psico e Mizusaki também se oferece para ajudá-lo.";}i:2;i:1659;}i:49;a:3:{i:0;s:7:"p_close";i:1;a:0:{}i:2;i:1947;}i:50;a:3:{i:0;s:13:"section_close";i:1;a:0:{}i:2;i:1949;}i:51;a:3:{i:0;s:12:"section_edit";i:1;a:4:{i:0;i:1613;i:1;i:1948;i:2;i:2;i:3;s:33:"5. PET Psico Configuração de PC";}i:2;i:1949;}i:52;a:3:{i:0;s:6:"header";i:1;a:3:{i:0;s:21:"6. Atividade Cultural";i:1;i:2;i:2;i:1949;}i:2;i:1949;}i:53;a:3:{i:0;s:12:"section_open";i:1;a:1:{i:0;i:2;}i:2;i:1949;}i:54;a:3:{i:0;s:6:"p_open";i:1;a:0:{}i:2;i:1982;}i:55;a:3:{i:0;s:5:"cdata";i:1;a:1:{i:0;s:38:"
Marcelo fala que foi assitir a peça ";}i:2;i:1983;}i:56;a:3:{i:0;s:18:"doublequoteopening";i:1;a:0:{}i:2;i:2021;}i:57;a:3:{i:0;s:5:"cdata";i:1;a:1:{i:0;s:15:"Homens de Perto";}i:2;i:2022;}i:58;a:3:{i:0;s:18:"doublequoteclosing";i:1;a:0:{}i:2;i:2037;}i:59;a:3:{i:0;s:5:"cdata";i:1;a:1:{i:0;s:197:" e achou muito engraçado o espetáculo. Por sua vez, Capra foi assistir Hamlet e destaca que gostou muito do sistema de som. Alguns dos que não fizeram a Atividade Cultural pensam em ir na peça ";}i:2;i:2038;}i:60;a:3:{i:0;s:18:"doublequoteopening";i:1;a:0:{}i:2;i:2235;}i:61;a:3:{i:0;s:5:"cdata";i:1;a:1:{i:0;s:19:"Tangos e Tragédias";}i:2;i:2236;}i:62;a:3:{i:0;s:18:"doublequoteclosing";i:1;a:0:{}i:2;i:2255;}i:63;a:3:{i:0;s:5:"cdata";i:1;a:1:{i:0;s:1:".";}i:2;i:2256;}i:64;a:3:{i:0;s:7:"p_close";i:1;a:0:{}i:2;i:2257;}i:65;a:3:{i:0;s:13:"section_close";i:1;a:0:{}i:2;i:2259;}i:66;a:3:{i:0;s:12:"section_edit";i:1;a:4:{i:0;i:1949;i:1;i:2258;i:2;i:2;i:3;s:21:"6. Atividade Cultural";}i:2;i:2259;}i:67;a:3:{i:0;s:6:"header";i:1;a:3:{i:0;s:24:"7. Museu de Informática";i:1;i:2;i:2;i:2259;}i:2;i:2259;}i:68;a:3:{i:0;s:12:"section_open";i:1;a:1:{i:0;i:2;}i:2;i:2259;}i:69;a:3:{i:0;s:6:"p_open";i:1;a:0:{}i:2;i:2295;}i:70;a:3:{i:0;s:5:"cdata";i:1;a:1:{i:0;s:167:"
Dante fala sobre a reunião que teve com a COMEX.E solicita a Marcelo e Flores que tentem conseguir uma reunião com a vereadora Manuela, que é candidata a deputada.";}i:2;i:2296;}i:71;a:3:{i:0;s:7:"p_close";i:1;a:0:{}i:2;i:2463;}i:72;a:3:{i:0;s:13:"section_close";i:1;a:0:{}i:2;i:2465;}i:73;a:3:{i:0;s:12:"section_edit";i:1;a:4:{i:0;i:2259;i:1;i:2464;i:2;i:2;i:3;s:24:"7. Museu de Informática";}i:2;i:2465;}i:74;a:3:{i:0;s:6:"header";i:1;a:3:{i:0;s:32:"8.Apresentação do TCC Nondillo";i:1;i:2;i:2;i:2465;}i:2;i:2465;}i:75;a:3:{i:0;s:12:"section_open";i:1;a:1:{i:0;i:2;}i:2;i:2465;}i:76;a:3:{i:0;s:6:"p_open";i:1;a:0:{}i:2;i:2509;}i:77;a:3:{i:0;s:5:"cdata";i:1;a:1:{i:0;s:32:"
Será na quinta-feira, às 18h.";}i:2;i:2510;}i:78;a:3:{i:0;s:7:"p_close";i:1;a:0:{}i:2;i:2542;}i:79;a:3:{i:0;s:13:"section_close";i:1;a:0:{}i:2;i:2544;}i:80;a:3:{i:0;s:12:"section_edit";i:1;a:4:{i:0;i:2465;i:1;i:2543;i:2;i:2;i:3;s:32:"8.Apresentação do TCC Nondillo";}i:2;i:2544;}i:81;a:3:{i:0;s:6:"header";i:1;a:3:{i:0;s:21:"9. Tarefas esquecidas";i:1;i:2;i:2;i:2544;}i:2;i:2544;}i:82;a:3:{i:0;s:12:"section_open";i:1;a:1:{i:0;i:2;}i:2;i:2544;}i:83;a:3:{i:0;s:6:"p_open";i:1;a:0:{}i:2;i:2577;}i:84;a:3:{i:0;s:5:"cdata";i:1;a:1:{i:0;s:158:"
- Fabiano fla que viu o procedimento de cadastro na Semana Nacional de Tecnologia. - Tarefas que ficaram aparentemente sem responsável: pressionar Ezequiel.";}i:2;i:2578;}i:85;a:3:{i:0;s:7:"p_close";i:1;a:0:{}i:2;i:2736;}i:86;a:3:{i:0;s:13:"section_close";i:1;a:0:{}i:2;i:2738;}i:87;a:3:{i:0;s:12:"section_edit";i:1;a:4:{i:0;i:2544;i:1;i:2737;i:2;i:2;i:3;s:21:"9. Tarefas esquecidas";}i:2;i:2738;}i:88;a:3:{i:0;s:6:"header";i:1;a:3:{i:0;s:38:"10. Organização: Ar-condicionado LRI";i:1;i:2;i:2;i:2738;}i:2;i:2738;}i:89;a:3:{i:0;s:12:"section_open";i:1;a:1:{i:0;i:2;}i:2;i:2738;}i:90;a:3:{i:0;s:6:"p_open";i:1;a:0:{}i:2;i:2788;}i:91;a:3:{i:0;s:5:"cdata";i:1;a:1:{i:0;s:88:"
Fabiano cita que a sala do LRI foi organizada. Colocaram-se também cartazes nas salas.";}i:2;i:2789;}i:92;a:3:{i:0;s:7:"p_close";i:1;a:0:{}i:2;i:2877;}i:93;a:3:{i:0;s:13:"section_close";i:1;a:0:{}i:2;i:2879;}i:94;a:3:{i:0;s:12:"section_edit";i:1;a:4:{i:0;i:2738;i:1;i:2878;i:2;i:2;i:3;s:38:"10. Organização: Ar-condicionado LRI";}i:2;i:2879;}i:95;a:3:{i:0;s:6:"header";i:1;a:3:{i:0;s:19:"11. Dinheiro ENAPET";i:1;i:2;i:2;i:2879;}i:2;i:2879;}i:96;a:3:{i:0;s:12:"section_open";i:1;a:1:{i:0;i:2;}i:2;i:2879;}i:97;a:3:{i:0;s:6:"p_open";i:1;a:0:{}i:2;i:2910;}i:98;a:3:{i:0;s:5:"cdata";i:1;a:1:{i:0;s:110:"
Capra pergunta sobre o dinheiro do ENAPET. Fabiano diz que a passagem do cargo de tesouraria será na quinta.";}i:2;i:2911;}i:99;a:3:{i:0;s:7:"p_close";i:1;a:0:{}i:2;i:3021;}i:100;a:3:{i:0;s:13:"section_close";i:1;a:0:{}i:2;i:3023;}i:101;a:3:{i:0;s:12:"section_edit";i:1;a:4:{i:0;i:2879;i:1;i:3022;i:2;i:2;i:3;s:19:"11. Dinheiro ENAPET";}i:2;i:3023;}i:102;a:3:{i:0;s:6:"header";i:1;a:3:{i:0;s:42:"12. Certificados dos cursos do ano passado";i:1;i:2;i:2;i:3023;}i:2;i:3023;}i:103;a:3:{i:0;s:12:"section_open";i:1;a:1:{i:0;i:2;}i:2;i:3023;}i:104;a:3:{i:0;s:6:"p_open";i:1;a:0:{}i:2;i:3077;}i:105;a:3:{i:0;s:5:"cdata";i:1;a:1:{i:0;s:79:"
Os certificados do curso de Linux estão prontos e estes serão distribuídos.";}i:2;i:3078;}i:106;a:3:{i:0;s:7:"p_close";i:1;a:0:{}i:2;i:3157;}i:107;a:3:{i:0;s:13:"section_close";i:1;a:0:{}i:2;i:3159;}i:108;a:3:{i:0;s:12:"section_edit";i:1;a:4:{i:0;i:3023;i:1;i:3158;i:2;i:2;i:3;s:42:"12. Certificados dos cursos do ano passado";}i:2;i:3159;}i:109;a:3:{i:0;s:6:"header";i:1;a:3:{i:0;s:30:"13. Mudanças curriculares ECP";i:1;i:2;i:2;i:3159;}i:2;i:3159;}i:110;a:3:{i:0;s:12:"section_open";i:1;a:1:{i:0;i:2;}i:2;i:3159;}i:111;a:3:{i:0;s:6:"p_open";i:1;a:0:{}i:2;i:3201;}i:112;a:3:{i:0;s:5:"cdata";i:1;a:1:{i:0;s:209:"
Fabiano cita que os contatos com o Johann estão difíceis. Marcos fala que Weber enviará uma cópia das mudanças discutidas no currículo CIC. Mizusaki e Fabiano falarão com o Weber e depois com o Johann.";}i:2;i:3202;}i:113;a:3:{i:0;s:7:"p_close";i:1;a:0:{}i:2;i:3411;}i:114;a:3:{i:0;s:13:"section_close";i:1;a:0:{}i:2;i:3413;}i:115;a:3:{i:0;s:12:"section_edit";i:1;a:4:{i:0;i:3159;i:1;i:3412;i:2;i:2;i:3;s:30:"13. Mudanças curriculares ECP";}i:2;i:3413;}i:116;a:3:{i:0;s:6:"header";i:1;a:3:{i:0;s:20:"14. Reunião RoboEDU";i:1;i:2;i:2;i:3413;}i:2;i:3413;}i:117;a:3:{i:0;s:12:"section_open";i:1;a:1:{i:0;i:2;}i:2;i:3413;}i:118;a:3:{i:0;s:6:"p_open";i:1;a:0:{}i:2;i:3445;}i:119;a:3:{i:0;s:5:"cdata";i:1;a:1:{i:0;s:276:"
Mizu pede para que seja marcada uma reunião. Estevão cita que o PET e os consultores estão muito desunidos. Dante quer que o consultor mande-o o que será feito com os robôs na visita a escola. A reunião ficou marcada para às 8h30. Celular Marcelo(consultor): 9317-9254";}i:2;i:3446;}i:120;a:3:{i:0;s:7:"p_close";i:1;a:0:{}i:2;i:3722;}i:121;a:3:{i:0;s:13:"section_close";i:1;a:0:{}i:2;i:3724;}i:122;a:3:{i:0;s:12:"section_edit";i:1;a:4:{i:0;i:3413;i:1;i:3723;i:2;i:2;i:3;s:20:"14. Reunião RoboEDU";}i:2;i:3724;}i:123;a:3:{i:0;s:6:"header";i:1;a:3:{i:0;s:36:"15. Registro de Atividades Extensão";i:1;i:2;i:2;i:3724;}i:2;i:3724;}i:124;a:3:{i:0;s:12:"section_open";i:1;a:1:{i:0;i:2;}i:2;i:3724;}i:125;a:3:{i:0;s:6:"p_open";i:1;a:0:{}i:2;i:3772;}i:126;a:3:{i:0;s:5:"cdata";i:1;a:1:{i:0;s:99:"
Flores:Ciclo de Debates Marcelo: Mini-curso Tibério e Museu(ainda não iniciado). Pablo:curso de ";}i:2;i:3773;}i:127;a:3:{i:0;s:7:"acronym";i:1;a:1:{i:0;s:3:"PHP";}i:2;i:3872;}i:128;a:3:{i:0;s:5:"cdata";i:1;a:1:{i:0;s:17:" Gabriela:RoboEDU";}i:2;i:3875;}i:129;a:3:{i:0;s:7:"p_close";i:1;a:0:{}i:2;i:3892;}i:130;a:3:{i:0;s:13:"section_close";i:1;a:0:{}i:2;i:3894;}i:131;a:3:{i:0;s:12:"section_edit";i:1;a:4:{i:0;i:3724;i:1;i:3893;i:2;i:2;i:3;s:36:"15. Registro de Atividades Extensão";}i:2;i:3894;}i:132;a:3:{i:0;s:6:"header";i:1;a:3:{i:0;s:37:"16. Voluntário(Colaborador) ao Grupo";i:1;i:2;i:2;i:3894;}i:2;i:3894;}i:133;a:3:{i:0;s:12:"section_open";i:1;a:1:{i:0;i:2;}i:2;i:3894;}i:134;a:3:{i:0;s:6:"p_open";i:1;a:0:{}i:2;i:3943;}i:135;a:3:{i:0;s:5:"cdata";i:1;a:1:{i:0;s:106:"
Capra fala sobre um amigo da Eng. Mecânica que está interessado em ingressar como voluntário ao grupo.";}i:2;i:3944;}i:136;a:3:{i:0;s:7:"p_close";i:1;a:0:{}i:2;i:4050;}i:137;a:3:{i:0;s:13:"section_close";i:1;a:0:{}i:2;i:4052;}i:138;a:3:{i:0;s:12:"section_edit";i:1;a:4:{i:0;i:3894;i:1;i:4051;i:2;i:2;i:3;s:37:"16. Voluntário(Colaborador) ao Grupo";}i:2;i:4052;}i:139;a:3:{i:0;s:6:"header";i:1;a:3:{i:0;s:24:"17. Artigo sobre RoboEDU";i:1;i:2;i:2;i:4052;}i:2;i:4052;}i:140;a:3:{i:0;s:12:"section_open";i:1;a:1:{i:0;i:2;}i:2;i:4052;}i:141;a:3:{i:0;s:6:"p_open";i:1;a:0:{}i:2;i:4088;}i:142;a:3:{i:0;s:5:"cdata";i:1;a:1:{i:0;s:389:"
Mizu fala que não se pode entregar o artigo. Tentou contactar Thiago, não conseguiu e não deu para fazer o que restava sozinho no fim de semana. Fabiano comenta que na sexta todo mundo tinha combinado de fazer on-line, mas só ele ficou(falha de comunicação). Fabiano também cita que faltou comprometimento por parte de alguns. O artigo provavelmente será enviado ao Salão da PUC.";}i:2;i:4089;}i:143;a:3:{i:0;s:7:"p_close";i:1;a:0:{}i:2;i:4478;}i:144;a:3:{i:0;s:13:"section_close";i:1;a:0:{}i:2;i:4480;}i:145;a:3:{i:0;s:12:"section_edit";i:1;a:4:{i:0;i:4052;i:1;i:4479;i:2;i:2;i:3;s:24:"17. Artigo sobre RoboEDU";}i:2;i:4480;}i:146;a:3:{i:0;s:6:"header";i:1;a:3:{i:0;s:24:"18. Artigo sobre o Museu";i:1;i:2;i:2;i:4480;}i:2;i:4480;}i:147;a:3:{i:0;s:12:"section_open";i:1;a:1:{i:0;i:2;}i:2;i:4480;}i:148;a:3:{i:0;s:6:"p_open";i:1;a:0:{}i:2;i:4516;}i:149;a:3:{i:0;s:5:"cdata";i:1;a:1:{i:0;s:153:"
Flores, Marcelo e Cavalheiro ficam responsáveis por tentar fazer um artigo sobre o museu para o Salão da PUC. Mizu diz que também pode dar uma ajuda.";}i:2;i:4517;}i:150;a:3:{i:0;s:7:"p_close";i:1;a:0:{}i:2;i:4670;}i:151;a:3:{i:0;s:13:"section_close";i:1;a:0:{}i:2;i:4672;}i:152;a:3:{i:0;s:12:"section_edit";i:1;a:4:{i:0;i:4480;i:1;i:4671;i:2;i:2;i:3;s:24:"18. Artigo sobre o Museu";}i:2;i:4672;}i:153;a:3:{i:0;s:6:"header";i:1;a:3:{i:0;s:26:"19. Representante INTERPET";i:1;i:2;i:2;i:4672;}i:2;i:4672;}i:154;a:3:{i:0;s:12:"section_open";i:1;a:1:{i:0;i:2;}i:2;i:4672;}i:155;a:3:{i:0;s:6:"p_open";i:1;a:0:{}i:2;i:4710;}i:156;a:3:{i:0;s:5:"cdata";i:1;a:1:{i:0;s:61:"
Cavalheiro e Flores serão os representantes desse semestre.";}i:2;i:4711;}i:157;a:3:{i:0;s:7:"p_close";i:1;a:0:{}i:2;i:4772;}i:158;a:3:{i:0;s:13:"section_close";i:1;a:0:{}i:2;i:4774;}i:159;a:3:{i:0;s:12:"section_edit";i:1;a:4:{i:0;i:4672;i:1;i:4773;i:2;i:2;i:3;s:26:"19. Representante INTERPET";}i:2;i:4774;}i:160;a:3:{i:0;s:6:"header";i:1;a:3:{i:0;s:23:"20. Salão de Extensão";i:1;i:2;i:2;i:4774;}i:2;i:4774;}i:161;a:3:{i:0;s:12:"section_open";i:1;a:1:{i:0;i:2;}i:2;i:4774;}i:162;a:3:{i:0;s:6:"p_open";i:1;a:0:{}i:2;i:4809;}i:163;a:3:{i:0;s:5:"cdata";i:1;a:1:{i:0;s:75:"
As atividades do grupo selecionadas foram o Ciclo de Debates e o curso de ";}i:2;i:4810;}i:164;a:3:{i:0;s:7:"acronym";i:1;a:1:{i:0;s:4:"HTML";}i:2;i:4885;}i:165;a:3:{i:0;s:5:"cdata";i:1;a:1:{i:0;s:1:".";}i:2;i:4889;}i:166;a:3:{i:0;s:7:"p_close";i:1;a:0:{}i:2;i:4890;}i:167;a:3:{i:0;s:13:"section_close";i:1;a:0:{}i:2;i:4892;}i:168;a:3:{i:0;s:12:"section_edit";i:1;a:4:{i:0;i:4774;i:1;i:4891;i:2;i:2;i:3;s:23:"20. Salão de Extensão";}i:2;i:4892;}i:169;a:3:{i:0;s:6:"header";i:1;a:3:{i:0;s:22:"21. Confraternização";i:1;i:2;i:2;i:4892;}i:2;i:4892;}i:170;a:3:{i:0;s:12:"section_open";i:1;a:1:{i:0;i:2;}i:2;i:4892;}i:171;a:3:{i:0;s:6:"p_open";i:1;a:0:{}i:2;i:4926;}i:172;a:3:{i:0;s:5:"cdata";i:1;a:1:{i:0;s:74:"
Cavalheiro marcará futibas para o dia 31, uma quinta, por volta das 19h.";}i:2;i:4927;}i:173;a:3:{i:0;s:7:"p_close";i:1;a:0:{}i:2;i:5001;}i:174;a:3:{i:0;s:13:"section_close";i:1;a:0:{}i:2;i:5003;}i:175;a:3:{i:0;s:12:"section_edit";i:1;a:4:{i:0;i:4892;i:1;i:5002;i:2;i:2;i:3;s:22:"21. Confraternização";}i:2;i:5003;}i:176;a:3:{i:0;s:6:"header";i:1;a:3:{i:0;s:25:"22. Transparências SEURS";i:1;i:2;i:2;i:5003;}i:2;i:5003;}i:177;a:3:{i:0;s:12:"section_open";i:1;a:1:{i:0;i:2;}i:2;i:5003;}i:178;a:3:{i:0;s:6:"p_open";i:1;a:0:{}i:2;i:5040;}i:179;a:3:{i:0;s:5:"cdata";i:1;a:1:{i:0;s:49:"
Capra foi designado para confecção dos slides.";}i:2;i:5041;}i:180;a:3:{i:0;s:7:"p_close";i:1;a:0:{}i:2;i:5090;}i:181;a:3:{i:0;s:13:"section_close";i:1;a:0:{}i:2;i:5092;}i:182;a:3:{i:0;s:12:"section_edit";i:1;a:4:{i:0;i:5003;i:1;i:5091;i:2;i:2;i:3;s:25:"22. Transparências SEURS";}i:2;i:5092;}i:183;a:3:{i:0;s:6:"header";i:1;a:3:{i:0;s:35:"23. Horários das reuniões mensais";i:1;i:2;i:2;i:5092;}i:2;i:5092;}i:184;a:3:{i:0;s:12:"section_open";i:1;a:1:{i:0;i:2;}i:2;i:5092;}i:185;a:3:{i:0;s:6:"p_open";i:1;a:0:{}i:2;i:5139;}i:186;a:3:{i:0;s:5:"cdata";i:1;a:1:{i:0;s:82:"
Dia 29 será um ponte de pauta da reunião, a discussão dos relatórios mensais.";}i:2;i:5140;}i:187;a:3:{i:0;s:7:"p_close";i:1;a:0:{}i:2;i:5222;}i:188;a:3:{i:0;s:13:"section_close";i:1;a:0:{}i:2;i:5223;}i:189;a:3:{i:0;s:12:"section_edit";i:1;a:4:{i:0;i:5092;i:1;i:0;i:2;i:2;i:3;s:35:"23. Horários das reuniões mensais";}i:2;i:5223;}i:190;a:3:{i:0;s:12:"document_end";i:1;a:0:{}i:2;i:5223;}}