a:88:{i:0;a:3:{i:0;s:14:"document_start";i:1;a:0:{}i:2;i:0;}i:1;a:3:{i:0;s:6:"p_open";i:1;a:0:{}i:2;i:0;}i:2;a:3:{i:0;s:7:"p_close";i:1;a:0:{}i:2;i:1;}i:3;a:3:{i:0;s:12:"section_edit";i:1;a:4:{i:0;i:-1;i:1;i:0;i:2;i:1;i:3;s:0:"";}i:2;i:1;}i:4;a:3:{i:0;s:6:"header";i:1;a:3:{i:0;s:29:"Ata da Reunião de 18/01/2006";i:1;i:1;i:2;i:1;}i:2;i:1;}i:5;a:3:{i:0;s:12:"section_open";i:1;a:1:{i:0;i:1;}i:2;i:1;}i:6;a:3:{i:0;s:6:"p_open";i:1;a:0:{}i:2;i:44;}i:7;a:3:{i:0;s:5:"cdata";i:1;a:1:{i:0;s:95:"
Presentes: Dante, Diego, Estevão, Fabiano, Gustavo, Marcos, Nondillo, Paulo, Robert e Vicente";}i:2;i:45;}i:8;a:3:{i:0;s:7:"p_close";i:1;a:0:{}i:2;i:140;}i:9;a:3:{i:0;s:6:"p_open";i:1;a:0:{}i:2;i:140;}i:10;a:3:{i:0;s:5:"cdata";i:1;a:1:{i:0;s:59:"Ausentes: Felipe (Justificado), Paula (Justificado), Thiago";}i:2;i:142;}i:11;a:3:{i:0;s:7:"p_close";i:1;a:0:{}i:2;i:201;}i:12;a:3:{i:0;s:6:"p_open";i:1;a:0:{}i:2;i:201;}i:13;a:3:{i:0;s:5:"cdata";i:1;a:1:{i:0;s:17:"Relator: Nondillo";}i:2;i:203;}i:14;a:3:{i:0;s:7:"p_close";i:1;a:0:{}i:2;i:220;}i:15;a:3:{i:0;s:13:"section_close";i:1;a:0:{}i:2;i:222;}i:16;a:3:{i:0;s:12:"section_edit";i:1;a:4:{i:0;i:1;i:1;i:221;i:2;i:1;i:3;s:29:"Ata da Reunião de 18/01/2006";}i:2;i:222;}i:17;a:3:{i:0;s:6:"header";i:1;a:3:{i:0;s:18:"1. Barulho na sala";i:1;i:2;i:2;i:222;}i:2;i:222;}i:18;a:3:{i:0;s:12:"section_open";i:1;a:1:{i:0;i:2;}i:2;i:222;}i:19;a:3:{i:0;s:6:"p_open";i:1;a:0:{}i:2;i:252;}i:20;a:3:{i:0;s:5:"cdata";i:1;a:1:{i:0;s:149:"
Foi feita uma reclamação formal sobre o barulho excessivo na sala do PET no dia 17/01/2006, devido inclusive a presença de não petianos na sala.";}i:2;i:253;}i:21;a:3:{i:0;s:7:"p_close";i:1;a:0:{}i:2;i:402;}i:22;a:3:{i:0;s:13:"section_close";i:1;a:0:{}i:2;i:404;}i:23;a:3:{i:0;s:12:"section_edit";i:1;a:4:{i:0;i:222;i:1;i:403;i:2;i:2;i:3;s:18:"1. Barulho na sala";}i:2;i:404;}i:24;a:3:{i:0;s:6:"header";i:1;a:3:{i:0;s:37:"2. Planejamento mensal para fevereiro";i:1;i:2;i:2;i:404;}i:2;i:404;}i:25;a:3:{i:0;s:12:"section_open";i:1;a:1:{i:0;i:2;}i:2;i:404;}i:26;a:3:{i:0;s:6:"p_open";i:1;a:0:{}i:2;i:453;}i:27;a:3:{i:0;s:5:"cdata";i:1;a:1:{i:0;s:144:"
Férias para todos os petianos. Para quem não trabalhou em janeiro e vai trabalhar em fevereiro fica valendo o planejamento do mes de janeiro.";}i:2;i:454;}i:28;a:3:{i:0;s:7:"p_close";i:1;a:0:{}i:2;i:598;}i:29;a:3:{i:0;s:13:"section_close";i:1;a:0:{}i:2;i:600;}i:30;a:3:{i:0;s:12:"section_edit";i:1;a:4:{i:0;i:404;i:1;i:599;i:2;i:2;i:3;s:37:"2. Planejamento mensal para fevereiro";}i:2;i:600;}i:31;a:3:{i:0;s:6:"header";i:1;a:3:{i:0;s:26:"3. Planejamento trimestral";i:1;i:2;i:2;i:600;}i:2;i:600;}i:32;a:3:{i:0;s:12:"section_open";i:1;a:1:{i:0;i:2;}i:2;i:600;}i:33;a:3:{i:0;s:6:"p_open";i:1;a:0:{}i:2;i:638;}i:34;a:3:{i:0;s:5:"cdata";i:1;a:1:{i:0;s:394:"
O grupo novamente considerou importante a existência de um planejamento trimestral consistente. Os planejamentos mensais devem ser retirados diretamente do planejamento trimestral, que deve ser elaborado com mais cuidado e seriedade. O primeiro de 2006 será para os meses de março, maio e junho e deverá ser elaborado e concluído no começo de março, juntamente com o planejamento anual.";}i:2;i:639;}i:35;a:3:{i:0;s:7:"p_close";i:1;a:0:{}i:2;i:1033;}i:36;a:3:{i:0;s:13:"section_close";i:1;a:0:{}i:2;i:1035;}i:37;a:3:{i:0;s:12:"section_edit";i:1;a:4:{i:0;i:600;i:1;i:1034;i:2;i:2;i:3;s:26:"3. Planejamento trimestral";}i:2;i:1035;}i:38;a:3:{i:0;s:6:"header";i:1;a:3:{i:0;s:23:"4. Computador lendário";i:1;i:2;i:2;i:1035;}i:2;i:1035;}i:39;a:3:{i:0;s:12:"section_open";i:1;a:1:{i:0;i:2;}i:2;i:1035;}i:40;a:3:{i:0;s:6:"p_open";i:1;a:0:{}i:2;i:1070;}i:41;a:3:{i:0;s:5:"cdata";i:1;a:1:{i:0;s:163:"
Diego entrará em contato ainda nesta semana com Camila da PROPESQ para verificar o procedimento a ser tomado para finalmente efetivar a compra do novo PC do PET.";}i:2;i:1071;}i:42;a:3:{i:0;s:7:"p_close";i:1;a:0:{}i:2;i:1234;}i:43;a:3:{i:0;s:13:"section_close";i:1;a:0:{}i:2;i:1236;}i:44;a:3:{i:0;s:12:"section_edit";i:1;a:4:{i:0;i:1035;i:1;i:1235;i:2;i:2;i:3;s:23:"4. Computador lendário";}i:2;i:1236;}i:45;a:3:{i:0;s:6:"header";i:1;a:3:{i:0;s:20:"5. Saída do Gustavo";i:1;i:2;i:2;i:1236;}i:2;i:1236;}i:46;a:3:{i:0;s:12:"section_open";i:1;a:1:{i:0;i:2;}i:2;i:1236;}i:47;a:3:{i:0;s:6:"p_open";i:1;a:0:{}i:2;i:1268;}i:48;a:3:{i:0;s:5:"cdata";i:1;a:1:{i:0;s:125:"
Gustavo recebeu uma proposta da PROCEMPA e, por motivos financeiros, estará deixando o grupo PET no mês de março de 2006.";}i:2;i:1269;}i:49;a:3:{i:0;s:7:"p_close";i:1;a:0:{}i:2;i:1394;}i:50;a:3:{i:0;s:13:"section_close";i:1;a:0:{}i:2;i:1396;}i:51;a:3:{i:0;s:12:"section_edit";i:1;a:4:{i:0;i:1236;i:1;i:1395;i:2;i:2;i:3;s:20:"5. Saída do Gustavo";}i:2;i:1396;}i:52;a:3:{i:0;s:6:"header";i:1;a:3:{i:0;s:10:"6. LIFAPOR";i:1;i:2;i:2;i:1396;}i:2;i:1396;}i:53;a:3:{i:0;s:12:"section_open";i:1;a:1:{i:0;i:2;}i:2;i:1396;}i:54;a:3:{i:0;s:6:"p_open";i:1;a:0:{}i:2;i:1418;}i:55;a:3:{i:0;s:5:"cdata";i:1;a:1:{i:0;s:263:"
Gustavo deverá continuar como colaborador neste projeto. Vicente participará de reunião, dia 19/01/2006 as 10:30h na elétrica com a presença de Dante e Gustavo pelo PET, para inteirar-se dos trabalhos e definir sua possivel futura participação no projeto.";}i:2;i:1419;}i:56;a:3:{i:0;s:7:"p_close";i:1;a:0:{}i:2;i:1682;}i:57;a:3:{i:0;s:13:"section_close";i:1;a:0:{}i:2;i:1684;}i:58;a:3:{i:0;s:12:"section_edit";i:1;a:4:{i:0;i:1396;i:1;i:1683;i:2;i:2;i:3;s:10:"6. LIFAPOR";}i:2;i:1684;}i:59;a:3:{i:0;s:6:"header";i:1;a:3:{i:0;s:24:"7. Museu da Informática";i:1;i:2;i:2;i:1684;}i:2;i:1684;}i:60;a:3:{i:0;s:12:"section_open";i:1;a:1:{i:0;i:2;}i:2;i:1684;}i:61;a:3:{i:0;s:6:"p_open";i:1;a:0:{}i:2;i:1720;}i:62;a:3:{i:0;s:5:"cdata";i:1;a:1:{i:0;s:285:"
Foi criado um modelo de ficha de cadastramento do acervo e também um método para esse cadastramento. Gustavo fará uma banco de dados para automatizar o cadastro das peças. O cadastro deverá conter mais detelhes. Deverá ser criada alguma atração interativa para expor no museu.";}i:2;i:1721;}i:63;a:3:{i:0;s:7:"p_close";i:1;a:0:{}i:2;i:2006;}i:64;a:3:{i:0;s:13:"section_close";i:1;a:0:{}i:2;i:2008;}i:65;a:3:{i:0;s:12:"section_edit";i:1;a:4:{i:0;i:1684;i:1;i:2007;i:2;i:2;i:3;s:24:"7. Museu da Informática";}i:2;i:2008;}i:66;a:3:{i:0;s:6:"header";i:1;a:3:{i:0;s:26:"8.Relatório de Atividades";i:1;i:2;i:2;i:2008;}i:2;i:2008;}i:67;a:3:{i:0;s:12:"section_open";i:1;a:1:{i:0;i:2;}i:2;i:2008;}i:68;a:3:{i:0;s:6:"p_open";i:1;a:0:{}i:2;i:2046;}i:69;a:3:{i:0;s:5:"cdata";i:1;a:1:{i:0;s:286:"
Todos devem colocar no TRAC seus conceitos no ano de 2005. Será feita uma média aritmética ponderada pelo número de créditos de cada cadeira para obter-se um valor final que represente o desempelho do aluno. O valor de cada conceito fica assim definido: A=10; B=8; C=6; D=4; FF=2;";}i:2;i:2047;}i:70;a:3:{i:0;s:7:"p_close";i:1;a:0:{}i:2;i:2333;}i:71;a:3:{i:0;s:13:"section_close";i:1;a:0:{}i:2;i:2335;}i:72;a:3:{i:0;s:12:"section_edit";i:1;a:4:{i:0;i:2008;i:1;i:2334;i:2;i:2;i:3;s:26:"8.Relatório de Atividades";}i:2;i:2335;}i:73;a:3:{i:0;s:6:"header";i:1;a:3:{i:0;s:26:"9.Relatórios de Extensão";i:1;i:2;i:2;i:2335;}i:2;i:2335;}i:74;a:3:{i:0;s:12:"section_open";i:1;a:1:{i:0;i:2;}i:2;i:2335;}i:75;a:3:{i:0;s:6:"p_open";i:1;a:0:{}i:2;i:2373;}i:76;a:3:{i:0;s:5:"cdata";i:1;a:1:{i:0;s:219:"
Os relatórios de extensão foram feitos mas não foram incluídos no sistema pois é necessário o número do processo. Gustavo e Paulo ficaram responsáveis por obter este número e incluir os relatórios no sistema.";}i:2;i:2374;}i:77;a:3:{i:0;s:7:"p_close";i:1;a:0:{}i:2;i:2593;}i:78;a:3:{i:0;s:13:"section_close";i:1;a:0:{}i:2;i:2595;}i:79;a:3:{i:0;s:12:"section_edit";i:1;a:4:{i:0;i:2335;i:1;i:2594;i:2;i:2;i:3;s:26:"9.Relatórios de Extensão";}i:2;i:2595;}i:80;a:3:{i:0;s:6:"header";i:1;a:3:{i:0;s:26:"10. Discussão da Portaria";i:1;i:2;i:2;i:2595;}i:2;i:2595;}i:81;a:3:{i:0;s:12:"section_open";i:1;a:1:{i:0;i:2;}i:2;i:2595;}i:82;a:3:{i:0;s:6:"p_open";i:1;a:0:{}i:2;i:2633;}i:83;a:3:{i:0;s:5:"cdata";i:1;a:1:{i:0;s:120:"
Diego, como integrante da comissão que discutirá a portaria, registrou as decisões do grupo para bem representá-lo.";}i:2;i:2634;}i:84;a:3:{i:0;s:7:"p_close";i:1;a:0:{}i:2;i:2754;}i:85;a:3:{i:0;s:13:"section_close";i:1;a:0:{}i:2;i:2755;}i:86;a:3:{i:0;s:12:"section_edit";i:1;a:4:{i:0;i:2595;i:1;i:0;i:2;i:2;i:3;s:26:"10. Discussão da Portaria";}i:2;i:2755;}i:87;a:3:{i:0;s:12:"document_end";i:1;a:0:{}i:2;i:2755;}}