a:239:{i:0;a:3:{i:0;s:14:"document_start";i:1;a:0:{}i:2;i:0;}i:1;a:3:{i:0;s:6:"p_open";i:1;a:0:{}i:2;i:0;}i:2;a:3:{i:0;s:7:"p_close";i:1;a:0:{}i:2;i:1;}i:3;a:3:{i:0;s:12:"section_edit";i:1;a:4:{i:0;i:-1;i:1;i:0;i:2;i:1;i:3;s:0:"";}i:2;i:1;}i:4;a:3:{i:0;s:6:"header";i:1;a:3:{i:0;s:29:"Ata da reunião de 12/03/2009";i:1;i:1;i:2;i:1;}i:2;i:1;}i:5;a:3:{i:0;s:12:"section_open";i:1;a:1:{i:0;i:1;}i:2;i:1;}i:6;a:3:{i:0;s:10:"listu_open";i:1;a:0:{}i:2;i:45;}i:7;a:3:{i:0;s:13:"listitem_open";i:1;a:1:{i:0;i:1;}i:2;i:45;}i:8;a:3:{i:0;s:16:"listcontent_open";i:1;a:0:{}i:2;i:45;}i:9;a:3:{i:0;s:5:"cdata";i:1;a:1:{i:0;s:121:" Presentes: Marcos, Matheus, Fábio, Lucas Fialho, Bruno Guedes, Matheus Proença, Portal, Bruno Jurkovski, Bruno, Dante.";}i:2;i:49;}i:10;a:3:{i:0;s:17:"listcontent_close";i:1;a:0:{}i:2;i:170;}i:11;a:3:{i:0;s:14:"listitem_close";i:1;a:0:{}i:2;i:170;}i:12;a:3:{i:0;s:13:"listitem_open";i:1;a:1:{i:0;i:1;}i:2;i:170;}i:13;a:3:{i:0;s:16:"listcontent_open";i:1;a:0:{}i:2;i:170;}i:14;a:3:{i:0;s:5:"cdata";i:1;a:1:{i:0;s:54:" Ausentes: Felipe (Aula), Leonardo (Motivos de saúde)";}i:2;i:174;}i:15;a:3:{i:0;s:17:"listcontent_close";i:1;a:0:{}i:2;i:228;}i:16;a:3:{i:0;s:14:"listitem_close";i:1;a:0:{}i:2;i:228;}i:17;a:3:{i:0;s:13:"listitem_open";i:1;a:1:{i:0;i:1;}i:2;i:228;}i:18;a:3:{i:0;s:16:"listcontent_open";i:1;a:0:{}i:2;i:228;}i:19;a:3:{i:0;s:5:"cdata";i:1;a:1:{i:0;s:16:" Relator: Marcos";}i:2;i:232;}i:20;a:3:{i:0;s:17:"listcontent_close";i:1;a:0:{}i:2;i:248;}i:21;a:3:{i:0;s:14:"listitem_close";i:1;a:0:{}i:2;i:248;}i:22;a:3:{i:0;s:11:"listu_close";i:1;a:0:{}i:2;i:248;}i:23;a:3:{i:0;s:13:"section_close";i:1;a:0:{}i:2;i:250;}i:24;a:3:{i:0;s:12:"section_edit";i:1;a:4:{i:0;i:1;i:1;i:249;i:2;i:1;i:3;s:29:"Ata da reunião de 12/03/2009";}i:2;i:250;}i:25;a:3:{i:0;s:6:"header";i:1;a:3:{i:0;s:30:"1. Eleição do Líder (Grupo)";i:1;i:2;i:2;i:250;}i:2;i:250;}i:26;a:3:{i:0;s:12:"section_open";i:1;a:1:{i:0;i:2;}i:2;i:250;}i:27;a:3:{i:0;s:6:"p_open";i:1;a:0:{}i:2;i:292;}i:28;a:3:{i:0;s:5:"cdata";i:1;a:1:{i:0;s:192:"
Marcos e Proença candidataram-se ao cargo de novo líder do PET. Através de votação secreta, por 7 votos a 4, Proença é eleito o novo líder do PET. O grupo deseja um excelente reinado.";}i:2;i:293;}i:29;a:3:{i:0;s:7:"p_close";i:1;a:0:{}i:2;i:485;}i:30;a:3:{i:0;s:13:"section_close";i:1;a:0:{}i:2;i:487;}i:31;a:3:{i:0;s:12:"section_edit";i:1;a:4:{i:0;i:250;i:1;i:486;i:2;i:2;i:3;s:30:"1. Eleição do Líder (Grupo)";}i:2;i:487;}i:32;a:3:{i:0;s:6:"header";i:1;a:3:{i:0;s:39:"2. Ponto de Falta para Leonardo (Grupo)";i:1;i:2;i:2;i:487;}i:2;i:487;}i:33;a:3:{i:0;s:12:"section_open";i:1;a:1:{i:0;i:2;}i:2;i:487;}i:34;a:3:{i:0;s:6:"p_open";i:1;a:0:{}i:2;i:538;}i:35;a:3:{i:0;s:5:"cdata";i:1;a:1:{i:0;s:502:"
Leonardo, que apresentou problemas de saúde no último sábado, 7 de março, não fez as seis horas mínimas necessárias durante a semana anterior. O grupo discute sobre a tolerância, ou não, tendo em vista que ele vai sair em breve do PET. O acordado é que: como Leonardo vai ganhar o salário do PET referente ao mês de março, ele DEVE fazer as mesmas horas que os outros. Excetuando-se aí o tempo prejudicado pela saúde. O grupo por fim decide por não dar ponto de falta ao AINDA petiano.";}i:2;i:539;}i:36;a:3:{i:0;s:7:"p_close";i:1;a:0:{}i:2;i:1041;}i:37;a:3:{i:0;s:13:"section_close";i:1;a:0:{}i:2;i:1043;}i:38;a:3:{i:0;s:12:"section_edit";i:1;a:4:{i:0;i:487;i:1;i:1042;i:2;i:2;i:3;s:39:"2. Ponto de Falta para Leonardo (Grupo)";}i:2;i:1043;}i:39;a:3:{i:0;s:6:"header";i:1;a:3:{i:0;s:23:"3. Seleção (Proença)";i:1;i:2;i:2;i:1043;}i:2;i:1043;}i:40;a:3:{i:0;s:12:"section_open";i:1;a:1:{i:0;i:2;}i:2;i:1043;}i:41;a:3:{i:0;s:6:"p_open";i:1;a:0:{}i:2;i:1078;}i:42;a:3:{i:0;s:5:"cdata";i:1;a:1:{i:0;s:450:"
Tendo em vista a saída de Leonardo e quase certas saídas de Matheus, Bruno e Guedes, o grupo decide pela realização de uma nova seleção. O e-mail de aviso já foi enviado à lista da graduação dia 12/03. A palestra de apresentação está marcada para o dia 17/03. A comissão de seleção está, inicialmente, formada por Marcos, Bruno, Guedes e Proença. A data da seleção está marcada, inicialmente, para 23/03, passível de mudanças.";}i:2;i:1079;}i:43;a:3:{i:0;s:7:"p_close";i:1;a:0:{}i:2;i:1529;}i:44;a:3:{i:0;s:13:"section_close";i:1;a:0:{}i:2;i:1531;}i:45;a:3:{i:0;s:12:"section_edit";i:1;a:4:{i:0;i:1043;i:1;i:1530;i:2;i:2;i:3;s:23:"3. Seleção (Proença)";}i:2;i:1531;}i:46;a:3:{i:0;s:6:"header";i:1;a:3:{i:0;s:20:"4. CD's PET (Felipe)";i:1;i:2;i:2;i:1531;}i:2;i:1531;}i:47;a:3:{i:0;s:12:"section_open";i:1;a:1:{i:0;i:2;}i:2;i:1531;}i:48;a:3:{i:0;s:6:"p_open";i:1;a:0:{}i:2;i:1563;}i:49;a:3:{i:0;s:5:"cdata";i:1;a:1:{i:0;s:41:"
Felipe(em nota) fala que organizou os CD";}i:2;i:1564;}i:50;a:3:{i:0;s:18:"doublequoteclosing";i:1;a:0:{}i:2;i:1605;}i:51;a:3:{i:0;s:5:"cdata";i:1;a:1:{i:0;s:38:"s e pede se pode jogar fora vários CD";}i:2;i:1606;}i:52;a:3:{i:0;s:18:"doublequoteclosing";i:1;a:0:{}i:2;i:1644;}i:53;a:3:{i:0;s:5:"cdata";i:1;a:1:{i:0;s:121:"s que se apresentam de forma repetida. O grupo diz que SIM, pode jogar fora e se comprometem a não desorganizar os CD`s.";}i:2;i:1645;}i:54;a:3:{i:0;s:7:"p_close";i:1;a:0:{}i:2;i:1766;}i:55;a:3:{i:0;s:13:"section_close";i:1;a:0:{}i:2;i:1768;}i:56;a:3:{i:0;s:12:"section_edit";i:1;a:4:{i:0;i:1531;i:1;i:1767;i:2;i:2;i:3;s:20:"4. CD's PET (Felipe)";}i:2;i:1768;}i:57;a:3:{i:0;s:6:"header";i:1;a:3:{i:0;s:20:"5. Revistas (Felipe)";i:1;i:2;i:2;i:1768;}i:2;i:1768;}i:58;a:3:{i:0;s:12:"section_open";i:1;a:1:{i:0;i:2;}i:2;i:1768;}i:59;a:3:{i:0;s:6:"p_open";i:1;a:0:{}i:2;i:1800;}i:60;a:3:{i:0;s:5:"cdata";i:1;a:1:{i:0;s:159:"
Felipe pegou as revistas eletrônicas do PET e está catalogando e analisando tutoriais para, quem sabe, usar na SEMAC. O grupo não se manifesta à respeito.";}i:2;i:1801;}i:61;a:3:{i:0;s:7:"p_close";i:1;a:0:{}i:2;i:1960;}i:62;a:3:{i:0;s:13:"section_close";i:1;a:0:{}i:2;i:1962;}i:63;a:3:{i:0;s:12:"section_edit";i:1;a:4:{i:0;i:1768;i:1;i:1961;i:2;i:2;i:3;s:20:"5. Revistas (Felipe)";}i:2;i:1962;}i:64;a:3:{i:0;s:6:"header";i:1;a:3:{i:0;s:19:"6. Camisas (Felipe)";i:1;i:2;i:2;i:1962;}i:2;i:1962;}i:65;a:3:{i:0;s:12:"section_open";i:1;a:1:{i:0;i:2;}i:2;i:1962;}i:66;a:3:{i:0;s:6:"p_open";i:1;a:0:{}i:2;i:1993;}i:67;a:3:{i:0;s:5:"cdata";i:1;a:1:{i:0;s:204:"
É comentado à respeito da tão falada aquisição das camisas PET Computação. É ainda dada a idéia de colocar um logo ROBOCUP. O grupo acha uma excelente idéia mas ninguém se propõe a ir atrás.";}i:2;i:1994;}i:68;a:3:{i:0;s:7:"p_close";i:1;a:0:{}i:2;i:2198;}i:69;a:3:{i:0;s:13:"section_close";i:1;a:0:{}i:2;i:2200;}i:70;a:3:{i:0;s:12:"section_edit";i:1;a:4:{i:0;i:1962;i:1;i:2199;i:2;i:2;i:3;s:19:"6. Camisas (Felipe)";}i:2;i:2200;}i:71;a:3:{i:0;s:6:"header";i:1;a:3:{i:0;s:31:"7. Vícios de Internet (Felipe)";i:1;i:2;i:2;i:2200;}i:2;i:2200;}i:72;a:3:{i:0;s:12:"section_open";i:1;a:1:{i:0;i:2;}i:2;i:2200;}i:73;a:3:{i:0;s:6:"p_open";i:1;a:0:{}i:2;i:2243;}i:74;a:3:{i:0;s:5:"cdata";i:1;a:1:{i:0;s:135:"
Felipe fez o trabalho solicitado pelo tutor e enviou-lhe por e-mail. Dante comenta que o trabalho está excelente e está sendo usado.";}i:2;i:2244;}i:75;a:3:{i:0;s:7:"p_close";i:1;a:0:{}i:2;i:2379;}i:76;a:3:{i:0;s:13:"section_close";i:1;a:0:{}i:2;i:2381;}i:77;a:3:{i:0;s:12:"section_edit";i:1;a:4:{i:0;i:2200;i:1;i:2380;i:2;i:2;i:3;s:31:"7. Vícios de Internet (Felipe)";}i:2;i:2381;}i:78;a:3:{i:0;s:6:"header";i:1;a:3:{i:0;s:16:"8. Atas (Felipe)";i:1;i:2;i:2;i:2381;}i:2;i:2381;}i:79;a:3:{i:0;s:12:"section_open";i:1;a:1:{i:0;i:2;}i:2;i:2381;}i:80;a:3:{i:0;s:6:"p_open";i:1;a:0:{}i:2;i:2409;}i:81;a:3:{i:0;s:5:"cdata";i:1;a:1:{i:0;s:362:"
É falado sobre a 'pobreza' de informações da última ata do dia 03. Felipe diz que apenas lendo pelo TRAC não conseguiu extrair informações suficientemente importantes. Marcos, que também não se fez presente à reunião concorda. Surgem comentários de que não é a primeira ata do relator Matheus que recebe essa crítica e o petiano promete melhorar.";}i:2;i:2410;}i:82;a:3:{i:0;s:7:"p_close";i:1;a:0:{}i:2;i:2772;}i:83;a:3:{i:0;s:13:"section_close";i:1;a:0:{}i:2;i:2774;}i:84;a:3:{i:0;s:12:"section_edit";i:1;a:4:{i:0;i:2381;i:1;i:2773;i:2;i:2;i:3;s:16:"8. Atas (Felipe)";}i:2;i:2774;}i:85;a:3:{i:0;s:6:"header";i:1;a:3:{i:0;s:35:"9. Sala do PET e seriedade (Felipe)";i:1;i:2;i:2;i:2774;}i:2;i:2774;}i:86;a:3:{i:0;s:12:"section_open";i:1;a:1:{i:0;i:2;}i:2;i:2774;}i:87;a:3:{i:0;s:6:"p_open";i:1;a:0:{}i:2;i:2821;}i:88;a:3:{i:0;s:5:"cdata";i:1;a:1:{i:0;s:371:"
Felipe reclama que não conseguiu trabalhar na sala pelo barulho proporcionado pelos colegas PETianos. O motivo parece ser a algazarra motivada pelas diversões disponíveis em um site. Marcos comenta que na semana houve mais gente 'brincando' do que trabalhando na sala do PET. Resumo: O primeiro avisa está dado. No próximo, esse tipo de diversão estará bloqueado.";}i:2;i:2822;}i:89;a:3:{i:0;s:7:"p_close";i:1;a:0:{}i:2;i:3193;}i:90;a:3:{i:0;s:13:"section_close";i:1;a:0:{}i:2;i:3195;}i:91;a:3:{i:0;s:12:"section_edit";i:1;a:4:{i:0;i:2774;i:1;i:3194;i:2;i:2;i:3;s:35:"9. Sala do PET e seriedade (Felipe)";}i:2;i:3195;}i:92;a:3:{i:0;s:6:"header";i:1;a:3:{i:0;s:30:"10. Ajuda para Chassi (Felipe)";i:1;i:2;i:2;i:3195;}i:2;i:3195;}i:93;a:3:{i:0;s:12:"section_open";i:1;a:1:{i:0;i:2;}i:2;i:3195;}i:94;a:3:{i:0;s:6:"p_open";i:1;a:0:{}i:2;i:3237;}i:95;a:3:{i:0;s:5:"cdata";i:1;a:1:{i:0;s:333:"
Ponto que o relator não entendeu muito bem, visto que em sua lista onde constavam os comentários de Felipe, este ítem não constava. Proença presume se referir a um assunto que a princípio será resolvido na próxima segunda (se alguém tiver mais informações a respeito deste ítem mande-me um e-mail que eu atualizo aqui~!)";}i:2;i:3238;}i:96;a:3:{i:0;s:7:"p_close";i:1;a:0:{}i:2;i:3571;}i:97;a:3:{i:0;s:13:"section_close";i:1;a:0:{}i:2;i:3573;}i:98;a:3:{i:0;s:12:"section_edit";i:1;a:4:{i:0;i:3195;i:1;i:3572;i:2;i:2;i:3;s:30:"10. Ajuda para Chassi (Felipe)";}i:2;i:3573;}i:99;a:3:{i:0;s:6:"header";i:1;a:3:{i:0;s:23:"11. Cursos PET (Felipe)";i:1;i:2;i:2;i:3573;}i:2;i:3573;}i:100;a:3:{i:0;s:12:"section_open";i:1;a:1:{i:0;i:2;}i:2;i:3573;}i:101;a:3:{i:0;s:6:"p_open";i:1;a:0:{}i:2;i:3608;}i:102;a:3:{i:0;s:5:"cdata";i:1;a:1:{i:0;s:151:"
Sobre a realização de algum curso esse semestre. Como o RoboPET terá preferência, decide-se pela não realização de nenhum curso neste semestre.";}i:2;i:3609;}i:103;a:3:{i:0;s:7:"p_close";i:1;a:0:{}i:2;i:3760;}i:104;a:3:{i:0;s:13:"section_close";i:1;a:0:{}i:2;i:3762;}i:105;a:3:{i:0;s:12:"section_edit";i:1;a:4:{i:0;i:3573;i:1;i:3761;i:2;i:2;i:3;s:23:"11. Cursos PET (Felipe)";}i:2;i:3762;}i:106;a:3:{i:0;s:6:"header";i:1;a:3:{i:0;s:32:"12. Piso da sala do PET (Guedes)";i:1;i:2;i:2;i:3762;}i:2;i:3762;}i:107;a:3:{i:0;s:12:"section_open";i:1;a:1:{i:0;i:2;}i:2;i:3762;}i:108;a:3:{i:0;s:6:"p_open";i:1;a:0:{}i:2;i:3806;}i:109;a:3:{i:0;s:5:"cdata";i:1;a:1:{i:0;s:495:"
A troca do piso deveria ter sido feita em fevereiro, quando todos estariam de férias. Foi dada prioridade a outras salas do instituto e o piso não foi trocado. Luis Otávio diz que em breve será feita a troca. O grupo decide que a troca é válida(mesmo que atrapalhe por alguns dias o trabalho) e acha que deve ser feita entre sábado e terça-feira de alguma semana. A troca deve ser efetuada o mais breve possível pois, se vamos perder tempo de qualquer maneira, que seja longe de junho.";}i:2;i:3807;}i:110;a:3:{i:0;s:7:"p_close";i:1;a:0:{}i:2;i:4302;}i:111;a:3:{i:0;s:13:"section_close";i:1;a:0:{}i:2;i:4304;}i:112;a:3:{i:0;s:12:"section_edit";i:1;a:4:{i:0;i:3762;i:1;i:4303;i:2;i:2;i:3;s:32:"12. Piso da sala do PET (Guedes)";}i:2;i:4304;}i:113;a:3:{i:0;s:6:"header";i:1;a:3:{i:0;s:33:"13. Reuniões sexta 16:00 (Bruno)";i:1;i:2;i:2;i:4304;}i:2;i:4304;}i:114;a:3:{i:0;s:12:"section_open";i:1;a:1:{i:0;i:2;}i:2;i:4304;}i:115;a:3:{i:0;s:6:"p_open";i:1;a:0:{}i:2;i:4349;}i:116;a:3:{i:0;s:5:"cdata";i:1;a:1:{i:0;s:167:"
As reuniões de sexta podem ser realizadas as 16:00, sendo a PRÓXIMA REUNIÃO JÁ MARCADA PARA ESTE DIA E ESTA HORA. O rodízio quintas-sextas continuará ocorrendo.";}i:2;i:4350;}i:117;a:3:{i:0;s:7:"p_close";i:1;a:0:{}i:2;i:4517;}i:118;a:3:{i:0;s:13:"section_close";i:1;a:0:{}i:2;i:4519;}i:119;a:3:{i:0;s:12:"section_edit";i:1;a:4:{i:0;i:4304;i:1;i:4518;i:2;i:2;i:3;s:33:"13. Reuniões sexta 16:00 (Bruno)";}i:2;i:4519;}i:120;a:3:{i:0;s:6:"header";i:1;a:3:{i:0;s:20:"14. PETCafé (Bruno)";i:1;i:2;i:2;i:4519;}i:2;i:4519;}i:121;a:3:{i:0;s:12:"section_open";i:1;a:1:{i:0;i:2;}i:2;i:4519;}i:122;a:3:{i:0;s:6:"p_open";i:1;a:0:{}i:2;i:4551;}i:123;a:3:{i:0;s:5:"cdata";i:1;a:1:{i:0;s:164:"
Kauê, Matheus e Proença devem ainda Novembro. Dezembro apenas Bruno e Felipe PAGARAM. Janeiro e Fevereiro não serão cobrados. Março todos devem. PAGUEM BRUNO!";}i:2;i:4552;}i:124;a:3:{i:0;s:7:"p_close";i:1;a:0:{}i:2;i:4716;}i:125;a:3:{i:0;s:13:"section_close";i:1;a:0:{}i:2;i:4718;}i:126;a:3:{i:0;s:12:"section_edit";i:1;a:4:{i:0;i:4519;i:1;i:4717;i:2;i:2;i:3;s:20:"14. PETCafé (Bruno)";}i:2;i:4718;}i:127;a:3:{i:0;s:6:"header";i:1;a:3:{i:0;s:38:"15. Material de Consumo do PET (Bruno)";i:1;i:2;i:2;i:4718;}i:2;i:4718;}i:128;a:3:{i:0;s:12:"section_open";i:1;a:1:{i:0;i:2;}i:2;i:4718;}i:129;a:3:{i:0;s:6:"p_open";i:1;a:0:{}i:2;i:4768;}i:130;a:3:{i:0;s:5:"cdata";i:1;a:1:{i:0;s:359:"
Matheus falou com Michelle que enviará lista do que deve chegar. Queremos usar alguns recursos para o RoboPET, como por exemplo a aquisição das lentes das câmeras. Matheus vai pegar a declaração de rendimentos. Fala-se já sobre a aquisição de lentes: Lucas irá atrás disso e fará os cálculos e o que mais precisa, contando com a ajuda de Fábio.";}i:2;i:4769;}i:131;a:3:{i:0;s:7:"p_close";i:1;a:0:{}i:2;i:5128;}i:132;a:3:{i:0;s:13:"section_close";i:1;a:0:{}i:2;i:5130;}i:133;a:3:{i:0;s:12:"section_edit";i:1;a:4:{i:0;i:4718;i:1;i:5129;i:2;i:2;i:3;s:38:"15. Material de Consumo do PET (Bruno)";}i:2;i:5130;}i:134;a:3:{i:0;s:6:"header";i:1;a:3:{i:0;s:36:"16. Sugestão do Leonardo (Leonardo)";i:1;i:2;i:2;i:5130;}i:2;i:5130;}i:135;a:3:{i:0;s:12:"section_open";i:1;a:1:{i:0;i:2;}i:2;i:5130;}i:136;a:3:{i:0;s:6:"p_open";i:1;a:0:{}i:2;i:5178;}i:137;a:3:{i:0;s:5:"cdata";i:1;a:1:{i:0;s:254:"
1. Vergonha do mês -&gt; Seria atribuído ao PETiano com menos horas. O grupo decide pela NÃO validade da idéia. 2. Recorde (Proença) -&gt; Idéia legal, mas ninguém se propões a implementar. 3. Ponto de falta abonado para petiano do mês -&gt; OK";}i:2;i:5179;}i:138;a:3:{i:0;s:7:"p_close";i:1;a:0:{}i:2;i:5433;}i:139;a:3:{i:0;s:13:"section_close";i:1;a:0:{}i:2;i:5435;}i:140;a:3:{i:0;s:12:"section_edit";i:1;a:4:{i:0;i:5130;i:1;i:5434;i:2;i:2;i:3;s:36:"16. Sugestão do Leonardo (Leonardo)";}i:2;i:5435;}i:141;a:3:{i:0;s:6:"header";i:1;a:3:{i:0;s:29:"17. Relatório Mensal (Bruno)";i:1;i:2;i:2;i:5435;}i:2;i:5435;}i:142;a:3:{i:0;s:12:"section_open";i:1;a:1:{i:0;i:2;}i:2;i:5435;}i:143;a:3:{i:0;s:6:"p_open";i:1;a:0:{}i:2;i:5476;}i:144;a:3:{i:0;s:5:"cdata";i:1;a:1:{i:0;s:38:"
Novo líder é responsável por isso.";}i:2;i:5477;}i:145;a:3:{i:0;s:7:"p_close";i:1;a:0:{}i:2;i:5515;}i:146;a:3:{i:0;s:13:"section_close";i:1;a:0:{}i:2;i:5517;}i:147;a:3:{i:0;s:12:"section_edit";i:1;a:4:{i:0;i:5435;i:1;i:5516;i:2;i:2;i:3;s:29:"17. Relatório Mensal (Bruno)";}i:2;i:5517;}i:148;a:3:{i:0;s:6:"header";i:1;a:3:{i:0;s:31:"18. Reunião da PROPESQ (Bruno)";i:1;i:2;i:2;i:5517;}i:2;i:5517;}i:149;a:3:{i:0;s:12:"section_open";i:1;a:1:{i:0;i:2;}i:2;i:5517;}i:150;a:3:{i:0;s:6:"p_open";i:1;a:0:{}i:2;i:5560;}i:151;a:3:{i:0;s:5:"cdata";i:1;a:1:{i:0;s:577:"
Dante foi à reunião. Temos uma impressão positiva, embora sema poio financeiro. Terça teremos uma definição. Uma reunião com o diretor do II está marcada para segunda-feira próxima, 14:00. Dante pede para que façam um documento de 5 a 6 páginas falando sobre o projeto e que contenha a assinatura de todos. Sobre o cadastro no CNPQ é recomendado que façamos uma divulgação do projeto como algo que visa a popularização da ciência e podemos também ressaltar nossos projetos de robóticas junto as escolas. Dante busca também patrocínio junto à Petrobrás.";}i:2;i:5561;}i:152;a:3:{i:0;s:7:"p_close";i:1;a:0:{}i:2;i:6138;}i:153;a:3:{i:0;s:13:"section_close";i:1;a:0:{}i:2;i:6140;}i:154;a:3:{i:0;s:12:"section_edit";i:1;a:4:{i:0;i:5517;i:1;i:6139;i:2;i:2;i:3;s:31:"18. Reunião da PROPESQ (Bruno)";}i:2;i:6140;}i:155;a:3:{i:0;s:6:"header";i:1;a:3:{i:0;s:24:"19. PET ForLADY? (Bruno)";i:1;i:2;i:2;i:6140;}i:2;i:6140;}i:156;a:3:{i:0;s:12:"section_open";i:1;a:1:{i:0;i:2;}i:2;i:6140;}i:157;a:3:{i:0;s:6:"p_open";i:1;a:0:{}i:2;i:6176;}i:158;a:3:{i:0;s:5:"cdata";i:1;a:1:{i:0;s:71:"
Terças e quintas são os novos dias para o uso de idioma estrangeiro.";}i:2;i:6177;}i:159;a:3:{i:0;s:7:"p_close";i:1;a:0:{}i:2;i:6248;}i:160;a:3:{i:0;s:13:"section_close";i:1;a:0:{}i:2;i:6250;}i:161;a:3:{i:0;s:12:"section_edit";i:1;a:4:{i:0;i:6140;i:1;i:6249;i:2;i:2;i:3;s:24:"19. PET ForLADY? (Bruno)";}i:2;i:6250;}i:162;a:3:{i:0;s:6:"header";i:1;a:3:{i:0;s:21:"20. Extensão (Dante)";i:1;i:2;i:2;i:6250;}i:2;i:6250;}i:163;a:3:{i:0;s:12:"section_open";i:1;a:1:{i:0;i:2;}i:2;i:6250;}i:164;a:3:{i:0;s:6:"p_open";i:1;a:0:{}i:2;i:6283;}i:165;a:3:{i:0;s:5:"cdata";i:1;a:1:{i:0;s:189:"
Devido a um erro cometido por Marcos, alguns relatórios foram submetidos sem informações suficientes. Os relatórios retornarão ao sistema e Marcos vai atualizar os dados corretamente.";}i:2;i:6284;}i:166;a:3:{i:0;s:7:"p_close";i:1;a:0:{}i:2;i:6473;}i:167;a:3:{i:0;s:13:"section_close";i:1;a:0:{}i:2;i:6475;}i:168;a:3:{i:0;s:12:"section_edit";i:1;a:4:{i:0;i:6250;i:1;i:6474;i:2;i:2;i:3;s:21:"20. Extensão (Dante)";}i:2;i:6475;}i:169;a:3:{i:0;s:6:"header";i:1;a:3:{i:0;s:22:"21. LABS Dante (Dante)";i:1;i:2;i:2;i:6475;}i:2;i:6475;}i:170;a:3:{i:0;s:12:"section_open";i:1;a:1:{i:0;i:2;}i:2;i:6475;}i:171;a:3:{i:0;s:6:"p_open";i:1;a:0:{}i:2;i:6509;}i:172;a:3:{i:0;s:5:"cdata";i:1;a:1:{i:0;s:104:"
Dante fala rápido sobre um assunto que apenas ele e Proença entendem. Proença resolverá o problema.";}i:2;i:6510;}i:173;a:3:{i:0;s:7:"p_close";i:1;a:0:{}i:2;i:6614;}i:174;a:3:{i:0;s:13:"section_close";i:1;a:0:{}i:2;i:6616;}i:175;a:3:{i:0;s:12:"section_edit";i:1;a:4:{i:0;i:6475;i:1;i:6615;i:2;i:2;i:3;s:22:"21. LABS Dante (Dante)";}i:2;i:6616;}i:176;a:3:{i:0;s:6:"header";i:1;a:3:{i:0;s:16:"22. PS3 (Marcos)";i:1;i:2;i:2;i:6616;}i:2;i:6616;}i:177;a:3:{i:0;s:12:"section_open";i:1;a:1:{i:0;i:2;}i:2;i:6616;}i:178;a:3:{i:0;s:6:"p_open";i:1;a:0:{}i:2;i:6644;}i:179;a:3:{i:0;s:5:"cdata";i:1;a:1:{i:0;s:33:"
Marcos, que esta com a posse do ";}i:2;i:6645;}i:180;a:3:{i:0;s:12:"internallink";i:1;a:2:{i:0;s:20:"/trac/wiki/VideoGame";i:1;s:10:"VideoGame?";}i:2;i:6678;}i:181;a:3:{i:0;s:5:"cdata";i:1;a:1:{i:0;s:477:" ganho pelas PESSOAS presentes na Campus Party, argumenta sobre justiça, referindo-se à divisão da importância. Várias pessoas dão sua opinião e algumas insistem em suas idéias. O assunto é desviado e não é retomado. O relator acha-se no direito de tomar alguma decisão à respeito, pois tem um eletrônico em seu nome, lacrado e em sua casa, e o grupo parece esperar alguma definição. O problema DEIXARÁ de ser evitado e alguma decisão definitiva SERÁ tomada.";}i:2;i:6713;}i:182;a:3:{i:0;s:7:"p_close";i:1;a:0:{}i:2;i:7190;}i:183;a:3:{i:0;s:13:"section_close";i:1;a:0:{}i:2;i:7192;}i:184;a:3:{i:0;s:12:"section_edit";i:1;a:4:{i:0;i:6616;i:1;i:7191;i:2;i:2;i:3;s:16:"22. PS3 (Marcos)";}i:2;i:7192;}i:185;a:3:{i:0;s:6:"header";i:1;a:3:{i:0;s:7:"RoboPET";i:1;i:1;i:2;i:7192;}i:2;i:7192;}i:186;a:3:{i:0;s:12:"section_open";i:1;a:1:{i:0;i:1;}i:2;i:7192;}i:187;a:3:{i:0;s:13:"section_close";i:1;a:0:{}i:2;i:7215;}i:188;a:3:{i:0;s:12:"section_edit";i:1;a:4:{i:0;i:7192;i:1;i:7214;i:2;i:1;i:3;s:7:"RoboPET";}i:2;i:7215;}i:189;a:3:{i:0;s:6:"header";i:1;a:3:{i:0;s:10:"Orçamento";i:1;i:2;i:2;i:7215;}i:2;i:7215;}i:190;a:3:{i:0;s:12:"section_open";i:1;a:1:{i:0;i:2;}i:2;i:7215;}i:191;a:3:{i:0;s:6:"p_open";i:1;a:0:{}i:2;i:7237;}i:192;a:3:{i:0;s:5:"cdata";i:1;a:1:{i:0;s:404:"
Dante faz uma relação logística x técnica, buscando formas de cortar gastos. Percebe-se que não há cortes possíveis em relação à logística e quase nenhum à técnica. Fala-se sobre prazos para compras. Motores demoram cerca de 1 mês para chegar, chassis 2 semanas e placa também 1 mês. Foi confirmado que temos dinheiro para participar, embora não saibamos quantas pessoas do grupo irão.";}i:2;i:7238;}i:193;a:3:{i:0;s:7:"p_close";i:1;a:0:{}i:2;i:7642;}i:194;a:3:{i:0;s:13:"section_close";i:1;a:0:{}i:2;i:7644;}i:195;a:3:{i:0;s:12:"section_edit";i:1;a:4:{i:0;i:7215;i:1;i:7643;i:2;i:2;i:3;s:10:"Orçamento";}i:2;i:7644;}i:196;a:3:{i:0;s:6:"header";i:1;a:3:{i:0;s:5:"Visao";i:1;i:2;i:2;i:7644;}i:2;i:7644;}i:197;a:3:{i:0;s:12:"section_open";i:1;a:1:{i:0;i:2;}i:2;i:7644;}i:198;a:3:{i:0;s:6:"p_open";i:1;a:0:{}i:2;i:7661;}i:199;a:3:{i:0;s:5:"cdata";i:1;a:1:{i:0;s:184:"
Bruno J. arrumou problema no buffer. Reconhecimento de círculos não funcionou. Portal tem idéias para deixar mais rápida e vai aplicar sua idéias. Será dado foco no desbubbling.";}i:2;i:7662;}i:200;a:3:{i:0;s:7:"p_close";i:1;a:0:{}i:2;i:7846;}i:201;a:3:{i:0;s:13:"section_close";i:1;a:0:{}i:2;i:7848;}i:202;a:3:{i:0;s:12:"section_edit";i:1;a:4:{i:0;i:7644;i:1;i:7847;i:2;i:2;i:3;s:5:"Visao";}i:2;i:7848;}i:203;a:3:{i:0;s:6:"header";i:1;a:3:{i:0;s:2:"IA";i:1;i:2;i:2;i:7848;}i:2;i:7848;}i:204;a:3:{i:0;s:12:"section_open";i:1;a:1:{i:0;i:2;}i:2;i:7848;}i:205;a:3:{i:0;s:6:"p_open";i:1;a:0:{}i:2;i:7862;}i:206;a:3:{i:0;s:5:"cdata";i:1;a:1:{i:0;s:14:"
Está parada.";}i:2;i:7863;}i:207;a:3:{i:0;s:7:"p_close";i:1;a:0:{}i:2;i:7877;}i:208;a:3:{i:0;s:13:"section_close";i:1;a:0:{}i:2;i:7879;}i:209;a:3:{i:0;s:12:"section_edit";i:1;a:4:{i:0;i:7848;i:1;i:7878;i:2;i:2;i:3;s:2:"IA";}i:2;i:7879;}i:210;a:3:{i:0;s:6:"header";i:1;a:3:{i:0;s:9:"Mecânica";i:1;i:2;i:2;i:7879;}i:2;i:7879;}i:211;a:3:{i:0;s:12:"section_open";i:1;a:1:{i:0;i:2;}i:2;i:7879;}i:212;a:3:{i:0;s:6:"p_open";i:1;a:0:{}i:2;i:7900;}i:213;a:3:{i:0;s:5:"cdata";i:1;a:1:{i:0;s:53:"
Será buscada ajuda na Eng. Mec. da UFRGS no centro.";}i:2;i:7901;}i:214;a:3:{i:0;s:7:"p_close";i:1;a:0:{}i:2;i:7954;}i:215;a:3:{i:0;s:13:"section_close";i:1;a:0:{}i:2;i:7956;}i:216;a:3:{i:0;s:12:"section_edit";i:1;a:4:{i:0;i:7879;i:1;i:7955;i:2;i:2;i:3;s:9:"Mecânica";}i:2;i:7956;}i:217;a:3:{i:0;s:6:"header";i:1;a:3:{i:0;s:11:"Eletrônica";i:1;i:2;i:2;i:7956;}i:2;i:7956;}i:218;a:3:{i:0;s:12:"section_open";i:1;a:1:{i:0;i:2;}i:2;i:7956;}i:219;a:3:{i:0;s:6:"p_open";i:1;a:0:{}i:2;i:7979;}i:220;a:3:{i:0;s:5:"cdata";i:1;a:1:{i:0;s:103:"
Proença levará circuito para Hamiltom ver. Talvez ele use esse circuito como caso de estudo em aula.";}i:2;i:7980;}i:221;a:3:{i:0;s:7:"p_close";i:1;a:0:{}i:2;i:8083;}i:222;a:3:{i:0;s:13:"section_close";i:1;a:0:{}i:2;i:8085;}i:223;a:3:{i:0;s:12:"section_edit";i:1;a:4:{i:0;i:7956;i:1;i:8084;i:2;i:2;i:3;s:11:"Eletrônica";}i:2;i:8085;}i:224;a:3:{i:0;s:6:"header";i:1;a:3:{i:0;s:6:"Rádio";i:1;i:2;i:2;i:8085;}i:2;i:8085;}i:225;a:3:{i:0;s:12:"section_open";i:1;a:1:{i:0;i:2;}i:2;i:8085;}i:226;a:3:{i:0;s:6:"p_open";i:1;a:0:{}i:2;i:8103;}i:227;a:3:{i:0;s:5:"cdata";i:1;a:1:{i:0;s:60:"
Bruno espera um e-mail para aplicar a segunda freqüência.";}i:2;i:8104;}i:228;a:3:{i:0;s:7:"p_close";i:1;a:0:{}i:2;i:8164;}i:229;a:3:{i:0;s:13:"section_close";i:1;a:0:{}i:2;i:8166;}i:230;a:3:{i:0;s:12:"section_edit";i:1;a:4:{i:0;i:8085;i:1;i:8165;i:2;i:2;i:3;s:6:"Rádio";}i:2;i:8166;}i:231;a:3:{i:0;s:6:"header";i:1;a:3:{i:0;s:14:"Sábado, 21/03";i:1;i:2;i:2;i:8166;}i:2;i:8166;}i:232;a:3:{i:0;s:12:"section_open";i:1;a:1:{i:0;i:2;}i:2;i:8166;}i:233;a:3:{i:0;s:6:"p_open";i:1;a:0:{}i:2;i:8192;}i:234;a:3:{i:0;s:5:"cdata";i:1;a:1:{i:0;s:48:"
Possível dia de reunião no PET para trabalho.";}i:2;i:8193;}i:235;a:3:{i:0;s:7:"p_close";i:1;a:0:{}i:2;i:8241;}i:236;a:3:{i:0;s:13:"section_close";i:1;a:0:{}i:2;i:8242;}i:237;a:3:{i:0;s:12:"section_edit";i:1;a:4:{i:0;i:8166;i:1;i:0;i:2;i:2;i:3;s:14:"Sábado, 21/03";}i:2;i:8242;}i:238;a:3:{i:0;s:12:"document_end";i:1;a:0:{}i:2;i:8242;}}