**Planejamento PROGRAD {{ MÊS }} 2008**\\ \\

===== Antônio Augusto Fontoura =====

===== Bruno Landau Albrecht =====

===== Bruno Jurkovski =====

===== Bruno Silva Guedes =====

===== Cassiana Chassot Fulber =====

===== Fábio da Fontoura Beltrão =====

===== Felipe Augusto Chies =====

===== Gabriel Marques Portal =====

===== Kauê Silveira =====

===== Leonardo Piletti Chatain =====

===== Lucas Fialho Zawacki =====

===== Marcos Vinícius Cavinato =====

===== Matheus de Carvalho Proença =====

===== Matheus Vogel Pinto =====

===== Tyron Wittée Neetzow Scholem =====
