a:108:{i:0;a:3:{i:0;s:14:"document_start";i:1;a:0:{}i:2;i:0;}i:1;a:3:{i:0;s:6:"p_open";i:1;a:0:{}i:2;i:0;}i:2;a:3:{i:0;s:7:"p_close";i:1;a:0:{}i:2;i:1;}i:3;a:3:{i:0;s:12:"section_edit";i:1;a:4:{i:0;i:-1;i:1;i:0;i:2;i:1;i:3;s:0:"";}i:2;i:1;}i:4;a:3:{i:0;s:6:"header";i:1;a:3:{i:0;s:29:"Ata da Reunião de 12/04/2006";i:1;i:1;i:2;i:1;}i:2;i:1;}i:5;a:3:{i:0;s:12:"section_open";i:1;a:1:{i:0;i:1;}i:2;i:1;}i:6;a:3:{i:0;s:6:"p_open";i:1;a:0:{}i:2;i:44;}i:7;a:3:{i:0;s:5:"cdata";i:1;a:1:{i:0;s:152:"
Presentes: Alexandre, Dante, Eduardo, Estevão, Fabiano, Felipe, Gabriela, Lucas Cavalheiro, Lucas Mizusaki, Marcelo, Marcos, Nondillo, Ricardo, Thiago";}i:2;i:45;}i:8;a:3:{i:0;s:7:"p_close";i:1;a:0:{}i:2;i:197;}i:9;a:3:{i:0;s:6:"p_open";i:1;a:0:{}i:2;i:197;}i:10;a:3:{i:0;s:5:"cdata";i:1;a:1:{i:0;s:17:"Ausentes: Vicente";}i:2;i:199;}i:11;a:3:{i:0;s:7:"p_close";i:1;a:0:{}i:2;i:216;}i:12;a:3:{i:0;s:6:"p_open";i:1;a:0:{}i:2;i:216;}i:13;a:3:{i:0;s:5:"cdata";i:1;a:1:{i:0;s:15:"Relator: Marcos";}i:2;i:218;}i:14;a:3:{i:0;s:7:"p_close";i:1;a:0:{}i:2;i:233;}i:15;a:3:{i:0;s:13:"section_close";i:1;a:0:{}i:2;i:235;}i:16;a:3:{i:0;s:12:"section_edit";i:1;a:4:{i:0;i:1;i:1;i:234;i:2;i:1;i:3;s:29:"Ata da Reunião de 12/04/2006";}i:2;i:235;}i:17;a:3:{i:0;s:6:"header";i:1;a:3:{i:0;s:21:"1. Atividade Cultural";i:1;i:2;i:2;i:235;}i:2;i:235;}i:18;a:3:{i:0;s:12:"section_open";i:1;a:1:{i:0;i:2;}i:2;i:235;}i:19;a:3:{i:0;s:10:"quote_open";i:1;a:0:{}i:2;i:269;}i:20;a:3:{i:0;s:5:"cdata";i:1;a:1:{i:0;s:60:" Foi esclarecido a debandada geral da ida á peça do grupo ";}i:2;i:271;}i:21;a:3:{i:0;s:18:"doublequoteopening";i:1;a:0:{}i:2;i:331;}i:22;a:3:{i:0;s:5:"cdata";i:1;a:1:{i:0;s:21:"Oi Nóis Aqui Traveiz";}i:2;i:332;}i:23;a:3:{i:0;s:18:"doublequoteclosing";i:1;a:0:{}i:2;i:353;}i:24;a:3:{i:0;s:5:"cdata";i:1;a:1:{i:0;s:134:". Foi decidido que o livro 'Eu,Robô' será lido pelos petianos Marcos, Felipe, Gabriela, Alexandre e Lucas Mizusaki até o dia 26/04.";}i:2;i:354;}i:25;a:3:{i:0;s:11:"quote_close";i:1;a:0:{}i:2;i:488;}i:26;a:3:{i:0;s:13:"section_close";i:1;a:0:{}i:2;i:490;}i:27;a:3:{i:0;s:12:"section_edit";i:1;a:4:{i:0;i:235;i:1;i:489;i:2;i:2;i:3;s:21:"1. Atividade Cultural";}i:2;i:490;}i:28;a:3:{i:0;s:6:"header";i:1;a:3:{i:0;s:30:"2. Avaliação Mensal do Grupo";i:1;i:2;i:2;i:490;}i:2;i:490;}i:29;a:3:{i:0;s:12:"section_open";i:1;a:1:{i:0;i:2;}i:2;i:490;}i:30;a:3:{i:0;s:6:"p_open";i:1;a:0:{}i:2;i:532;}i:31;a:3:{i:0;s:5:"cdata";i:1;a:1:{i:0;s:214:"
Fabiano propõe a data de 27/04, ás 18h para a avaliação do grupo baseado nos relatórios semanais. O grupo deverá ler todos os relatórios e destacar pontos positivos e negativos.A data foi aceita pelo grupo.";}i:2;i:533;}i:32;a:3:{i:0;s:7:"p_close";i:1;a:0:{}i:2;i:747;}i:33;a:3:{i:0;s:13:"section_close";i:1;a:0:{}i:2;i:749;}i:34;a:3:{i:0;s:12:"section_edit";i:1;a:4:{i:0;i:490;i:1;i:748;i:2;i:2;i:3;s:30:"2. Avaliação Mensal do Grupo";}i:2;i:749;}i:35;a:3:{i:0;s:6:"header";i:1;a:3:{i:0;s:30:"3. Impressão dos Certificados";i:1;i:2;i:2;i:749;}i:2;i:749;}i:36;a:3:{i:0;s:12:"section_open";i:1;a:1:{i:0;i:2;}i:2;i:749;}i:37;a:3:{i:0;s:6:"p_open";i:1;a:0:{}i:2;i:791;}i:38;a:3:{i:0;s:5:"cdata";i:1;a:1:{i:0;s:148:"
Thiago e Estevão relatam, em relação aos certificados, que os dados já estão prontos e que não foi possível abrir a página para o cadastro.";}i:2;i:792;}i:39;a:3:{i:0;s:7:"p_close";i:1;a:0:{}i:2;i:940;}i:40;a:3:{i:0;s:13:"section_close";i:1;a:0:{}i:2;i:942;}i:41;a:3:{i:0;s:12:"section_edit";i:1;a:4:{i:0;i:749;i:1;i:941;i:2;i:2;i:3;s:30:"3. Impressão dos Certificados";}i:2;i:942;}i:42;a:3:{i:0;s:6:"header";i:1;a:3:{i:0;s:27:"4. Confraternização 13/04";i:1;i:2;i:2;i:942;}i:2;i:942;}i:43;a:3:{i:0;s:12:"section_open";i:1;a:1:{i:0;i:2;}i:2;i:942;}i:44;a:3:{i:0;s:6:"p_open";i:1;a:0:{}i:2;i:981;}i:45;a:3:{i:0;s:5:"cdata";i:1;a:1:{i:0;s:304:"
Lucas Cavalheiro confirmou o aluguel da HD, com o custo de R$8 para cada petiano. Em relação à pizzaria, foi escolhida a Companhia das Pizzas, na rua Vasco da Gama. Eduardo ficou encarregado de fazer reserva para as 21h. Todos que compareceram na reunião confirmaram presença na confraternização.";}i:2;i:982;}i:46;a:3:{i:0;s:7:"p_close";i:1;a:0:{}i:2;i:1286;}i:47;a:3:{i:0;s:13:"section_close";i:1;a:0:{}i:2;i:1288;}i:48;a:3:{i:0;s:12:"section_edit";i:1;a:4:{i:0;i:942;i:1;i:1287;i:2;i:2;i:3;s:27:"4. Confraternização 13/04";}i:2;i:1288;}i:49;a:3:{i:0;s:6:"header";i:1;a:3:{i:0;s:19:"5. Camisetas do PET";i:1;i:2;i:2;i:1288;}i:2;i:1288;}i:50;a:3:{i:0;s:12:"section_open";i:1;a:1:{i:0;i:2;}i:2;i:1288;}i:51;a:3:{i:0;s:6:"p_open";i:1;a:0:{}i:2;i:1319;}i:52;a:3:{i:0;s:5:"cdata";i:1;a:1:{i:0;s:148:"
Lucas Cavalheiro relatou as propostas de orçamento para as camisetas do PET. Ficou decidido que o grupo deverá pensar em modelos para a camiseta.";}i:2;i:1320;}i:53;a:3:{i:0;s:7:"p_close";i:1;a:0:{}i:2;i:1468;}i:54;a:3:{i:0;s:13:"section_close";i:1;a:0:{}i:2;i:1470;}i:55;a:3:{i:0;s:12:"section_edit";i:1;a:4:{i:0;i:1288;i:1;i:1469;i:2;i:2;i:3;s:19:"5. Camisetas do PET";}i:2;i:1470;}i:56;a:3:{i:0;s:6:"header";i:1;a:3:{i:0;s:20:"6. Decisões Futuras";i:1;i:2;i:2;i:1470;}i:2;i:1470;}i:57;a:3:{i:0;s:12:"section_open";i:1;a:1:{i:0;i:2;}i:2;i:1470;}i:58;a:3:{i:0;s:6:"p_open";i:1;a:0:{}i:2;i:1502;}i:59;a:3:{i:0;s:5:"cdata";i:1;a:1:{i:0;s:205:"
Fabiano comentou que as atividades marcadas para acontecerem em reuniões futuras muitas vezes são esquecidas, e propõe que o relator da ata que já coloque as decisões nas pautas da reuniões futuras.";}i:2;i:1503;}i:60;a:3:{i:0;s:7:"p_close";i:1;a:0:{}i:2;i:1708;}i:61;a:3:{i:0;s:13:"section_close";i:1;a:0:{}i:2;i:1710;}i:62;a:3:{i:0;s:12:"section_edit";i:1;a:4:{i:0;i:1470;i:1;i:1709;i:2;i:2;i:3;s:20:"6. Decisões Futuras";}i:2;i:1710;}i:63;a:3:{i:0;s:6:"header";i:1;a:3:{i:0;s:19:"7. Novidades Pet-Br";i:1;i:2;i:2;i:1710;}i:2;i:1710;}i:64;a:3:{i:0;s:12:"section_open";i:1;a:1:{i:0;i:2;}i:2;i:1710;}i:65;a:3:{i:0;s:6:"p_open";i:1;a:0:{}i:2;i:1741;}i:66;a:3:{i:0;s:5:"cdata";i:1;a:1:{i:0;s:75:"
Nondillo comentou as últimas discussões que aconteceram na lista Pet-Br.";}i:2;i:1742;}i:67;a:3:{i:0;s:7:"p_close";i:1;a:0:{}i:2;i:1817;}i:68;a:3:{i:0;s:13:"section_close";i:1;a:0:{}i:2;i:1819;}i:69;a:3:{i:0;s:12:"section_edit";i:1;a:4:{i:0;i:1710;i:1;i:1818;i:2;i:2;i:3;s:19:"7. Novidades Pet-Br";}i:2;i:1819;}i:70;a:3:{i:0;s:6:"header";i:1;a:3:{i:0;s:20:"8. Mochilas e pastas";i:1;i:2;i:2;i:1819;}i:2;i:1819;}i:71;a:3:{i:0;s:12:"section_open";i:1;a:1:{i:0;i:2;}i:2;i:1819;}i:72;a:3:{i:0;s:6:"p_open";i:1;a:0:{}i:2;i:1851;}i:73;a:3:{i:0;s:5:"cdata";i:1;a:1:{i:0;s:202:"
A estante já foi liberada para as mochilas e pastas. O material que estava lá irá ser analisado por Fabiano e Nondillo a fim de determinar quais são relevantes para o PET. O resto será descartado.";}i:2;i:1852;}i:74;a:3:{i:0;s:7:"p_close";i:1;a:0:{}i:2;i:2054;}i:75;a:3:{i:0;s:13:"section_close";i:1;a:0:{}i:2;i:2056;}i:76;a:3:{i:0;s:12:"section_edit";i:1;a:4:{i:0;i:1819;i:1;i:2055;i:2;i:2;i:3;s:20:"8. Mochilas e pastas";}i:2;i:2056;}i:77;a:3:{i:0;s:6:"header";i:1;a:3:{i:0;s:19:"9. Ciclo de Debates";i:1;i:2;i:2;i:2056;}i:2;i:2056;}i:78;a:3:{i:0;s:12:"section_open";i:1;a:1:{i:0;i:2;}i:2;i:2056;}i:79;a:3:{i:0;s:6:"p_open";i:1;a:0:{}i:2;i:2087;}i:80;a:3:{i:0;s:5:"cdata";i:1;a:1:{i:0;s:112:"
Nondillo e Thiago relatam o estado da criação do ciclo e se determinam a agilizar o processo de realização.";}i:2;i:2088;}i:81;a:3:{i:0;s:7:"p_close";i:1;a:0:{}i:2;i:2200;}i:82;a:3:{i:0;s:13:"section_close";i:1;a:0:{}i:2;i:2202;}i:83;a:3:{i:0;s:12:"section_edit";i:1;a:4:{i:0;i:2056;i:1;i:2201;i:2;i:2;i:3;s:19:"9. Ciclo de Debates";}i:2;i:2202;}i:84;a:3:{i:0;s:6:"header";i:1;a:3:{i:0;s:8:"10. CMCT";i:1;i:2;i:2;i:2202;}i:2;i:2202;}i:85;a:3:{i:0;s:12:"section_open";i:1;a:1:{i:0;i:2;}i:2;i:2202;}i:86;a:3:{i:0;s:6:"p_open";i:1;a:0:{}i:2;i:2222;}i:87;a:3:{i:0;s:5:"cdata";i:1;a:1:{i:0;s:160:"
Dante propõem a participação do PET no próximo CMCT. Ficou decidido que o grupo buscará informações em relação ao evento e trará na próxima reunião";}i:2;i:2223;}i:88;a:3:{i:0;s:7:"p_close";i:1;a:0:{}i:2;i:2383;}i:89;a:3:{i:0;s:13:"section_close";i:1;a:0:{}i:2;i:2385;}i:90;a:3:{i:0;s:12:"section_edit";i:1;a:4:{i:0;i:2202;i:1;i:2384;i:2;i:2;i:3;s:8:"10. CMCT";}i:2;i:2385;}i:91;a:3:{i:0;s:6:"header";i:1;a:3:{i:0;s:42:"11. Palestras do Dante (SulPET e Campinas)";i:1;i:2;i:2;i:2385;}i:2;i:2385;}i:92;a:3:{i:0;s:12:"section_open";i:1;a:1:{i:0;i:2;}i:2;i:2385;}i:93;a:3:{i:0;s:6:"p_open";i:1;a:0:{}i:2;i:2439;}i:94;a:3:{i:0;s:5:"cdata";i:1;a:1:{i:0;s:137:"
Gabriela ficou encarregada de ajudar Dante no material para a palestra em Campinas, e Lucas Mizusaki de ajudar no material para o SulPET";}i:2;i:2440;}i:95;a:3:{i:0;s:7:"p_close";i:1;a:0:{}i:2;i:2577;}i:96;a:3:{i:0;s:13:"section_close";i:1;a:0:{}i:2;i:2579;}i:97;a:3:{i:0;s:12:"section_edit";i:1;a:4:{i:0;i:2385;i:1;i:2578;i:2;i:2;i:3;s:42:"11. Palestras do Dante (SulPET e Campinas)";}i:2;i:2579;}i:98;a:3:{i:0;s:6:"header";i:1;a:3:{i:0;s:57:"12. Fabiano comenta [[/trac/wiki/Rob%C3%B4Edu|RobôEdu?]]";i:1;i:2;i:2;i:2579;}i:2;i:2579;}i:99;a:3:{i:0;s:12:"section_open";i:1;a:1:{i:0;i:2;}i:2;i:2579;}i:100;a:3:{i:0;s:6:"p_open";i:1;a:0:{}i:2;i:2648;}i:101;a:3:{i:0;s:5:"cdata";i:1;a:1:{i:0;s:50:"
Fabiano comentou sobre algumas decisões sobre o ";}i:2;i:2649;}i:102;a:3:{i:0;s:12:"internallink";i:1;a:2:{i:0;s:23:"/trac/wiki/Rob%C3%B4Edu";i:1;s:9:"RobôEdu?";}i:2;i:2699;}i:103;a:3:{i:0;s:5:"cdata";i:1;a:1:{i:0;s:107:". Comentou também sobre um material achado na Internet sobre raios infravermelhos e transmissão de dados.";}i:2;i:2736;}i:104;a:3:{i:0;s:7:"p_close";i:1;a:0:{}i:2;i:2843;}i:105;a:3:{i:0;s:13:"section_close";i:1;a:0:{}i:2;i:2844;}i:106;a:3:{i:0;s:12:"section_edit";i:1;a:4:{i:0;i:2579;i:1;i:0;i:2;i:2;i:3;s:57:"12. Fabiano comenta [[/trac/wiki/Rob%C3%B4Edu|RobôEdu?]]";}i:2;i:2844;}i:107;a:3:{i:0;s:12:"document_end";i:1;a:0:{}i:2;i:2844;}}