a:508:{i:0;a:3:{i:0;s:14:"document_start";i:1;a:0:{}i:2;i:0;}i:1;a:3:{i:0;s:6:"p_open";i:1;a:0:{}i:2;i:0;}i:2;a:3:{i:0;s:7:"p_close";i:1;a:0:{}i:2;i:1;}i:3;a:3:{i:0;s:12:"section_edit";i:1;a:4:{i:0;i:-1;i:1;i:0;i:2;i:1;i:3;s:0:"";}i:2;i:1;}i:4;a:3:{i:0;s:6:"header";i:1;a:3:{i:0;s:14:"Curso de Linux";i:1;i:1;i:2;i:1;}i:2;i:1;}i:5;a:3:{i:0;s:12:"section_open";i:1;a:1:{i:0;i:1;}i:2;i:1;}i:6;a:3:{i:0;s:6:"p_open";i:1;a:0:{}i:2;i:29;}i:7;a:3:{i:0;s:5:"cdata";i:1;a:1:{i:0;s:85:"
Esta página é destinada ao Curso de Linux do PET, seu planejamento, orgnaização.";}i:2;i:30;}i:8;a:3:{i:0;s:7:"p_close";i:1;a:0:{}i:2;i:115;}i:9;a:3:{i:0;s:13:"section_close";i:1;a:0:{}i:2;i:117;}i:10;a:3:{i:0;s:12:"section_edit";i:1;a:4:{i:0;i:1;i:1;i:116;i:2;i:1;i:3;s:14:"Curso de Linux";}i:2;i:117;}i:11;a:3:{i:0;s:6:"header";i:1;a:3:{i:0;s:8:"Material";i:1;i:2;i:2;i:117;}i:2;i:117;}i:12;a:3:{i:0;s:12:"section_open";i:1;a:1:{i:0;i:2;}i:2;i:117;}i:13;a:3:{i:0;s:10:"listu_open";i:1;a:0:{}i:2;i:138;}i:14;a:3:{i:0;s:13:"listitem_open";i:1;a:1:{i:0;i:1;}i:2;i:138;}i:15;a:3:{i:0;s:16:"listcontent_open";i:1;a:0:{}i:2;i:138;}i:16;a:3:{i:0;s:5:"cdata";i:1;a:1:{i:0;s:1:" ";}i:2;i:142;}i:17;a:3:{i:0;s:12:"externallink";i:1;a:2:{i:0;s:48:"http://www.inf.ufrgs.br/~mzambiasi/linux/2007-2/";i:1;s:6:"2007/2";}i:2;i:143;}i:18;a:3:{i:0;s:17:"listcontent_close";i:1;a:0:{}i:2;i:202;}i:19;a:3:{i:0;s:14:"listitem_close";i:1;a:0:{}i:2;i:202;}i:20;a:3:{i:0;s:13:"listitem_open";i:1;a:1:{i:0;i:1;}i:2;i:202;}i:21;a:3:{i:0;s:16:"listcontent_open";i:1;a:0:{}i:2;i:202;}i:22;a:3:{i:0;s:5:"cdata";i:1;a:1:{i:0;s:1:" ";}i:2;i:206;}i:23;a:3:{i:0;s:12:"externallink";i:1;a:2:{i:0;s:40:"http://www.inf.ufrgs.br/~mzambiasi/linux";i:1;s:6:"2008/1";}i:2;i:207;}i:24;a:3:{i:0;s:17:"listcontent_close";i:1;a:0:{}i:2;i:258;}i:25;a:3:{i:0;s:14:"listitem_close";i:1;a:0:{}i:2;i:258;}i:26;a:3:{i:0;s:11:"listu_close";i:1;a:0:{}i:2;i:258;}i:27;a:3:{i:0;s:13:"section_close";i:1;a:0:{}i:2;i:260;}i:28;a:3:{i:0;s:12:"section_edit";i:1;a:4:{i:0;i:117;i:1;i:259;i:2;i:2;i:3;s:8:"Material";}i:2;i:260;}i:29;a:3:{i:0;s:6:"header";i:1;a:3:{i:0;s:21:"Planejamento - 2007/2";i:1;i:2;i:2;i:260;}i:2;i:260;}i:30;a:3:{i:0;s:12:"section_open";i:1;a:1:{i:0;i:2;}i:2;i:260;}i:31;a:3:{i:0;s:6:"p_open";i:1;a:0:{}i:2;i:293;}i:32;a:3:{i:0;s:5:"cdata";i:1;a:1:{i:0;s:75:"
Futuramente estas aulas deverão ter sua própria página dentro do wiki.
";}i:2;i:294;}i:33;a:3:{i:0;s:7:"p_close";i:1;a:0:{}i:2;i:369;}i:34;a:3:{i:0;s:10:"listu_open";i:1;a:0:{}i:2;i:369;}i:35;a:3:{i:0;s:13:"listitem_open";i:1;a:1:{i:0;i:1;}i:2;i:369;}i:36;a:3:{i:0;s:16:"listcontent_open";i:1;a:0:{}i:2;i:369;}i:37;a:3:{i:0;s:5:"cdata";i:1;a:1:{i:0;s:41:" Aula 1: Introdução ao Ubuntu GNU/Linux";}i:2;i:373;}i:38;a:3:{i:0;s:17:"listcontent_close";i:1;a:0:{}i:2;i:414;}i:39;a:3:{i:0;s:10:"listu_open";i:1;a:0:{}i:2;i:414;}i:40;a:3:{i:0;s:13:"listitem_open";i:1;a:1:{i:0;i:2;}i:2;i:414;}i:41;a:3:{i:0;s:16:"listcontent_open";i:1;a:0:{}i:2;i:414;}i:42;a:3:{i:0;s:5:"cdata";i:1;a:1:{i:0;s:38:" História e Introdução ao GNU/Linux";}i:2;i:420;}i:43;a:3:{i:0;s:17:"listcontent_close";i:1;a:0:{}i:2;i:458;}i:44;a:3:{i:0;s:14:"listitem_close";i:1;a:0:{}i:2;i:458;}i:45;a:3:{i:0;s:13:"listitem_open";i:1;a:1:{i:0;i:2;}i:2;i:458;}i:46;a:3:{i:0;s:16:"listcontent_open";i:1;a:0:{}i:2;i:458;}i:47;a:3:{i:0;s:5:"cdata";i:1;a:1:{i:0;s:25:" Conceitos software livre";}i:2;i:464;}i:48;a:3:{i:0;s:17:"listcontent_close";i:1;a:0:{}i:2;i:489;}i:49;a:3:{i:0;s:14:"listitem_close";i:1;a:0:{}i:2;i:489;}i:50;a:3:{i:0;s:13:"listitem_open";i:1;a:1:{i:0;i:2;}i:2;i:489;}i:51;a:3:{i:0;s:16:"listcontent_open";i:1;a:0:{}i:2;i:489;}i:52;a:3:{i:0;s:5:"cdata";i:1;a:1:{i:0;s:45:" Introdução ao Ubuntu -&gt; Distribuições";}i:2;i:495;}i:53;a:3:{i:0;s:17:"listcontent_close";i:1;a:0:{}i:2;i:540;}i:54;a:3:{i:0;s:14:"listitem_close";i:1;a:0:{}i:2;i:540;}i:55;a:3:{i:0;s:13:"listitem_open";i:1;a:1:{i:0;i:2;}i:2;i:540;}i:56;a:3:{i:0;s:16:"listcontent_open";i:1;a:0:{}i:2;i:540;}i:57;a:3:{i:0;s:5:"cdata";i:1;a:1:{i:0;s:27:" Bootando o Ubuntu (LiveCD)";}i:2;i:546;}i:58;a:3:{i:0;s:17:"listcontent_close";i:1;a:0:{}i:2;i:573;}i:59;a:3:{i:0;s:14:"listitem_close";i:1;a:0:{}i:2;i:573;}i:60;a:3:{i:0;s:13:"listitem_open";i:1;a:1:{i:0;i:2;}i:2;i:573;}i:61;a:3:{i:0;s:16:"listcontent_open";i:1;a:0:{}i:2;i:573;}i:62;a:3:{i:0;s:5:"cdata";i:1;a:1:{i:0;s:15:" Ambiente GNOME";}i:2;i:579;}i:63;a:3:{i:0;s:17:"listcontent_close";i:1;a:0:{}i:2;i:594;}i:64;a:3:{i:0;s:10:"listu_open";i:1;a:0:{}i:2;i:594;}i:65;a:3:{i:0;s:13:"listitem_open";i:1;a:1:{i:0;i:3;}i:2;i:594;}i:66;a:3:{i:0;s:16:"listcontent_open";i:1;a:0:{}i:2;i:594;}i:67;a:3:{i:0;s:5:"cdata";i:1;a:1:{i:0;s:39:" Overview dos programas pré-instalados";}i:2;i:602;}i:68;a:3:{i:0;s:17:"listcontent_close";i:1;a:0:{}i:2;i:641;}i:69;a:3:{i:0;s:10:"listu_open";i:1;a:0:{}i:2;i:641;}i:70;a:3:{i:0;s:13:"listitem_open";i:1;a:1:{i:0;i:4;}i:2;i:641;}i:71;a:3:{i:0;s:16:"listcontent_open";i:1;a:0:{}i:2;i:641;}i:72;a:3:{i:0;s:5:"cdata";i:1;a:1:{i:0;s:18:" Firefox (plugins)";}i:2;i:651;}i:73;a:3:{i:0;s:17:"listcontent_close";i:1;a:0:{}i:2;i:669;}i:74;a:3:{i:0;s:14:"listitem_close";i:1;a:0:{}i:2;i:669;}i:75;a:3:{i:0;s:13:"listitem_open";i:1;a:1:{i:0;i:4;}i:2;i:669;}i:76;a:3:{i:0;s:16:"listcontent_open";i:1;a:0:{}i:2;i:669;}i:77;a:3:{i:0;s:5:"cdata";i:1;a:1:{i:0;s:12:" Multimídia";}i:2;i:679;}i:78;a:3:{i:0;s:17:"listcontent_close";i:1;a:0:{}i:2;i:691;}i:79;a:3:{i:0;s:10:"listu_open";i:1;a:0:{}i:2;i:691;}i:80;a:3:{i:0;s:13:"listitem_open";i:1;a:1:{i:0;i:5;}i:2;i:691;}i:81;a:3:{i:0;s:16:"listcontent_open";i:1;a:0:{}i:2;i:691;}i:82;a:3:{i:0;s:5:"cdata";i:1;a:1:{i:0;s:16:" Executando DVDs";}i:2;i:703;}i:83;a:3:{i:0;s:17:"listcontent_close";i:1;a:0:{}i:2;i:719;}i:84;a:3:{i:0;s:14:"listitem_close";i:1;a:0:{}i:2;i:719;}i:85;a:3:{i:0;s:13:"listitem_open";i:1;a:1:{i:0;i:5;}i:2;i:719;}i:86;a:3:{i:0;s:16:"listcontent_open";i:1;a:0:{}i:2;i:719;}i:87;a:3:{i:0;s:5:"cdata";i:1;a:1:{i:0;s:1:" ";}i:2;i:731;}i:88;a:3:{i:0;s:7:"acronym";i:1;a:1:{i:0;s:3:"MP3";}i:2;i:732;}i:89;a:3:{i:0;s:17:"listcontent_close";i:1;a:0:{}i:2;i:735;}i:90;a:3:{i:0;s:14:"listitem_close";i:1;a:0:{}i:2;i:735;}i:91;a:3:{i:0;s:13:"listitem_open";i:1;a:1:{i:0;i:5;}i:2;i:735;}i:92;a:3:{i:0;s:16:"listcontent_open";i:1;a:0:{}i:2;i:735;}i:93;a:3:{i:0;s:5:"cdata";i:1;a:1:{i:0;s:5:" Divx";}i:2;i:747;}i:94;a:3:{i:0;s:17:"listcontent_close";i:1;a:0:{}i:2;i:752;}i:95;a:3:{i:0;s:14:"listitem_close";i:1;a:0:{}i:2;i:752;}i:96;a:3:{i:0;s:11:"listu_close";i:1;a:0:{}i:2;i:752;}i:97;a:3:{i:0;s:14:"listitem_close";i:1;a:0:{}i:2;i:752;}i:98;a:3:{i:0;s:11:"listu_close";i:1;a:0:{}i:2;i:752;}i:99;a:3:{i:0;s:14:"listitem_close";i:1;a:0:{}i:2;i:752;}i:100;a:3:{i:0;s:13:"listitem_open";i:1;a:1:{i:0;i:3;}i:2;i:752;}i:101;a:3:{i:0;s:16:"listcontent_open";i:1;a:0:{}i:2;i:752;}i:102;a:3:{i:0;s:5:"cdata";i:1;a:1:{i:0;s:17:" Personalização";}i:2;i:760;}i:103;a:3:{i:0;s:17:"listcontent_close";i:1;a:0:{}i:2;i:777;}i:104;a:3:{i:0;s:14:"listitem_close";i:1;a:0:{}i:2;i:777;}i:105;a:3:{i:0;s:13:"listitem_open";i:1;a:1:{i:0;i:3;}i:2;i:777;}i:106;a:3:{i:0;s:16:"listcontent_open";i:1;a:0:{}i:2;i:777;}i:107;a:3:{i:0;s:5:"cdata";i:1;a:1:{i:0;s:16:" Administração";}i:2;i:785;}i:108;a:3:{i:0;s:17:"listcontent_close";i:1;a:0:{}i:2;i:801;}i:109;a:3:{i:0;s:10:"listu_open";i:1;a:0:{}i:2;i:801;}i:110;a:3:{i:0;s:13:"listitem_open";i:1;a:1:{i:0;i:4;}i:2;i:801;}i:111;a:3:{i:0;s:16:"listcontent_open";i:1;a:0:{}i:2;i:801;}i:112;a:3:{i:0;s:5:"cdata";i:1;a:1:{i:0;s:19:" Usuários e Grupos";}i:2;i:811;}i:113;a:3:{i:0;s:17:"listcontent_close";i:1;a:0:{}i:2;i:830;}i:114;a:3:{i:0;s:14:"listitem_close";i:1;a:0:{}i:2;i:830;}i:115;a:3:{i:0;s:13:"listitem_open";i:1;a:1:{i:0;i:4;}i:2;i:830;}i:116;a:3:{i:0;s:16:"listcontent_open";i:1;a:0:{}i:2;i:830;}i:117;a:3:{i:0;s:5:"cdata";i:1;a:1:{i:0;s:19:" Monitor de Sistema";}i:2;i:840;}i:118;a:3:{i:0;s:17:"listcontent_close";i:1;a:0:{}i:2;i:859;}i:119;a:3:{i:0;s:14:"listitem_close";i:1;a:0:{}i:2;i:859;}i:120;a:3:{i:0;s:13:"listitem_open";i:1;a:1:{i:0;i:4;}i:2;i:859;}i:121;a:3:{i:0;s:16:"listcontent_open";i:1;a:0:{}i:2;i:859;}i:122;a:3:{i:0;s:5:"cdata";i:1;a:1:{i:0;s:24:" Repositórios do Ubuntu";}i:2;i:869;}i:123;a:3:{i:0;s:17:"listcontent_close";i:1;a:0:{}i:2;i:893;}i:124;a:3:{i:0;s:14:"listitem_close";i:1;a:0:{}i:2;i:893;}i:125;a:3:{i:0;s:13:"listitem_open";i:1;a:1:{i:0;i:4;}i:2;i:893;}i:126;a:3:{i:0;s:16:"listcontent_open";i:1;a:0:{}i:2;i:893;}i:127;a:3:{i:0;s:5:"cdata";i:1;a:1:{i:0;s:9:" Synaptic";}i:2;i:903;}i:128;a:3:{i:0;s:17:"listcontent_close";i:1;a:0:{}i:2;i:912;}i:129;a:3:{i:0;s:14:"listitem_close";i:1;a:0:{}i:2;i:912;}i:130;a:3:{i:0;s:11:"listu_close";i:1;a:0:{}i:2;i:912;}i:131;a:3:{i:0;s:14:"listitem_close";i:1;a:0:{}i:2;i:912;}i:132;a:3:{i:0;s:11:"listu_close";i:1;a:0:{}i:2;i:912;}i:133;a:3:{i:0;s:14:"listitem_close";i:1;a:0:{}i:2;i:912;}i:134;a:3:{i:0;s:13:"listitem_open";i:1;a:1:{i:0;i:2;}i:2;i:912;}i:135;a:3:{i:0;s:16:"listcontent_open";i:1;a:0:{}i:2;i:912;}i:136;a:3:{i:0;s:5:"cdata";i:1;a:1:{i:0;s:43:" Comparativo de programas (Windows X Linux)";}i:2;i:918;}i:137;a:3:{i:0;s:17:"listcontent_close";i:1;a:0:{}i:2;i:961;}i:138;a:3:{i:0;s:14:"listitem_close";i:1;a:0:{}i:2;i:961;}i:139;a:3:{i:0;s:13:"listitem_open";i:1;a:1:{i:0;i:2;}i:2;i:961;}i:140;a:3:{i:0;s:16:"listcontent_open";i:1;a:0:{}i:2;i:961;}i:141;a:3:{i:0;s:5:"cdata";i:1;a:1:{i:0;s:21:" Onde procurar ajuda?";}i:2;i:967;}i:142;a:3:{i:0;s:17:"listcontent_close";i:1;a:0:{}i:2;i:988;}i:143;a:3:{i:0;s:14:"listitem_close";i:1;a:0:{}i:2;i:988;}i:144;a:3:{i:0;s:11:"listu_close";i:1;a:0:{}i:2;i:988;}i:145;a:3:{i:0;s:14:"listitem_close";i:1;a:0:{}i:2;i:988;}i:146;a:3:{i:0;s:11:"listu_close";i:1;a:0:{}i:2;i:988;}i:147;a:3:{i:0;s:10:"listu_open";i:1;a:0:{}i:2;i:989;}i:148;a:3:{i:0;s:13:"listitem_open";i:1;a:1:{i:0;i:1;}i:2;i:989;}i:149;a:3:{i:0;s:16:"listcontent_open";i:1;a:0:{}i:2;i:989;}i:150;a:3:{i:0;s:5:"cdata";i:1;a:1:{i:0;s:27:" Aula 2: Linha de comando I";}i:2;i:993;}i:151;a:3:{i:0;s:17:"listcontent_close";i:1;a:0:{}i:2;i:1020;}i:152;a:3:{i:0;s:10:"listu_open";i:1;a:0:{}i:2;i:1020;}i:153;a:3:{i:0;s:13:"listitem_open";i:1;a:1:{i:0;i:2;}i:2;i:1020;}i:154;a:3:{i:0;s:16:"listcontent_open";i:1;a:0:{}i:2;i:1020;}i:155;a:3:{i:0;s:5:"cdata";i:1;a:1:{i:0;s:17:" Terminal (Shell)";}i:2;i:1026;}i:156;a:3:{i:0;s:17:"listcontent_close";i:1;a:0:{}i:2;i:1043;}i:157;a:3:{i:0;s:14:"listitem_close";i:1;a:0:{}i:2;i:1043;}i:158;a:3:{i:0;s:13:"listitem_open";i:1;a:1:{i:0;i:2;}i:2;i:1043;}i:159;a:3:{i:0;s:16:"listcontent_open";i:1;a:0:{}i:2;i:1043;}i:160;a:3:{i:0;s:5:"cdata";i:1;a:1:{i:0;s:25:" Comando man (help, info)";}i:2;i:1049;}i:161;a:3:{i:0;s:17:"listcontent_close";i:1;a:0:{}i:2;i:1074;}i:162;a:3:{i:0;s:14:"listitem_close";i:1;a:0:{}i:2;i:1074;}i:163;a:3:{i:0;s:13:"listitem_open";i:1;a:1:{i:0;i:2;}i:2;i:1074;}i:164;a:3:{i:0;s:16:"listcontent_open";i:1;a:0:{}i:2;i:1074;}i:165;a:3:{i:0;s:5:"cdata";i:1;a:1:{i:0;s:45:" Estrutura de diretórios (/bin, /etc, /home ";}i:2;i:1080;}i:166;a:3:{i:0;s:6:"entity";i:1;a:1:{i:0;s:3:"...";}i:2;i:1125;}i:167;a:3:{i:0;s:5:"cdata";i:1;a:1:{i:0;s:1:")";}i:2;i:1128;}i:168;a:3:{i:0;s:17:"listcontent_close";i:1;a:0:{}i:2;i:1129;}i:169;a:3:{i:0;s:10:"listu_open";i:1;a:0:{}i:2;i:1129;}i:170;a:3:{i:0;s:13:"listitem_open";i:1;a:1:{i:0;i:3;}i:2;i:1129;}i:171;a:3:{i:0;s:16:"listcontent_open";i:1;a:0:{}i:2;i:1129;}i:172;a:3:{i:0;s:5:"cdata";i:1;a:1:{i:0;s:42:" Comandos (cd, ls, dir, pwd, mkdir, rmdir)";}i:2;i:1137;}i:173;a:3:{i:0;s:17:"listcontent_close";i:1;a:0:{}i:2;i:1179;}i:174;a:3:{i:0;s:14:"listitem_close";i:1;a:0:{}i:2;i:1179;}i:175;a:3:{i:0;s:11:"listu_close";i:1;a:0:{}i:2;i:1179;}i:176;a:3:{i:0;s:14:"listitem_close";i:1;a:0:{}i:2;i:1179;}i:177;a:3:{i:0;s:13:"listitem_open";i:1;a:1:{i:0;i:2;}i:2;i:1179;}i:178;a:3:{i:0;s:16:"listcontent_open";i:1;a:0:{}i:2;i:1179;}i:179;a:3:{i:0;s:5:"cdata";i:1;a:1:{i:0;s:9:" Arquivos";}i:2;i:1185;}i:180;a:3:{i:0;s:17:"listcontent_close";i:1;a:0:{}i:2;i:1194;}i:181;a:3:{i:0;s:10:"listu_open";i:1;a:0:{}i:2;i:1194;}i:182;a:3:{i:0;s:13:"listitem_open";i:1;a:1:{i:0;i:3;}i:2;i:1194;}i:183;a:3:{i:0;s:16:"listcontent_open";i:1;a:0:{}i:2;i:1194;}i:184;a:3:{i:0;s:5:"cdata";i:1;a:1:{i:0;s:46:" Comandos (cp, mv, rm, ln, file, find, locate)";}i:2;i:1202;}i:185;a:3:{i:0;s:17:"listcontent_close";i:1;a:0:{}i:2;i:1248;}i:186;a:3:{i:0;s:14:"listitem_close";i:1;a:0:{}i:2;i:1248;}i:187;a:3:{i:0;s:11:"listu_close";i:1;a:0:{}i:2;i:1248;}i:188;a:3:{i:0;s:14:"listitem_close";i:1;a:0:{}i:2;i:1248;}i:189;a:3:{i:0;s:13:"listitem_open";i:1;a:1:{i:0;i:2;}i:2;i:1248;}i:190;a:3:{i:0;s:16:"listcontent_open";i:1;a:0:{}i:2;i:1248;}i:191;a:3:{i:0;s:5:"cdata";i:1;a:1:{i:0;s:15:" Arquivos-Texto";}i:2;i:1254;}i:192;a:3:{i:0;s:17:"listcontent_close";i:1;a:0:{}i:2;i:1269;}i:193;a:3:{i:0;s:10:"listu_open";i:1;a:0:{}i:2;i:1269;}i:194;a:3:{i:0;s:13:"listitem_open";i:1;a:1:{i:0;i:3;}i:2;i:1269;}i:195;a:3:{i:0;s:16:"listcontent_open";i:1;a:0:{}i:2;i:1269;}i:196;a:3:{i:0;s:5:"cdata";i:1;a:1:{i:0;s:63:" Comandos (cat, tac, more, less, grep, vi, vim, diff, sort, nl)";}i:2;i:1277;}i:197;a:3:{i:0;s:17:"listcontent_close";i:1;a:0:{}i:2;i:1340;}i:198;a:3:{i:0;s:14:"listitem_close";i:1;a:0:{}i:2;i:1340;}i:199;a:3:{i:0;s:11:"listu_close";i:1;a:0:{}i:2;i:1340;}i:200;a:3:{i:0;s:14:"listitem_close";i:1;a:0:{}i:2;i:1340;}i:201;a:3:{i:0;s:13:"listitem_open";i:1;a:1:{i:0;i:2;}i:2;i:1340;}i:202;a:3:{i:0;s:16:"listcontent_open";i:1;a:0:{}i:2;i:1340;}i:203;a:3:{i:0;s:5:"cdata";i:1;a:1:{i:0;s:15:" Super Usuário";}i:2;i:1346;}i:204;a:3:{i:0;s:17:"listcontent_close";i:1;a:0:{}i:2;i:1361;}i:205;a:3:{i:0;s:10:"listu_open";i:1;a:0:{}i:2;i:1361;}i:206;a:3:{i:0;s:13:"listitem_open";i:1;a:1:{i:0;i:3;}i:2;i:1361;}i:207;a:3:{i:0;s:16:"listcontent_open";i:1;a:0:{}i:2;i:1361;}i:208;a:3:{i:0;s:5:"cdata";i:1;a:1:{i:0;s:20:" Comandos (sudo, su)";}i:2;i:1369;}i:209;a:3:{i:0;s:17:"listcontent_close";i:1;a:0:{}i:2;i:1389;}i:210;a:3:{i:0;s:14:"listitem_close";i:1;a:0:{}i:2;i:1389;}i:211;a:3:{i:0;s:11:"listu_close";i:1;a:0:{}i:2;i:1389;}i:212;a:3:{i:0;s:14:"listitem_close";i:1;a:0:{}i:2;i:1389;}i:213;a:3:{i:0;s:13:"listitem_open";i:1;a:1:{i:0;i:2;}i:2;i:1389;}i:214;a:3:{i:0;s:16:"listcontent_open";i:1;a:0:{}i:2;i:1389;}i:215;a:3:{i:0;s:5:"cdata";i:1;a:1:{i:0;s:24:" Permissões de arquivos";}i:2;i:1395;}i:216;a:3:{i:0;s:17:"listcontent_close";i:1;a:0:{}i:2;i:1419;}i:217;a:3:{i:0;s:10:"listu_open";i:1;a:0:{}i:2;i:1419;}i:218;a:3:{i:0;s:13:"listitem_open";i:1;a:1:{i:0;i:3;}i:2;i:1419;}i:219;a:3:{i:0;s:16:"listcontent_open";i:1;a:0:{}i:2;i:1419;}i:220;a:3:{i:0;s:5:"cdata";i:1;a:1:{i:0;s:32:" Comandos ( chmod, chown, chgrp)";}i:2;i:1427;}i:221;a:3:{i:0;s:17:"listcontent_close";i:1;a:0:{}i:2;i:1459;}i:222;a:3:{i:0;s:14:"listitem_close";i:1;a:0:{}i:2;i:1459;}i:223;a:3:{i:0;s:11:"listu_close";i:1;a:0:{}i:2;i:1459;}i:224;a:3:{i:0;s:14:"listitem_close";i:1;a:0:{}i:2;i:1459;}i:225;a:3:{i:0;s:13:"listitem_open";i:1;a:1:{i:0;i:2;}i:2;i:1459;}i:226;a:3:{i:0;s:16:"listcontent_open";i:1;a:0:{}i:2;i:1459;}i:227;a:3:{i:0;s:5:"cdata";i:1;a:1:{i:0;s:44:" Comandos Diversos (clear, reboot, shutdown)";}i:2;i:1465;}i:228;a:3:{i:0;s:17:"listcontent_close";i:1;a:0:{}i:2;i:1509;}i:229;a:3:{i:0;s:14:"listitem_close";i:1;a:0:{}i:2;i:1509;}i:230;a:3:{i:0;s:11:"listu_close";i:1;a:0:{}i:2;i:1509;}i:231;a:3:{i:0;s:14:"listitem_close";i:1;a:0:{}i:2;i:1509;}i:232;a:3:{i:0;s:11:"listu_close";i:1;a:0:{}i:2;i:1509;}i:233;a:3:{i:0;s:10:"listu_open";i:1;a:0:{}i:2;i:1510;}i:234;a:3:{i:0;s:13:"listitem_open";i:1;a:1:{i:0;i:1;}i:2;i:1510;}i:235;a:3:{i:0;s:16:"listcontent_open";i:1;a:0:{}i:2;i:1510;}i:236;a:3:{i:0;s:5:"cdata";i:1;a:1:{i:0;s:28:" Aula 3: Linha de comando II";}i:2;i:1514;}i:237;a:3:{i:0;s:17:"listcontent_close";i:1;a:0:{}i:2;i:1542;}i:238;a:3:{i:0;s:10:"listu_open";i:1;a:0:{}i:2;i:1542;}i:239;a:3:{i:0;s:13:"listitem_open";i:1;a:1:{i:0;i:2;}i:2;i:1542;}i:240;a:3:{i:0;s:16:"listcontent_open";i:1;a:0:{}i:2;i:1542;}i:241;a:3:{i:0;s:5:"cdata";i:1;a:1:{i:0;s:55:" Execução de comandos em background, sequencial, pipe";}i:2;i:1548;}i:242;a:3:{i:0;s:17:"listcontent_close";i:1;a:0:{}i:2;i:1603;}i:243;a:3:{i:0;s:14:"listitem_close";i:1;a:0:{}i:2;i:1603;}i:244;a:3:{i:0;s:13:"listitem_open";i:1;a:1:{i:0;i:2;}i:2;i:1603;}i:245;a:3:{i:0;s:16:"listcontent_open";i:1;a:0:{}i:2;i:1603;}i:246;a:3:{i:0;s:5:"cdata";i:1;a:1:{i:0;s:25:" Informações de Sistema";}i:2;i:1609;}i:247;a:3:{i:0;s:17:"listcontent_close";i:1;a:0:{}i:2;i:1634;}i:248;a:3:{i:0;s:10:"listu_open";i:1;a:0:{}i:2;i:1634;}i:249;a:3:{i:0;s:13:"listitem_open";i:1;a:1:{i:0;i:3;}i:2;i:1634;}i:250;a:3:{i:0;s:16:"listcontent_open";i:1;a:0:{}i:2;i:1634;}i:251;a:3:{i:0;s:5:"cdata";i:1;a:1:{i:0;s:45:" Comandos (date, cal, free, uname, dmesg, df)";}i:2;i:1642;}i:252;a:3:{i:0;s:17:"listcontent_close";i:1;a:0:{}i:2;i:1687;}i:253;a:3:{i:0;s:14:"listitem_close";i:1;a:0:{}i:2;i:1687;}i:254;a:3:{i:0;s:11:"listu_close";i:1;a:0:{}i:2;i:1687;}i:255;a:3:{i:0;s:14:"listitem_close";i:1;a:0:{}i:2;i:1687;}i:256;a:3:{i:0;s:13:"listitem_open";i:1;a:1:{i:0;i:2;}i:2;i:1687;}i:257;a:3:{i:0;s:16:"listcontent_open";i:1;a:0:{}i:2;i:1687;}i:258;a:3:{i:0;s:5:"cdata";i:1;a:1:{i:0;s:21:" Arquivos/Diretórios";}i:2;i:1693;}i:259;a:3:{i:0;s:17:"listcontent_close";i:1;a:0:{}i:2;i:1714;}i:260;a:3:{i:0;s:10:"listu_open";i:1;a:0:{}i:2;i:1714;}i:261;a:3:{i:0;s:13:"listitem_open";i:1;a:1:{i:0;i:3;}i:2;i:1714;}i:262;a:3:{i:0;s:16:"listcontent_open";i:1;a:0:{}i:2;i:1714;}i:263;a:3:{i:0;s:5:"cdata";i:1;a:1:{i:0;s:50:" Comandos ( whereis, du, ln, touch, mount, umount)";}i:2;i:1722;}i:264;a:3:{i:0;s:17:"listcontent_close";i:1;a:0:{}i:2;i:1772;}i:265;a:3:{i:0;s:14:"listitem_close";i:1;a:0:{}i:2;i:1772;}i:266;a:3:{i:0;s:11:"listu_close";i:1;a:0:{}i:2;i:1772;}i:267;a:3:{i:0;s:14:"listitem_close";i:1;a:0:{}i:2;i:1772;}i:268;a:3:{i:0;s:13:"listitem_open";i:1;a:1:{i:0;i:2;}i:2;i:1772;}i:269;a:3:{i:0;s:16:"listcontent_open";i:1;a:0:{}i:2;i:1772;}i:270;a:3:{i:0;s:5:"cdata";i:1;a:1:{i:0;s:1:" ";}i:2;i:1778;}i:271;a:3:{i:0;s:12:"internallink";i:1;a:2:{i:0;s:57:"/trac/wiki/Compacta%C3%A7%C3%A3o/Descompacta%C3%A7%C3%A3o";i:1;s:31:"Compactação/Descompactação?";}i:2;i:1779;}i:272;a:3:{i:0;s:17:"listcontent_close";i:1;a:0:{}i:2;i:1872;}i:273;a:3:{i:0;s:10:"listu_open";i:1;a:0:{}i:2;i:1872;}i:274;a:3:{i:0;s:13:"listitem_open";i:1;a:1:{i:0;i:3;}i:2;i:1872;}i:275;a:3:{i:0;s:16:"listcontent_open";i:1;a:0:{}i:2;i:1872;}i:276;a:3:{i:0;s:5:"cdata";i:1;a:1:{i:0;s:33:" Comandos (gzip, zip, unzip, tar)";}i:2;i:1880;}i:277;a:3:{i:0;s:17:"listcontent_close";i:1;a:0:{}i:2;i:1913;}i:278;a:3:{i:0;s:14:"listitem_close";i:1;a:0:{}i:2;i:1913;}i:279;a:3:{i:0;s:11:"listu_close";i:1;a:0:{}i:2;i:1913;}i:280;a:3:{i:0;s:14:"listitem_close";i:1;a:0:{}i:2;i:1913;}i:281;a:3:{i:0;s:13:"listitem_open";i:1;a:1:{i:0;i:2;}i:2;i:1913;}i:282;a:3:{i:0;s:16:"listcontent_open";i:1;a:0:{}i:2;i:1913;}i:283;a:3:{i:0;s:5:"cdata";i:1;a:1:{i:0;s:15:" Backup (rsync)";}i:2;i:1919;}i:284;a:3:{i:0;s:17:"listcontent_close";i:1;a:0:{}i:2;i:1934;}i:285;a:3:{i:0;s:14:"listitem_close";i:1;a:0:{}i:2;i:1934;}i:286;a:3:{i:0;s:13:"listitem_open";i:1;a:1:{i:0;i:2;}i:2;i:1934;}i:287;a:3:{i:0;s:16:"listcontent_open";i:1;a:0:{}i:2;i:1934;}i:288;a:3:{i:0;s:5:"cdata";i:1;a:1:{i:0;s:22:" Processos (o que é!)";}i:2;i:1940;}i:289;a:3:{i:0;s:17:"listcontent_close";i:1;a:0:{}i:2;i:1962;}i:290;a:3:{i:0;s:10:"listu_open";i:1;a:0:{}i:2;i:1962;}i:291;a:3:{i:0;s:13:"listitem_open";i:1;a:1:{i:0;i:3;}i:2;i:1962;}i:292;a:3:{i:0;s:16:"listcontent_open";i:1;a:0:{}i:2;i:1962;}i:293;a:3:{i:0;s:5:"cdata";i:1;a:1:{i:0;s:65:" Comandos sobre processos (ps, kill, killall, w, jobs, top, time)";}i:2;i:1970;}i:294;a:3:{i:0;s:17:"listcontent_close";i:1;a:0:{}i:2;i:2035;}i:295;a:3:{i:0;s:14:"listitem_close";i:1;a:0:{}i:2;i:2035;}i:296;a:3:{i:0;s:11:"listu_close";i:1;a:0:{}i:2;i:2035;}i:297;a:3:{i:0;s:14:"listitem_close";i:1;a:0:{}i:2;i:2035;}i:298;a:3:{i:0;s:13:"listitem_open";i:1;a:1:{i:0;i:2;}i:2;i:2035;}i:299;a:3:{i:0;s:16:"listcontent_open";i:1;a:0:{}i:2;i:2035;}i:300;a:3:{i:0;s:5:"cdata";i:1;a:1:{i:0;s:5:" Rede";}i:2;i:2041;}i:301;a:3:{i:0;s:17:"listcontent_close";i:1;a:0:{}i:2;i:2046;}i:302;a:3:{i:0;s:10:"listu_open";i:1;a:0:{}i:2;i:2046;}i:303;a:3:{i:0;s:13:"listitem_open";i:1;a:1:{i:0;i:3;}i:2;i:2046;}i:304;a:3:{i:0;s:16:"listcontent_open";i:1;a:0:{}i:2;i:2046;}i:305;a:3:{i:0;s:5:"cdata";i:1;a:1:{i:0;s:42:" Comandos (ifconfig, ping, ssh, scp, wget ";}i:2;i:2054;}i:306;a:3:{i:0;s:6:"entity";i:1;a:1:{i:0;s:3:"...";}i:2;i:2096;}i:307;a:3:{i:0;s:5:"cdata";i:1;a:1:{i:0;s:1:")";}i:2;i:2099;}i:308;a:3:{i:0;s:17:"listcontent_close";i:1;a:0:{}i:2;i:2100;}i:309;a:3:{i:0;s:14:"listitem_close";i:1;a:0:{}i:2;i:2100;}i:310;a:3:{i:0;s:11:"listu_close";i:1;a:0:{}i:2;i:2100;}i:311;a:3:{i:0;s:14:"listitem_close";i:1;a:0:{}i:2;i:2100;}i:312;a:3:{i:0;s:13:"listitem_open";i:1;a:1:{i:0;i:2;}i:2;i:2100;}i:313;a:3:{i:0;s:16:"listcontent_open";i:1;a:0:{}i:2;i:2100;}i:314;a:3:{i:0;s:5:"cdata";i:1;a:1:{i:0;s:52:" Apt-get (Pacotes!!!) -&gt;Talvez passe para aula 2!";}i:2;i:2106;}i:315;a:3:{i:0;s:17:"listcontent_close";i:1;a:0:{}i:2;i:2158;}i:316;a:3:{i:0;s:14:"listitem_close";i:1;a:0:{}i:2;i:2158;}i:317;a:3:{i:0;s:13:"listitem_open";i:1;a:1:{i:0;i:2;}i:2;i:2158;}i:318;a:3:{i:0;s:16:"listcontent_open";i:1;a:0:{}i:2;i:2158;}i:319;a:3:{i:0;s:5:"cdata";i:1;a:1:{i:0;s:52:" Instalando programas a partir de fontes. (make, etc";}i:2;i:2164;}i:320;a:3:{i:0;s:6:"entity";i:1;a:1:{i:0;s:3:"...";}i:2;i:2216;}i:321;a:3:{i:0;s:5:"cdata";i:1;a:1:{i:0;s:1:")";}i:2;i:2219;}i:322;a:3:{i:0;s:17:"listcontent_close";i:1;a:0:{}i:2;i:2220;}i:323;a:3:{i:0;s:14:"listitem_close";i:1;a:0:{}i:2;i:2220;}i:324;a:3:{i:0;s:11:"listu_close";i:1;a:0:{}i:2;i:2220;}i:325;a:3:{i:0;s:14:"listitem_close";i:1;a:0:{}i:2;i:2220;}i:326;a:3:{i:0;s:11:"listu_close";i:1;a:0:{}i:2;i:2220;}i:327;a:3:{i:0;s:10:"listu_open";i:1;a:0:{}i:2;i:2221;}i:328;a:3:{i:0;s:13:"listitem_open";i:1;a:1:{i:0;i:1;}i:2;i:2221;}i:329;a:3:{i:0;s:16:"listcontent_open";i:1;a:0:{}i:2;i:2221;}i:330;a:3:{i:0;s:5:"cdata";i:1;a:1:{i:0;s:1:" ";}i:2;i:2225;}i:331;a:3:{i:0;s:12:"internallink";i:1;a:2:{i:0;s:16:"/trac/wiki/aula4";i:1;s:6:"Aula 4";}i:2;i:2226;}i:332;a:3:{i:0;s:5:"cdata";i:1;a:1:{i:0;s:25:": Administração Básica";}i:2;i:2253;}i:333;a:3:{i:0;s:17:"listcontent_close";i:1;a:0:{}i:2;i:2278;}i:334;a:3:{i:0;s:10:"listu_open";i:1;a:0:{}i:2;i:2278;}i:335;a:3:{i:0;s:13:"listitem_open";i:1;a:1:{i:0;i:2;}i:2;i:2278;}i:336;a:3:{i:0;s:16:"listcontent_open";i:1;a:0:{}i:2;i:2278;}i:337;a:3:{i:0;s:5:"cdata";i:1;a:1:{i:0;s:20:" Introdução ao Vim";}i:2;i:2284;}i:338;a:3:{i:0;s:17:"listcontent_close";i:1;a:0:{}i:2;i:2304;}i:339;a:3:{i:0;s:14:"listitem_close";i:1;a:0:{}i:2;i:2304;}i:340;a:3:{i:0;s:13:"listitem_open";i:1;a:1:{i:0;i:2;}i:2;i:2304;}i:341;a:3:{i:0;s:16:"listcontent_open";i:1;a:0:{}i:2;i:2304;}i:342;a:3:{i:0;s:5:"cdata";i:1;a:1:{i:0;s:6:" Shell";}i:2;i:2310;}i:343;a:3:{i:0;s:17:"listcontent_close";i:1;a:0:{}i:2;i:2316;}i:344;a:3:{i:0;s:10:"listu_open";i:1;a:0:{}i:2;i:2316;}i:345;a:3:{i:0;s:13:"listitem_open";i:1;a:1:{i:0;i:3;}i:2;i:2316;}i:346;a:3:{i:0;s:16:"listcontent_open";i:1;a:0:{}i:2;i:2316;}i:347;a:3:{i:0;s:5:"cdata";i:1;a:1:{i:0;s:21:" Redireção de Fluxo";}i:2;i:2324;}i:348;a:3:{i:0;s:17:"listcontent_close";i:1;a:0:{}i:2;i:2345;}i:349;a:3:{i:0;s:14:"listitem_close";i:1;a:0:{}i:2;i:2345;}i:350;a:3:{i:0;s:11:"listu_close";i:1;a:0:{}i:2;i:2345;}i:351;a:3:{i:0;s:14:"listitem_close";i:1;a:0:{}i:2;i:2345;}i:352;a:3:{i:0;s:13:"listitem_open";i:1;a:1:{i:0;i:2;}i:2;i:2345;}i:353;a:3:{i:0;s:16:"listcontent_open";i:1;a:0:{}i:2;i:2345;}i:354;a:3:{i:0;s:5:"cdata";i:1;a:1:{i:0;s:136:" Comandos para manipulação de contas (adduser, addgroup, passwd, newgrp, userdel, groupdel, lastlog, last, id, logname, users, groups)";}i:2;i:2351;}i:355;a:3:{i:0;s:17:"listcontent_close";i:1;a:0:{}i:2;i:2487;}i:356;a:3:{i:0;s:14:"listitem_close";i:1;a:0:{}i:2;i:2487;}i:357;a:3:{i:0;s:13:"listitem_open";i:1;a:1:{i:0;i:2;}i:2;i:2487;}i:358;a:3:{i:0;s:16:"listcontent_open";i:1;a:0:{}i:2;i:2487;}i:359;a:3:{i:0;s:5:"cdata";i:1;a:1:{i:0;s:38:" Configuração de arquivos de sistema";}i:2;i:2493;}i:360;a:3:{i:0;s:17:"listcontent_close";i:1;a:0:{}i:2;i:2531;}i:361;a:3:{i:0;s:14:"listitem_close";i:1;a:0:{}i:2;i:2531;}i:362;a:3:{i:0;s:13:"listitem_open";i:1;a:1:{i:0;i:2;}i:2;i:2531;}i:363;a:3:{i:0;s:16:"listcontent_open";i:1;a:0:{}i:2;i:2531;}i:364;a:3:{i:0;s:5:"cdata";i:1;a:1:{i:0;s:27:" Scripts de inicialização";}i:2;i:2537;}i:365;a:3:{i:0;s:17:"listcontent_close";i:1;a:0:{}i:2;i:2564;}i:366;a:3:{i:0;s:14:"listitem_close";i:1;a:0:{}i:2;i:2564;}i:367;a:3:{i:0;s:13:"listitem_open";i:1;a:1:{i:0;i:2;}i:2;i:2564;}i:368;a:3:{i:0;s:16:"listcontent_open";i:1;a:0:{}i:2;i:2564;}i:369;a:3:{i:0;s:5:"cdata";i:1;a:1:{i:0;s:34:" etc/passwd, etc/shadow, etc/group";}i:2;i:2570;}i:370;a:3:{i:0;s:17:"listcontent_close";i:1;a:0:{}i:2;i:2604;}i:371;a:3:{i:0;s:14:"listitem_close";i:1;a:0:{}i:2;i:2604;}i:372;a:3:{i:0;s:13:"listitem_open";i:1;a:1:{i:0;i:2;}i:2;i:2604;}i:373;a:3:{i:0;s:16:"listcontent_open";i:1;a:0:{}i:2;i:2604;}i:374;a:3:{i:0;s:5:"cdata";i:1;a:1:{i:0;s:6:" Fstab";}i:2;i:2610;}i:375;a:3:{i:0;s:17:"listcontent_close";i:1;a:0:{}i:2;i:2616;}i:376;a:3:{i:0;s:14:"listitem_close";i:1;a:0:{}i:2;i:2616;}i:377;a:3:{i:0;s:11:"listu_close";i:1;a:0:{}i:2;i:2616;}i:378;a:3:{i:0;s:14:"listitem_close";i:1;a:0:{}i:2;i:2616;}i:379;a:3:{i:0;s:11:"listu_close";i:1;a:0:{}i:2;i:2616;}i:380;a:3:{i:0;s:10:"listu_open";i:1;a:0:{}i:2;i:2617;}i:381;a:3:{i:0;s:13:"listitem_open";i:1;a:1:{i:0;i:1;}i:2;i:2617;}i:382;a:3:{i:0;s:16:"listcontent_open";i:1;a:0:{}i:2;i:2617;}i:383;a:3:{i:0;s:5:"cdata";i:1;a:1:{i:0;s:44:" Aula 5: Sistemas de arquivos e Instalação";}i:2;i:2621;}i:384;a:3:{i:0;s:17:"listcontent_close";i:1;a:0:{}i:2;i:2665;}i:385;a:3:{i:0;s:10:"listu_open";i:1;a:0:{}i:2;i:2665;}i:386;a:3:{i:0;s:13:"listitem_open";i:1;a:1:{i:0;i:2;}i:2;i:2665;}i:387;a:3:{i:0;s:16:"listcontent_open";i:1;a:0:{}i:2;i:2665;}i:388;a:3:{i:0;s:5:"cdata";i:1;a:1:{i:0;s:22:" Tópico: Shell Script";}i:2;i:2671;}i:389;a:3:{i:0;s:17:"listcontent_close";i:1;a:0:{}i:2;i:2693;}i:390;a:3:{i:0;s:14:"listitem_close";i:1;a:0:{}i:2;i:2693;}i:391;a:3:{i:0;s:13:"listitem_open";i:1;a:1:{i:0;i:2;}i:2;i:2693;}i:392;a:3:{i:0;s:16:"listcontent_open";i:1;a:0:{}i:2;i:2693;}i:393;a:3:{i:0;s:5:"cdata";i:1;a:1:{i:0;s:21:" Sistemas de arquivos";}i:2;i:2699;}i:394;a:3:{i:0;s:17:"listcontent_close";i:1;a:0:{}i:2;i:2720;}i:395;a:3:{i:0;s:10:"listu_open";i:1;a:0:{}i:2;i:2720;}i:396;a:3:{i:0;s:13:"listitem_open";i:1;a:1:{i:0;i:3;}i:2;i:2720;}i:397;a:3:{i:0;s:16:"listcontent_open";i:1;a:0:{}i:2;i:2720;}i:398;a:3:{i:0;s:5:"cdata";i:1;a:1:{i:0;s:10:" Conceitos";}i:2;i:2728;}i:399;a:3:{i:0;s:17:"listcontent_close";i:1;a:0:{}i:2;i:2738;}i:400;a:3:{i:0;s:14:"listitem_close";i:1;a:0:{}i:2;i:2738;}i:401;a:3:{i:0;s:13:"listitem_open";i:1;a:1:{i:0;i:3;}i:2;i:2738;}i:402;a:3:{i:0;s:16:"listcontent_open";i:1;a:0:{}i:2;i:2738;}i:403;a:3:{i:0;s:5:"cdata";i:1;a:1:{i:0;s:4:" MBR";}i:2;i:2746;}i:404;a:3:{i:0;s:17:"listcontent_close";i:1;a:0:{}i:2;i:2750;}i:405;a:3:{i:0;s:14:"listitem_close";i:1;a:0:{}i:2;i:2750;}i:406;a:3:{i:0;s:13:"listitem_open";i:1;a:1:{i:0;i:3;}i:2;i:2750;}i:407;a:3:{i:0;s:16:"listcontent_open";i:1;a:0:{}i:2;i:2750;}i:408;a:3:{i:0;s:5:"cdata";i:1;a:1:{i:0;s:12:" Partições";}i:2;i:2758;}i:409;a:3:{i:0;s:17:"listcontent_close";i:1;a:0:{}i:2;i:2770;}i:410;a:3:{i:0;s:14:"listitem_close";i:1;a:0:{}i:2;i:2770;}i:411;a:3:{i:0;s:11:"listu_close";i:1;a:0:{}i:2;i:2770;}i:412;a:3:{i:0;s:14:"listitem_close";i:1;a:0:{}i:2;i:2770;}i:413;a:3:{i:0;s:13:"listitem_open";i:1;a:1:{i:0;i:2;}i:2;i:2770;}i:414;a:3:{i:0;s:16:"listcontent_open";i:1;a:0:{}i:2;i:2770;}i:415;a:3:{i:0;s:5:"cdata";i:1;a:1:{i:0;s:50:" Instalação do GNU/Linux Ubuntu 7.10 (com dicas)";}i:2;i:2776;}i:416;a:3:{i:0;s:17:"listcontent_close";i:1;a:0:{}i:2;i:2826;}i:417;a:3:{i:0;s:14:"listitem_close";i:1;a:0:{}i:2;i:2826;}i:418;a:3:{i:0;s:13:"listitem_open";i:1;a:1:{i:0;i:2;}i:2;i:2826;}i:419;a:3:{i:0;s:16:"listcontent_open";i:1;a:0:{}i:2;i:2826;}i:420;a:3:{i:0;s:5:"cdata";i:1;a:1:{i:0;s:48:" Apresentação das Referências Bibliográficas";}i:2;i:2832;}i:421;a:3:{i:0;s:17:"listcontent_close";i:1;a:0:{}i:2;i:2880;}i:422;a:3:{i:0;s:14:"listitem_close";i:1;a:0:{}i:2;i:2880;}i:423;a:3:{i:0;s:11:"listu_close";i:1;a:0:{}i:2;i:2880;}i:424;a:3:{i:0;s:14:"listitem_close";i:1;a:0:{}i:2;i:2880;}i:425;a:3:{i:0;s:11:"listu_close";i:1;a:0:{}i:2;i:2880;}i:426;a:3:{i:0;s:13:"section_close";i:1;a:0:{}i:2;i:2882;}i:427;a:3:{i:0;s:12:"section_edit";i:1;a:4:{i:0;i:260;i:1;i:2881;i:2;i:2;i:3;s:21:"Planejamento - 2007/2";}i:2;i:2882;}i:428;a:3:{i:0;s:6:"header";i:1;a:3:{i:0;s:12:"Referências";i:1;i:2;i:2;i:2882;}i:2;i:2882;}i:429;a:3:{i:0;s:12:"section_open";i:1;a:1:{i:0;i:2;}i:2;i:2882;}i:430;a:3:{i:0;s:6:"p_open";i:1;a:0:{}i:2;i:2906;}i:431;a:3:{i:0;s:5:"cdata";i:1;a:1:{i:0;s:139:"
A maioria foi extraída do site da Canonical. Se achares outra interessante no próprio site da Canonical ou Internet afora, poste-a aqui!";}i:2;i:2907;}i:432;a:3:{i:0;s:7:"p_close";i:1;a:0:{}i:2;i:3046;}i:433;a:3:{i:0;s:6:"p_open";i:1;a:0:{}i:2;i:3046;}i:434;a:3:{i:0;s:12:"externallink";i:1;a:2:{i:0;s:24:"https://help.ubuntu.com/";i:1;s:15:"help.ubuntu.com";}i:2;i:3048;}i:435;a:3:{i:0;s:5:"cdata";i:1;a:1:{i:0;s:49:" - Bastante material básico sobre o Ubuntu Linux";}i:2;i:3092;}i:436;a:3:{i:0;s:9:"linebreak";i:1;a:0:{}i:2;i:3141;}i:437;a:3:{i:0;s:5:"cdata";i:1;a:1:{i:0;s:1:" ";}i:2;i:3143;}i:438;a:3:{i:0;s:12:"externallink";i:1;a:2:{i:0;s:50:"https://help.ubuntu.com/community/CommandlineHowto";i:1;s:16:"CommandlineHowto";}i:2;i:3144;}i:439;a:3:{i:0;s:5:"cdata";i:1;a:1:{i:0;s:44:" - Material básico sobre a linha de comando";}i:2;i:3215;}i:440;a:3:{i:0;s:9:"linebreak";i:1;a:0:{}i:2;i:3259;}i:441;a:3:{i:0;s:5:"cdata";i:1;a:1:{i:0;s:1:" ";}i:2;i:3261;}i:442;a:3:{i:0;s:12:"externallink";i:1;a:2:{i:0;s:58:"https://help.ubuntu.com/community/AdvancedCommandlineHowto";i:1;s:24:"AdvancedCommandlineHowto";}i:2;i:3262;}i:443;a:3:{i:0;s:5:"cdata";i:1;a:1:{i:0;s:46:" - Material avançado sobre a linha de comando";}i:2;i:3349;}i:444;a:3:{i:0;s:9:"linebreak";i:1;a:0:{}i:2;i:3395;}i:445;a:3:{i:0;s:5:"cdata";i:1;a:1:{i:0;s:1:" ";}i:2;i:3397;}i:446;a:3:{i:0;s:12:"externallink";i:1;a:2:{i:0;s:61:"https://help.ubuntu.com/community/LinuxFilesystemTreeOverview";i:1;s:27:"LinuxFilesystemTreeOverview";}i:2;i:3398;}i:447;a:3:{i:0;s:5:"cdata";i:1;a:1:{i:0;s:59:" - Material sobre a árvore do sistema de arquivos do Linux";}i:2;i:3491;}i:448;a:3:{i:0;s:9:"linebreak";i:1;a:0:{}i:2;i:3550;}i:449;a:3:{i:0;s:5:"cdata";i:1;a:1:{i:0;s:1:" ";}i:2;i:3552;}i:450;a:3:{i:0;s:12:"externallink";i:1;a:2:{i:0;s:39:"https://help.ubuntu.com/community/Fstab";i:1;s:5:"Fstab";}i:2;i:3553;}i:451;a:3:{i:0;s:5:"cdata";i:1;a:1:{i:0;s:25:" - Material sobre o fstab";}i:2;i:3602;}i:452;a:3:{i:0;s:9:"linebreak";i:1;a:0:{}i:2;i:3627;}i:453;a:3:{i:0;s:5:"cdata";i:1;a:1:{i:0;s:1:" ";}i:2;i:3629;}i:454;a:3:{i:0;s:12:"externallink";i:1;a:2:{i:0;s:49:"https://help.ubuntu.com/community/FilePermissions";i:1;s:15:"FilePermissions";}i:2;i:3630;}i:455;a:3:{i:0;s:5:"cdata";i:1;a:1:{i:0;s:41:" - Material sobre permissões de arquivos";}i:2;i:3699;}i:456;a:3:{i:0;s:9:"linebreak";i:1;a:0:{}i:2;i:3740;}i:457;a:3:{i:0;s:5:"cdata";i:1;a:1:{i:0;s:1:" ";}i:2;i:3742;}i:458;a:3:{i:0;s:12:"externallink";i:1;a:2:{i:0;s:42:"https://help.ubuntu.com/community/VimHowto";i:1;s:8:"VimHowto";}i:2;i:3743;}i:459;a:3:{i:0;s:5:"cdata";i:1;a:1:{i:0;s:39:" - Material sobre o editor de texto Vim";}i:2;i:3798;}i:460;a:3:{i:0;s:9:"linebreak";i:1;a:0:{}i:2;i:3837;}i:461;a:3:{i:0;s:5:"cdata";i:1;a:1:{i:0;s:1:" ";}i:2;i:3839;}i:462;a:3:{i:0;s:12:"externallink";i:1;a:2:{i:0;s:47:"https://help.ubuntu.com/community/SynapticHowto";i:1;s:13:"SynapticHowto";}i:2;i:3840;}i:463;a:3:{i:0;s:5:"cdata";i:1;a:1:{i:0;s:67:" - Material sobre o gerenciador de pacotes gráfico do Ubuntu Linux";}i:2;i:3905;}i:464;a:3:{i:0;s:9:"linebreak";i:1;a:0:{}i:2;i:3972;}i:465;a:3:{i:0;s:5:"cdata";i:1;a:1:{i:0;s:1:" ";}i:2;i:3974;}i:466;a:3:{i:0;s:12:"externallink";i:1;a:2:{i:0;s:45:"http://www.tinycobol.org/sysadmin/indice.html";i:1;s:33:"Administração de Sistemas Linux";}i:2;i:3975;}i:467;a:3:{i:0;s:9:"linebreak";i:1;a:0:{}i:2;i:4058;}i:468;a:3:{i:0;s:5:"cdata";i:1;a:1:{i:0;s:1:" ";}i:2;i:4060;}i:469;a:3:{i:0;s:12:"externallink";i:1;a:2:{i:0;s:53:"https://help.ubuntu.com/community/SoftwareEquivalents";i:1;s:19:"SoftwareEquivalents";}i:2;i:4061;}i:470;a:3:{i:0;s:5:"cdata";i:1;a:1:{i:0;s:62:" - Lista de programas do Windows/Mac com equivalentes no Linux";}i:2;i:4138;}i:471;a:3:{i:0;s:9:"linebreak";i:1;a:0:{}i:2;i:4200;}i:472;a:3:{i:0;s:5:"cdata";i:1;a:1:{i:0;s:1:" ";}i:2;i:4202;}i:473;a:3:{i:0;s:12:"externallink";i:1;a:2:{i:0;s:81:"http://wiki.linuxquestions.org/wiki/Linux_software_equivalent_to_Windows_software";i:1;s:28:"Software Equivalents Windows";}i:2;i:4203;}i:474;a:3:{i:0;s:5:"cdata";i:1;a:1:{i:0;s:27:" - Lista da linux questions";}i:2;i:4317;}i:475;a:3:{i:0;s:9:"linebreak";i:1;a:0:{}i:2;i:4344;}i:476;a:3:{i:0;s:5:"cdata";i:1;a:1:{i:0;s:1:" ";}i:2;i:4346;}i:477;a:3:{i:0;s:12:"externallink";i:1;a:2:{i:0;s:47:"http://wiki.ubuntu-br.org/ProgramasEquivalentes";i:1;s:22:"Programas Equivalentes";}i:2;i:4347;}i:478;a:3:{i:0;s:5:"cdata";i:1;a:1:{i:0;s:26:" - Lista da Wiki-Ubuntu-BR";}i:2;i:4421;}i:479;a:3:{i:0;s:9:"linebreak";i:1;a:0:{}i:2;i:4447;}i:480;a:3:{i:0;s:5:"cdata";i:1;a:1:{i:0;s:1:" ";}i:2;i:4449;}i:481;a:3:{i:0;s:12:"externallink";i:1;a:2:{i:0;s:55:"https://help.ubuntu.com/community/CategoryDocumentation";i:1;s:23:"Category: Documentation";}i:2;i:4450;}i:482;a:3:{i:0;s:5:"cdata";i:1;a:1:{i:0;s:55:" - Índice dos tutoriais disponíveis no Wiki do Ubuntu";}i:2;i:4533;}i:483;a:3:{i:0;s:9:"linebreak";i:1;a:0:{}i:2;i:4588;}i:484;a:3:{i:0;s:5:"cdata";i:1;a:1:{i:0;s:1:" ";}i:2;i:4590;}i:485;a:3:{i:0;s:12:"externallink";i:1;a:2:{i:0;s:24:"http://www.guiafoca.org/";i:1;s:19:"Guia Foca GNU/Linux";}i:2;i:4591;}i:486;a:3:{i:0;s:5:"cdata";i:1;a:1:{i:0;s:48:" - Excelente tutorial brasileiro sobre GNU/Linux";}i:2;i:4639;}i:487;a:3:{i:0;s:9:"linebreak";i:1;a:0:{}i:2;i:4687;}i:488;a:3:{i:0;s:5:"cdata";i:1;a:1:{i:0;s:1:" ";}i:2;i:4689;}i:489;a:3:{i:0;s:12:"externallink";i:1;a:2:{i:0;s:35:"http://www.devin.com.br/eitch/tlm4/";i:1;s:12:"Linux Manual";}i:2;i:4690;}i:490;a:3:{i:0;s:5:"cdata";i:1;a:1:{i:0;s:54:" - Outro excelente tutorial brasileiro sobre GNU/Linux";}i:2;i:4742;}i:491;a:3:{i:0;s:9:"linebreak";i:1;a:0:{}i:2;i:4796;}i:492;a:3:{i:0;s:5:"cdata";i:1;a:1:{i:0;s:1:" ";}i:2;i:4798;}i:493;a:3:{i:0;s:12:"externallink";i:1;a:2:{i:0;s:24:"http://linuxcommand.org/";i:1;s:12:"LinuxCommand";}i:2;i:4799;}i:494;a:3:{i:0;s:5:"cdata";i:1;a:1:{i:0;s:41:" - Ótimo tutorial sobre linha de comando";}i:2;i:4840;}i:495;a:3:{i:0;s:9:"linebreak";i:1;a:0:{}i:2;i:4881;}i:496;a:3:{i:0;s:5:"cdata";i:1;a:1:{i:0;s:1:" ";}i:2;i:4883;}i:497;a:3:{i:0;s:12:"externallink";i:1;a:2:{i:0;s:60:"http://fosswire.com/wp-content/uploads/2007/08/fwunixref.pdf";i:1;s:23:"Quadro de comandos(pdf)";}i:2;i:4884;}i:498;a:3:{i:0;s:5:"cdata";i:1;a:1:{i:0;s:37:" - Literalmente um Quadro de comandos";}i:2;i:4972;}i:499;a:3:{i:0;s:9:"linebreak";i:1;a:0:{}i:2;i:5009;}i:500;a:3:{i:0;s:5:"cdata";i:1;a:1:{i:0;s:1:" ";}i:2;i:5011;}i:501;a:3:{i:0;s:12:"externallink";i:1;a:2:{i:0;s:23:"http://dge.wikidot.com/";i:1;s:14:"Wiki GNU/Linux";}i:2;i:5012;}i:502;a:3:{i:0;s:5:"cdata";i:1;a:1:{i:0;s:75:" - Wiki de Migração do Governo Federal (tem algumas coisas interessantes)";}i:2;i:5054;}i:503;a:3:{i:0;s:9:"linebreak";i:1;a:0:{}i:2;i:5129;}i:504;a:3:{i:0;s:7:"p_close";i:1;a:0:{}i:2;i:5131;}i:505;a:3:{i:0;s:13:"section_close";i:1;a:0:{}i:2;i:5132;}i:506;a:3:{i:0;s:12:"section_edit";i:1;a:4:{i:0;i:2882;i:1;i:0;i:2;i:2;i:3;s:12:"Referências";}i:2;i:5132;}i:507;a:3:{i:0;s:12:"document_end";i:1;a:0:{}i:2;i:5132;}}