a:5:{i:0;a:3:{i:0;s:14:"document_start";i:1;a:0:{}i:2;i:0;}i:1;a:3:{i:0;s:6:"p_open";i:1;a:0:{}i:2;i:0;}i:2;a:3:{i:0;s:5:"cdata";i:1;a:1:{i:0;s:377:"0104.txt
0112.txt
0118.txt
0126.txt
0302.txt
0308.txt
0315.txt
0322.txt
0330.txt
0405.txt
0412.txt
0419.txt
0426.txt
0503.txt
0510.txt
0517.txt
0524.txt
0607.txt
0614.txt
0621.txt
0627.txt
0706.txt
0711.txt
0726.txt
0808.txt
0815.txt
0822.txt
0829.txt
0905.txt
0910.txt
0919.txt
0926.txt
1003.txt
1010.txt
1017.txt
1024.txt
1031.txt
1107.txt
1121.txt
1128.txt
1212.txt
1219.txt";}i:2;i:1;}i:3;a:3:{i:0;s:7:"p_close";i:1;a:0:{}i:2;i:378;}i:4;a:3:{i:0;s:12:"document_end";i:1;a:0:{}i:2;i:378;}}