<?xml version="1.0" encoding="UTF-8" standalone="no"?>
<!-- Created with Inkscape (http://www.inkscape.org/) -->
<svg
   xmlns:dc="http://purl.org/dc/elements/1.1/"
   xmlns:cc="http://creativecommons.org/ns#"
   xmlns:rdf="http://www.w3.org/1999/02/22-rdf-syntax-ns#"
   xmlns:svg="http://www.w3.org/2000/svg"
   xmlns="http://www.w3.org/2000/svg"
   xmlns:sodipodi="http://sodipodi.sourceforge.net/DTD/sodipodi-0.dtd"
   xmlns:inkscape="http://www.inkscape.org/namespaces/inkscape"
   width="100"
   height="100"
   id="svg2"
   sodipodi:version="0.32"
   inkscape:version="0.46"
   version="1.0"
   sodipodi:docname="brok.svg"
   inkscape:output_extension="org.inkscape.output.svg.inkscape">
  <defs
     id="defs4">
    <inkscape:perspective
       sodipodi:type="inkscape:persp3d"
       inkscape:vp_x="0 : 526.18109 : 1"
       inkscape:vp_y="0 : 1000 : 0"
       inkscape:vp_z="744.09448 : 526.18109 : 1"
       inkscape:persp3d-origin="372.04724 : 350.78739 : 1"
       id="perspective10" />
    <inkscape:perspective
       id="perspective2410"
       inkscape:persp3d-origin="372.04724 : 350.78739 : 1"
       inkscape:vp_z="744.09448 : 526.18109 : 1"
       inkscape:vp_y="0 : 1000 : 0"
       inkscape:vp_x="0 : 526.18109 : 1"
       sodipodi:type="inkscape:persp3d" />
  </defs>
  <sodipodi:namedview
     id="base"
     pagecolor="#ffffff"
     bordercolor="#666666"
     borderopacity="1.0"
     gridtolerance="10000"
     guidetolerance="10"
     objecttolerance="10"
     inkscape:pageopacity="0.0"
     inkscape:pageshadow="2"
     inkscape:zoom="7.72"
     inkscape:cx="49.807031"
     inkscape:cy="55.596797"
     inkscape:document-units="px"
     inkscape:current-layer="layer1"
     showgrid="false"
     inkscape:window-width="1272"
     inkscape:window-height="976"
     inkscape:window-x="0"
     inkscape:window-y="0" />
  <metadata
     id="metadata7">
    <rdf:RDF>
      <cc:Work
         rdf:about="">
        <dc:format>image/svg+xml</dc:format>
        <dc:type
           rdf:resource="http://purl.org/dc/dcmitype/StillImage" />
      </cc:Work>
    </rdf:RDF>
  </metadata>
  <g
     inkscape:label="Layer 1"
     inkscape:groupmode="layer"
     id="layer1">
    <rect
       style="opacity:1;fill:#220000;fill-opacity:1;fill-rule:nonzero;stroke:none;stroke-width:0.49323478;stroke-linecap:butt;stroke-linejoin:round;marker:none;marker-start:none;marker-mid:none;marker-end:none;stroke-miterlimit:4;stroke-dasharray:none;stroke-dashoffset:0;stroke-opacity:1;visibility:visible;display:inline;overflow:visible"
       id="rect1393"
       width="100"
       height="100"
       x="0"
       y="1.5991982e-15" />
    <rect
       style="opacity:1;fill:#945a2c;fill-opacity:1;fill-rule:nonzero;stroke:none;stroke-width:0.41852632;stroke-linecap:butt;stroke-linejoin:round;marker:none;marker-start:none;marker-mid:none;marker-end:none;stroke-miterlimit:4;stroke-dasharray:none;stroke-dashoffset:0;stroke-opacity:1;visibility:visible;display:inline;overflow:visible"
       id="rect1395"
       width="86.683205"
       height="83.062149"
       x="6.3062878"
       y="8.1143131" />
    <g
       id="g3234"
       transform="matrix(0.7962103,-0.60502,0.60502,0.7962103,-15.191547,39.795485)">
      <path
         sodipodi:nodetypes="cczcccccc"
         id="path3209"
         d="M 0.90673575,44.04145 C 0.90673575,44.04145 0.68349545,54.009633 0.64766835,57.253886 C 5.6636548,56.353062 21.597685,50.774832 29.92228,49.352331 C 38.246875,47.92983 55.829016,47.409326 55.829016,47.409326 C 57.809207,47.477706 60.344099,46.101382 60.362694,43.393782 L 34.715026,43.393782 L 28.497409,43.005181 C 28.497409,43.005181 21.637261,46.700638 18.911918,42.746113 C 15.462239,42.457863 0.90673575,44.04145 0.90673575,44.04145 z"
         style="fill:#7b3800;fill-opacity:1;fill-rule:evenodd;stroke:#000000;stroke-width:1px;stroke-linecap:butt;stroke-linejoin:miter;stroke-opacity:1" />
      <path
         sodipodi:nodetypes="cccc"
         id="path3217"
         d="M 30.343264,42.487046 L 28.238342,39.637305 L 28.173576,42.51943 L 30.343264,42.487046 z"
         style="fill:#927775;fill-opacity:1;fill-rule:evenodd;stroke:#927775;stroke-width:1px;stroke-linecap:butt;stroke-linejoin:miter;stroke-opacity:1" />
      <g
         style="stroke:#968786;stroke-opacity:1"
         id="g3225">
        <path
           style="fill:none;fill-rule:evenodd;stroke:#968786;stroke-width:1px;stroke-linecap:butt;stroke-linejoin:miter;stroke-opacity:1"
           d="M 26.424871,50.129534 C 26.424871,50.129534 26.429003,53.634488 30.246114,53.626943 C 34.062548,53.6194 34.261659,48.834196 34.261659,48.834196 C 31.822108,49.136442 29.188256,49.373921 26.424871,50.129534 z"
           id="path3219"
           sodipodi:nodetypes="czcc" />
        <path
           style="fill:none;fill-rule:evenodd;stroke:#968786;stroke-width:1px;stroke-linecap:butt;stroke-linejoin:miter;stroke-opacity:1"
           d="M 29.727979,49.611399 C 29.792746,50.431779 29.792746,51.316926 30.699482,51.878238"
           id="path3221"
           sodipodi:nodetypes="cz" />
      </g>
      <g
         style="fill:#927775;fill-opacity:1"
         id="g3229">
        <rect
           style="fill:#927775;fill-opacity:1;stroke:#000000;stroke-width:0.90528494;stroke-opacity:1"
           id="rect2434"
           width="63.436684"
           height="3.0739896"
           x="32.854202"
           y="39.719482" />
        <path
           style="fill:#927775;fill-opacity:1;stroke:#000000;stroke-width:0.84752023;stroke-opacity:1"
           d="M 33.042563,42.822354 C 31.778601,42.822354 30.752777,42.120842 30.752777,41.256477 C 30.752777,40.392114 31.778601,39.6906 33.042563,39.6906 L 33.042563,42.822354 z"
           id="path3206"
           sodipodi:nodetypes="cscc" />
        <path
           style="fill:#927775;fill-opacity:1;fill-rule:evenodd;stroke:#000000;stroke-width:1px;stroke-linecap:butt;stroke-linejoin:miter;stroke-opacity:1"
           d="M 94.88342,38.018135 L 94.88342,39.443005"
           id="path3223"
           sodipodi:nodetypes="cc" />
      </g>
    </g>
  </g>
</svg>
