<?xml version="1.0" encoding="UTF-8" standalone="no"?>
<!-- Created with Inkscape (http://www.inkscape.org/) -->
<svg
   xmlns:dc="http://purl.org/dc/elements/1.1/"
   xmlns:cc="http://web.resource.org/cc/"
   xmlns:rdf="http://www.w3.org/1999/02/22-rdf-syntax-ns#"
   xmlns:svg="http://www.w3.org/2000/svg"
   xmlns="http://www.w3.org/2000/svg"
   xmlns:xlink="http://www.w3.org/1999/xlink"
   xmlns:sodipodi="http://sodipodi.sourceforge.net/DTD/sodipodi-0.dtd"
   xmlns:inkscape="http://www.inkscape.org/namespaces/inkscape"
   width="160"
   height="150"
   id="svg9276"
   sodipodi:version="0.32"
   inkscape:version="0.45.1"
   version="1.0"
   sodipodi:docbase="/home/glubo/src/lilanci/Lilanci/lilanci/graphics"
   sodipodi:docname="bg.svg"
   inkscape:output_extension="org.inkscape.output.svg.inkscape">
  <defs
     id="defs9278">
    <linearGradient
       id="linearGradient13671">
      <stop
         style="stop-color:#00a600;stop-opacity:1;"
         offset="0"
         id="stop13673" />
      <stop
         id="stop13697"
         offset="0.17777778"
         style="stop-color:#008b00;stop-opacity:1;" />
      <stop
         id="stop13689"
         offset="0.50839508"
         style="stop-color:#00a900;stop-opacity:1;" />
      <stop
         style="stop-color:#008100;stop-opacity:1;"
         offset="1"
         id="stop13691" />
    </linearGradient>
    <linearGradient
       inkscape:collect="always"
       xlink:href="#linearGradient13671"
       id="linearGradient13687"
       x1="-0.15000001"
       y1="75.178574"
       x2="201.93571"
       y2="75.178574"
       gradientUnits="userSpaceOnUse"
       spreadMethod="repeat"
       gradientTransform="matrix(0.7918103,0,0,1.0002125,-1.6510227e-2,-1.5978863e-2)" />
  </defs>
  <sodipodi:namedview
     id="base"
     pagecolor="#ffffff"
     bordercolor="#666666"
     borderopacity="1.0"
     inkscape:pageopacity="0.0"
     inkscape:pageshadow="2"
     inkscape:zoom="2.8"
     inkscape:cx="96.431835"
     inkscape:cy="70.166318"
     inkscape:document-units="px"
     inkscape:current-layer="layer1"
     inkscape:window-width="1272"
     inkscape:window-height="970"
     inkscape:window-x="0"
     inkscape:window-y="30"
     width="160px"
     height="150px" />
  <metadata
     id="metadata9281">
    <rdf:RDF>
      <cc:Work
         rdf:about="">
        <dc:format>image/svg+xml</dc:format>
        <dc:type
           rdf:resource="http://purl.org/dc/dcmitype/StillImage" />
      </cc:Work>
    </rdf:RDF>
  </metadata>
  <g
     inkscape:label="Layer 1"
     inkscape:groupmode="layer"
     id="layer1">
    <rect
       style="fill:url(#linearGradient13687);fill-opacity:1;stroke:#000000;stroke-width:0.26697955;stroke-linejoin:round;stroke-miterlimit:4;stroke-dasharray:none;stroke-opacity:1"
       id="rect9284"
       width="159.77602"
       height="155.39017"
       x="-0.016510228"
       y="-2.5165105" />
    <g
       id="g3149"
       transform="matrix(1.2876881,0,0,1.1879811,64.578387,-27.678568)">
      <path
         sodipodi:nodetypes="czzzzzzzzzz"
         id="path2172"
         d="M -29.047612,49.663549 C -31.39551,50.99783 -29.975504,48.468071 -31.005165,48.369967 C -32.034826,48.271863 -31.782145,51.030974 -33.166256,49.271132 C -34.569871,47.48649 -32.331279,48.00723 -32.557411,46.984331 C -32.783543,45.961432 -34.833688,47.356789 -34.070784,45.179535 C -33.320432,43.038105 -32.626848,45.593878 -31.736944,45.059796 C -30.84704,44.525713 -32.978256,43.034537 -30.51117,43.043205 C -28.083925,43.051874 -30.453745,44.563186 -29.677622,45.256004 C -28.901499,45.948822 -27.63927,43.364606 -27.406678,45.814478 C -27.166812,48.340976 -28.815124,46.339534 -29.225358,47.301802 C -29.635591,48.26407 -26.730088,48.346528 -29.047612,49.663549 z "
         style="color:#000000;fill:#ed1528;fill-opacity:1;fill-rule:nonzero;stroke:#090909;stroke-width:0.59144282;stroke-linecap:butt;stroke-linejoin:round;marker:none;marker-start:none;marker-mid:none;marker-end:none;stroke-miterlimit:4;stroke-dashoffset:0;stroke-opacity:1;visibility:visible;display:inline;overflow:visible" />
      <path
         transform="matrix(0.1115575,0,0,0.1130746,-24.067367,44.655958)"
         d="M -52.499999 17.5 A 6.7857141 6.4285712 0 1 1  -66.071427,17.5 A 6.7857141 6.4285712 0 1 1  -52.499999 17.5 z"
         sodipodi:ry="6.4285712"
         sodipodi:rx="6.7857141"
         sodipodi:cy="17.5"
         sodipodi:cx="-59.285713"
         id="path2175"
         style="opacity:1;color:#000000;fill:#e8e518;fill-opacity:1;fill-rule:nonzero;stroke:#050909;stroke-width:1.86600006;stroke-linecap:butt;stroke-linejoin:round;marker:none;marker-start:none;marker-mid:none;marker-end:none;stroke-miterlimit:4;stroke-dasharray:none;stroke-dashoffset:0;stroke-opacity:1;visibility:visible;display:inline;overflow:visible"
         sodipodi:type="arc" />
    </g>
    <g
       transform="translate(83.214285,-11.785714)"
       id="g3153">
      <path
         style="color:#000000;fill:#ed1528;fill-opacity:1;fill-rule:nonzero;stroke:#090909;stroke-width:0.59144282;stroke-linecap:butt;stroke-linejoin:round;marker:none;marker-start:none;marker-mid:none;marker-end:none;stroke-miterlimit:4;stroke-dashoffset:0;stroke-opacity:1;visibility:visible;display:inline;overflow:visible"
         d="M -29.047612,49.663549 C -31.39551,50.99783 -29.975504,48.468071 -31.005165,48.369967 C -32.034826,48.271863 -31.782145,51.030974 -33.166256,49.271132 C -34.569871,47.48649 -32.331279,48.00723 -32.557411,46.984331 C -32.783543,45.961432 -34.833688,47.356789 -34.070784,45.179535 C -33.320432,43.038105 -32.626848,45.593878 -31.736944,45.059796 C -30.84704,44.525713 -32.978256,43.034537 -30.51117,43.043205 C -28.083925,43.051874 -30.453745,44.563186 -29.677622,45.256004 C -28.901499,45.948822 -27.63927,43.364606 -27.406678,45.814478 C -27.166812,48.340976 -28.815124,46.339534 -29.225358,47.301802 C -29.635591,48.26407 -26.730088,48.346528 -29.047612,49.663549 z "
         id="path3155"
         sodipodi:nodetypes="czzzzzzzzzz" />
      <path
         sodipodi:type="arc"
         style="opacity:1;color:#000000;fill:#e8e518;fill-opacity:1;fill-rule:nonzero;stroke:#050909;stroke-width:1.86600006;stroke-linecap:butt;stroke-linejoin:round;marker:none;marker-start:none;marker-mid:none;marker-end:none;stroke-miterlimit:4;stroke-dasharray:none;stroke-dashoffset:0;stroke-opacity:1;visibility:visible;display:inline;overflow:visible"
         id="path3157"
         sodipodi:cx="-59.285713"
         sodipodi:cy="17.5"
         sodipodi:rx="6.7857141"
         sodipodi:ry="6.4285712"
         d="M -52.499999 17.5 A 6.7857141 6.4285712 0 1 1  -66.071427,17.5 A 6.7857141 6.4285712 0 1 1  -52.499999 17.5 z"
         transform="matrix(0.1115575,0,0,0.1130746,-24.067367,44.655958)" />
    </g>
    <g
       id="g3159"
       transform="matrix(0.8849914,0.4656073,-0.4656073,0.8849914,79.200567,51.127962)">
      <path
         sodipodi:nodetypes="czzzzzzzzzz"
         id="path3161"
         d="M -29.047612,49.663549 C -31.39551,50.99783 -29.975504,48.468071 -31.005165,48.369967 C -32.034826,48.271863 -31.782145,51.030974 -33.166256,49.271132 C -34.569871,47.48649 -32.331279,48.00723 -32.557411,46.984331 C -32.783543,45.961432 -34.833688,47.356789 -34.070784,45.179535 C -33.320432,43.038105 -32.626848,45.593878 -31.736944,45.059796 C -30.84704,44.525713 -32.978256,43.034537 -30.51117,43.043205 C -28.083925,43.051874 -30.453745,44.563186 -29.677622,45.256004 C -28.901499,45.948822 -27.63927,43.364606 -27.406678,45.814478 C -27.166812,48.340976 -28.815124,46.339534 -29.225358,47.301802 C -29.635591,48.26407 -26.730088,48.346528 -29.047612,49.663549 z "
         style="color:#000000;fill:#ed1528;fill-opacity:1;fill-rule:nonzero;stroke:#090909;stroke-width:0.59144282;stroke-linecap:butt;stroke-linejoin:round;marker:none;marker-start:none;marker-mid:none;marker-end:none;stroke-miterlimit:4;stroke-dashoffset:0;stroke-opacity:1;visibility:visible;display:inline;overflow:visible" />
      <path
         transform="matrix(0.1115575,0,0,0.1130746,-24.067367,44.655958)"
         d="M -52.499999 17.5 A 6.7857141 6.4285712 0 1 1  -66.071427,17.5 A 6.7857141 6.4285712 0 1 1  -52.499999 17.5 z"
         sodipodi:ry="6.4285712"
         sodipodi:rx="6.7857141"
         sodipodi:cy="17.5"
         sodipodi:cx="-59.285713"
         id="path3163"
         style="opacity:1;color:#000000;fill:#e8e518;fill-opacity:1;fill-rule:nonzero;stroke:#050909;stroke-width:1.86600006;stroke-linecap:butt;stroke-linejoin:round;marker:none;marker-start:none;marker-mid:none;marker-end:none;stroke-miterlimit:4;stroke-dasharray:none;stroke-dashoffset:0;stroke-opacity:1;visibility:visible;display:inline;overflow:visible"
         sodipodi:type="arc" />
    </g>
    <g
       transform="matrix(1.1321214,0.3723834,-0.3418247,1.0392166,163.19614,26.791124)"
       id="g3165">
      <path
         style="color:#000000;fill:#ed1528;fill-opacity:1;fill-rule:nonzero;stroke:#090909;stroke-width:0.59144282;stroke-linecap:butt;stroke-linejoin:round;marker:none;marker-start:none;marker-mid:none;marker-end:none;stroke-miterlimit:4;stroke-dashoffset:0;stroke-opacity:1;visibility:visible;display:inline;overflow:visible"
         d="M -29.047612,49.663549 C -31.39551,50.99783 -29.975504,48.468071 -31.005165,48.369967 C -32.034826,48.271863 -31.782145,51.030974 -33.166256,49.271132 C -34.569871,47.48649 -32.331279,48.00723 -32.557411,46.984331 C -32.783543,45.961432 -34.833688,47.356789 -34.070784,45.179535 C -33.320432,43.038105 -32.626848,45.593878 -31.736944,45.059796 C -30.84704,44.525713 -32.978256,43.034537 -30.51117,43.043205 C -28.083925,43.051874 -30.453745,44.563186 -29.677622,45.256004 C -28.901499,45.948822 -27.63927,43.364606 -27.406678,45.814478 C -27.166812,48.340976 -28.815124,46.339534 -29.225358,47.301802 C -29.635591,48.26407 -26.730088,48.346528 -29.047612,49.663549 z "
         id="path3167"
         sodipodi:nodetypes="czzzzzzzzzz" />
      <path
         sodipodi:type="arc"
         style="opacity:1;color:#000000;fill:#e8e518;fill-opacity:1;fill-rule:nonzero;stroke:#050909;stroke-width:1.86600006;stroke-linecap:butt;stroke-linejoin:round;marker:none;marker-start:none;marker-mid:none;marker-end:none;stroke-miterlimit:4;stroke-dasharray:none;stroke-dashoffset:0;stroke-opacity:1;visibility:visible;display:inline;overflow:visible"
         id="path3169"
         sodipodi:cx="-59.285713"
         sodipodi:cy="17.5"
         sodipodi:rx="6.7857141"
         sodipodi:ry="6.4285712"
         d="M -52.499999 17.5 A 6.7857141 6.4285712 0 1 1  -66.071427,17.5 A 6.7857141 6.4285712 0 1 1  -52.499999 17.5 z"
         transform="matrix(0.1115575,0,0,0.1130746,-24.067367,44.655958)" />
    </g>
    <g
       id="g3171"
       transform="translate(172.85714,-28.214285)">
      <path
         sodipodi:nodetypes="czzzzzzzzzz"
         id="path3173"
         d="M -29.047612,49.663549 C -31.39551,50.99783 -29.975504,48.468071 -31.005165,48.369967 C -32.034826,48.271863 -31.782145,51.030974 -33.166256,49.271132 C -34.569871,47.48649 -32.331279,48.00723 -32.557411,46.984331 C -32.783543,45.961432 -34.833688,47.356789 -34.070784,45.179535 C -33.320432,43.038105 -32.626848,45.593878 -31.736944,45.059796 C -30.84704,44.525713 -32.978256,43.034537 -30.51117,43.043205 C -28.083925,43.051874 -30.453745,44.563186 -29.677622,45.256004 C -28.901499,45.948822 -27.63927,43.364606 -27.406678,45.814478 C -27.166812,48.340976 -28.815124,46.339534 -29.225358,47.301802 C -29.635591,48.26407 -26.730088,48.346528 -29.047612,49.663549 z "
         style="color:#000000;fill:#ed1528;fill-opacity:1;fill-rule:nonzero;stroke:#090909;stroke-width:0.59144282;stroke-linecap:butt;stroke-linejoin:round;marker:none;marker-start:none;marker-mid:none;marker-end:none;stroke-miterlimit:4;stroke-dashoffset:0;stroke-opacity:1;visibility:visible;display:inline;overflow:visible" />
      <path
         transform="matrix(0.1115575,0,0,0.1130746,-24.067367,44.655958)"
         d="M -52.499999 17.5 A 6.7857141 6.4285712 0 1 1  -66.071427,17.5 A 6.7857141 6.4285712 0 1 1  -52.499999 17.5 z"
         sodipodi:ry="6.4285712"
         sodipodi:rx="6.7857141"
         sodipodi:cy="17.5"
         sodipodi:cx="-59.285713"
         id="path3175"
         style="opacity:1;color:#000000;fill:#e8e518;fill-opacity:1;fill-rule:nonzero;stroke:#050909;stroke-width:1.86600006;stroke-linecap:butt;stroke-linejoin:round;marker:none;marker-start:none;marker-mid:none;marker-end:none;stroke-miterlimit:4;stroke-dasharray:none;stroke-dashoffset:0;stroke-opacity:1;visibility:visible;display:inline;overflow:visible"
         sodipodi:type="arc" />
    </g>
    <g
       transform="translate(170,57.857144)"
       id="g3177">
      <path
         style="color:#000000;fill:#ed1528;fill-opacity:1;fill-rule:nonzero;stroke:#090909;stroke-width:0.59144282;stroke-linecap:butt;stroke-linejoin:round;marker:none;marker-start:none;marker-mid:none;marker-end:none;stroke-miterlimit:4;stroke-dashoffset:0;stroke-opacity:1;visibility:visible;display:inline;overflow:visible"
         d="M -29.047612,49.663549 C -31.39551,50.99783 -29.975504,48.468071 -31.005165,48.369967 C -32.034826,48.271863 -31.782145,51.030974 -33.166256,49.271132 C -34.569871,47.48649 -32.331279,48.00723 -32.557411,46.984331 C -32.783543,45.961432 -34.833688,47.356789 -34.070784,45.179535 C -33.320432,43.038105 -32.626848,45.593878 -31.736944,45.059796 C -30.84704,44.525713 -32.978256,43.034537 -30.51117,43.043205 C -28.083925,43.051874 -30.453745,44.563186 -29.677622,45.256004 C -28.901499,45.948822 -27.63927,43.364606 -27.406678,45.814478 C -27.166812,48.340976 -28.815124,46.339534 -29.225358,47.301802 C -29.635591,48.26407 -26.730088,48.346528 -29.047612,49.663549 z "
         id="path3179"
         sodipodi:nodetypes="czzzzzzzzzz" />
      <path
         sodipodi:type="arc"
         style="opacity:1;color:#000000;fill:#e8e518;fill-opacity:1;fill-rule:nonzero;stroke:#050909;stroke-width:1.86600006;stroke-linecap:butt;stroke-linejoin:round;marker:none;marker-start:none;marker-mid:none;marker-end:none;stroke-miterlimit:4;stroke-dasharray:none;stroke-dashoffset:0;stroke-opacity:1;visibility:visible;display:inline;overflow:visible"
         id="path3181"
         sodipodi:cx="-59.285713"
         sodipodi:cy="17.5"
         sodipodi:rx="6.7857141"
         sodipodi:ry="6.4285712"
         d="M -52.499999 17.5 A 6.7857141 6.4285712 0 1 1  -66.071427,17.5 A 6.7857141 6.4285712 0 1 1  -52.499999 17.5 z"
         transform="matrix(0.1115575,0,0,0.1130746,-24.067367,44.655958)" />
    </g>
    <g
       id="g3183"
       transform="translate(172.5,17.500001)">
      <path
         sodipodi:nodetypes="czzzzzzzzzz"
         id="path3185"
         d="M -29.047612,49.663549 C -31.39551,50.99783 -29.975504,48.468071 -31.005165,48.369967 C -32.034826,48.271863 -31.782145,51.030974 -33.166256,49.271132 C -34.569871,47.48649 -32.331279,48.00723 -32.557411,46.984331 C -32.783543,45.961432 -34.833688,47.356789 -34.070784,45.179535 C -33.320432,43.038105 -32.626848,45.593878 -31.736944,45.059796 C -30.84704,44.525713 -32.978256,43.034537 -30.51117,43.043205 C -28.083925,43.051874 -30.453745,44.563186 -29.677622,45.256004 C -28.901499,45.948822 -27.63927,43.364606 -27.406678,45.814478 C -27.166812,48.340976 -28.815124,46.339534 -29.225358,47.301802 C -29.635591,48.26407 -26.730088,48.346528 -29.047612,49.663549 z "
         style="color:#000000;fill:#ed1528;fill-opacity:1;fill-rule:nonzero;stroke:#090909;stroke-width:0.59144282;stroke-linecap:butt;stroke-linejoin:round;marker:none;marker-start:none;marker-mid:none;marker-end:none;stroke-miterlimit:4;stroke-dashoffset:0;stroke-opacity:1;visibility:visible;display:inline;overflow:visible" />
      <path
         transform="matrix(0.1115575,0,0,0.1130746,-24.067367,44.655958)"
         d="M -52.499999 17.5 A 6.7857141 6.4285712 0 1 1  -66.071427,17.5 A 6.7857141 6.4285712 0 1 1  -52.499999 17.5 z"
         sodipodi:ry="6.4285712"
         sodipodi:rx="6.7857141"
         sodipodi:cy="17.5"
         sodipodi:cx="-59.285713"
         id="path3187"
         style="opacity:1;color:#000000;fill:#e8e518;fill-opacity:1;fill-rule:nonzero;stroke:#050909;stroke-width:1.86600006;stroke-linecap:butt;stroke-linejoin:round;marker:none;marker-start:none;marker-mid:none;marker-end:none;stroke-miterlimit:4;stroke-dasharray:none;stroke-dashoffset:0;stroke-opacity:1;visibility:visible;display:inline;overflow:visible"
         sodipodi:type="arc" />
    </g>
    <g
       transform="matrix(0.76026,0,0,0.7180284,59.577535,93.482139)"
       id="g3189">
      <path
         style="color:#000000;fill:#ed1528;fill-opacity:1;fill-rule:nonzero;stroke:#090909;stroke-width:0.59144282;stroke-linecap:butt;stroke-linejoin:round;marker:none;marker-start:none;marker-mid:none;marker-end:none;stroke-miterlimit:4;stroke-dashoffset:0;stroke-opacity:1;visibility:visible;display:inline;overflow:visible"
         d="M -29.047612,49.663549 C -31.39551,50.99783 -29.975504,48.468071 -31.005165,48.369967 C -32.034826,48.271863 -31.782145,51.030974 -33.166256,49.271132 C -34.569871,47.48649 -32.331279,48.00723 -32.557411,46.984331 C -32.783543,45.961432 -34.833688,47.356789 -34.070784,45.179535 C -33.320432,43.038105 -32.626848,45.593878 -31.736944,45.059796 C -30.84704,44.525713 -32.978256,43.034537 -30.51117,43.043205 C -28.083925,43.051874 -30.453745,44.563186 -29.677622,45.256004 C -28.901499,45.948822 -27.63927,43.364606 -27.406678,45.814478 C -27.166812,48.340976 -28.815124,46.339534 -29.225358,47.301802 C -29.635591,48.26407 -26.730088,48.346528 -29.047612,49.663549 z "
         id="path3191"
         sodipodi:nodetypes="czzzzzzzzzz" />
      <path
         sodipodi:type="arc"
         style="opacity:1;color:#000000;fill:#e8e518;fill-opacity:1;fill-rule:nonzero;stroke:#050909;stroke-width:1.86600006;stroke-linecap:butt;stroke-linejoin:round;marker:none;marker-start:none;marker-mid:none;marker-end:none;stroke-miterlimit:4;stroke-dasharray:none;stroke-dashoffset:0;stroke-opacity:1;visibility:visible;display:inline;overflow:visible"
         id="path3193"
         sodipodi:cx="-59.285713"
         sodipodi:cy="17.5"
         sodipodi:rx="6.7857141"
         sodipodi:ry="6.4285712"
         d="M -52.499999 17.5 A 6.7857141 6.4285712 0 1 1  -66.071427,17.5 A 6.7857141 6.4285712 0 1 1  -52.499999 17.5 z"
         transform="matrix(0.1115575,0,0,0.1130746,-24.067367,44.655958)" />
    </g>
    <g
       id="g3195"
       transform="translate(109.28571,29.642858)">
      <path
         sodipodi:nodetypes="czzzzzzzzzz"
         id="path3197"
         d="M -29.047612,49.663549 C -31.39551,50.99783 -29.975504,48.468071 -31.005165,48.369967 C -32.034826,48.271863 -31.782145,51.030974 -33.166256,49.271132 C -34.569871,47.48649 -32.331279,48.00723 -32.557411,46.984331 C -32.783543,45.961432 -34.833688,47.356789 -34.070784,45.179535 C -33.320432,43.038105 -32.626848,45.593878 -31.736944,45.059796 C -30.84704,44.525713 -32.978256,43.034537 -30.51117,43.043205 C -28.083925,43.051874 -30.453745,44.563186 -29.677622,45.256004 C -28.901499,45.948822 -27.63927,43.364606 -27.406678,45.814478 C -27.166812,48.340976 -28.815124,46.339534 -29.225358,47.301802 C -29.635591,48.26407 -26.730088,48.346528 -29.047612,49.663549 z "
         style="color:#000000;fill:#ed1528;fill-opacity:1;fill-rule:nonzero;stroke:#090909;stroke-width:0.59144282;stroke-linecap:butt;stroke-linejoin:round;marker:none;marker-start:none;marker-mid:none;marker-end:none;stroke-miterlimit:4;stroke-dashoffset:0;stroke-opacity:1;visibility:visible;display:inline;overflow:visible" />
      <path
         transform="matrix(0.1115575,0,0,0.1130746,-24.067367,44.655958)"
         d="M -52.499999 17.5 A 6.7857141 6.4285712 0 1 1  -66.071427,17.5 A 6.7857141 6.4285712 0 1 1  -52.499999 17.5 z"
         sodipodi:ry="6.4285712"
         sodipodi:rx="6.7857141"
         sodipodi:cy="17.5"
         sodipodi:cx="-59.285713"
         id="path3199"
         style="opacity:1;color:#000000;fill:#e8e518;fill-opacity:1;fill-rule:nonzero;stroke:#050909;stroke-width:1.86600006;stroke-linecap:butt;stroke-linejoin:round;marker:none;marker-start:none;marker-mid:none;marker-end:none;stroke-miterlimit:4;stroke-dasharray:none;stroke-dashoffset:0;stroke-opacity:1;visibility:visible;display:inline;overflow:visible"
         sodipodi:type="arc" />
    </g>
    <g
       transform="translate(123.21428,88.571429)"
       id="g3201">
      <path
         style="color:#000000;fill:#ed1528;fill-opacity:1;fill-rule:nonzero;stroke:#090909;stroke-width:0.59144282;stroke-linecap:butt;stroke-linejoin:round;marker:none;marker-start:none;marker-mid:none;marker-end:none;stroke-miterlimit:4;stroke-dashoffset:0;stroke-opacity:1;visibility:visible;display:inline;overflow:visible"
         d="M -29.047612,49.663549 C -31.39551,50.99783 -29.975504,48.468071 -31.005165,48.369967 C -32.034826,48.271863 -31.782145,51.030974 -33.166256,49.271132 C -34.569871,47.48649 -32.331279,48.00723 -32.557411,46.984331 C -32.783543,45.961432 -34.833688,47.356789 -34.070784,45.179535 C -33.320432,43.038105 -32.626848,45.593878 -31.736944,45.059796 C -30.84704,44.525713 -32.978256,43.034537 -30.51117,43.043205 C -28.083925,43.051874 -30.453745,44.563186 -29.677622,45.256004 C -28.901499,45.948822 -27.63927,43.364606 -27.406678,45.814478 C -27.166812,48.340976 -28.815124,46.339534 -29.225358,47.301802 C -29.635591,48.26407 -26.730088,48.346528 -29.047612,49.663549 z "
         id="path3203"
         sodipodi:nodetypes="czzzzzzzzzz" />
      <path
         sodipodi:type="arc"
         style="opacity:1;color:#000000;fill:#e8e518;fill-opacity:1;fill-rule:nonzero;stroke:#050909;stroke-width:1.86600006;stroke-linecap:butt;stroke-linejoin:round;marker:none;marker-start:none;marker-mid:none;marker-end:none;stroke-miterlimit:4;stroke-dasharray:none;stroke-dashoffset:0;stroke-opacity:1;visibility:visible;display:inline;overflow:visible"
         id="path3205"
         sodipodi:cx="-59.285713"
         sodipodi:cy="17.5"
         sodipodi:rx="6.7857141"
         sodipodi:ry="6.4285712"
         d="M -52.499999 17.5 A 6.7857141 6.4285712 0 1 1  -66.071427,17.5 A 6.7857141 6.4285712 0 1 1  -52.499999 17.5 z"
         transform="matrix(0.1115575,0,0,0.1130746,-24.067367,44.655958)" />
    </g>
    <g
       id="g3207"
       transform="matrix(0.7449659,-0.1517271,0.1620568,0.7956835,130.13443,56.97828)">
      <path
         sodipodi:nodetypes="czzzzzzzzzz"
         id="path3209"
         d="M -29.047612,49.663549 C -31.39551,50.99783 -29.975504,48.468071 -31.005165,48.369967 C -32.034826,48.271863 -31.782145,51.030974 -33.166256,49.271132 C -34.569871,47.48649 -32.331279,48.00723 -32.557411,46.984331 C -32.783543,45.961432 -34.833688,47.356789 -34.070784,45.179535 C -33.320432,43.038105 -32.626848,45.593878 -31.736944,45.059796 C -30.84704,44.525713 -32.978256,43.034537 -30.51117,43.043205 C -28.083925,43.051874 -30.453745,44.563186 -29.677622,45.256004 C -28.901499,45.948822 -27.63927,43.364606 -27.406678,45.814478 C -27.166812,48.340976 -28.815124,46.339534 -29.225358,47.301802 C -29.635591,48.26407 -26.730088,48.346528 -29.047612,49.663549 z "
         style="color:#000000;fill:#ed1528;fill-opacity:1;fill-rule:nonzero;stroke:#090909;stroke-width:0.59144282;stroke-linecap:butt;stroke-linejoin:round;marker:none;marker-start:none;marker-mid:none;marker-end:none;stroke-miterlimit:4;stroke-dashoffset:0;stroke-opacity:1;visibility:visible;display:inline;overflow:visible" />
      <path
         transform="matrix(0.1115575,0,0,0.1130746,-24.067367,44.655958)"
         d="M -52.499999 17.5 A 6.7857141 6.4285712 0 1 1  -66.071427,17.5 A 6.7857141 6.4285712 0 1 1  -52.499999 17.5 z"
         sodipodi:ry="6.4285712"
         sodipodi:rx="6.7857141"
         sodipodi:cy="17.5"
         sodipodi:cx="-59.285713"
         id="path3211"
         style="opacity:1;color:#000000;fill:#e8e518;fill-opacity:1;fill-rule:nonzero;stroke:#050909;stroke-width:1.86600006;stroke-linecap:butt;stroke-linejoin:round;marker:none;marker-start:none;marker-mid:none;marker-end:none;stroke-miterlimit:4;stroke-dasharray:none;stroke-dashoffset:0;stroke-opacity:1;visibility:visible;display:inline;overflow:visible"
         sodipodi:type="arc" />
    </g>
    <g
       transform="matrix(0.8236013,0.5671691,-0.5671691,0.8236013,136.67951,-5.0281282)"
       id="g3213">
      <path
         style="color:#000000;fill:#ed1528;fill-opacity:1;fill-rule:nonzero;stroke:#090909;stroke-width:0.59144282;stroke-linecap:butt;stroke-linejoin:round;marker:none;marker-start:none;marker-mid:none;marker-end:none;stroke-miterlimit:4;stroke-dashoffset:0;stroke-opacity:1;visibility:visible;display:inline;overflow:visible"
         d="M -29.047612,49.663549 C -31.39551,50.99783 -29.975504,48.468071 -31.005165,48.369967 C -32.034826,48.271863 -31.782145,51.030974 -33.166256,49.271132 C -34.569871,47.48649 -32.331279,48.00723 -32.557411,46.984331 C -32.783543,45.961432 -34.833688,47.356789 -34.070784,45.179535 C -33.320432,43.038105 -32.626848,45.593878 -31.736944,45.059796 C -30.84704,44.525713 -32.978256,43.034537 -30.51117,43.043205 C -28.083925,43.051874 -30.453745,44.563186 -29.677622,45.256004 C -28.901499,45.948822 -27.63927,43.364606 -27.406678,45.814478 C -27.166812,48.340976 -28.815124,46.339534 -29.225358,47.301802 C -29.635591,48.26407 -26.730088,48.346528 -29.047612,49.663549 z "
         id="path3215"
         sodipodi:nodetypes="czzzzzzzzzz" />
      <path
         sodipodi:type="arc"
         style="opacity:1;color:#000000;fill:#e8e518;fill-opacity:1;fill-rule:nonzero;stroke:#050909;stroke-width:1.86600006;stroke-linecap:butt;stroke-linejoin:round;marker:none;marker-start:none;marker-mid:none;marker-end:none;stroke-miterlimit:4;stroke-dasharray:none;stroke-dashoffset:0;stroke-opacity:1;visibility:visible;display:inline;overflow:visible"
         id="path3217"
         sodipodi:cx="-59.285713"
         sodipodi:cy="17.5"
         sodipodi:rx="6.7857141"
         sodipodi:ry="6.4285712"
         d="M -52.499999 17.5 A 6.7857141 6.4285712 0 1 1  -66.071427,17.5 A 6.7857141 6.4285712 0 1 1  -52.499999 17.5 z"
         transform="matrix(0.1115575,0,0,0.1130746,-24.067367,44.655958)" />
    </g>
    <g
       id="g3219"
       transform="translate(74.999994,-41.071428)">
      <path
         sodipodi:nodetypes="czzzzzzzzzz"
         id="path3221"
         d="M -29.047612,49.663549 C -31.39551,50.99783 -29.975504,48.468071 -31.005165,48.369967 C -32.034826,48.271863 -31.782145,51.030974 -33.166256,49.271132 C -34.569871,47.48649 -32.331279,48.00723 -32.557411,46.984331 C -32.783543,45.961432 -34.833688,47.356789 -34.070784,45.179535 C -33.320432,43.038105 -32.626848,45.593878 -31.736944,45.059796 C -30.84704,44.525713 -32.978256,43.034537 -30.51117,43.043205 C -28.083925,43.051874 -30.453745,44.563186 -29.677622,45.256004 C -28.901499,45.948822 -27.63927,43.364606 -27.406678,45.814478 C -27.166812,48.340976 -28.815124,46.339534 -29.225358,47.301802 C -29.635591,48.26407 -26.730088,48.346528 -29.047612,49.663549 z "
         style="color:#000000;fill:#ed1528;fill-opacity:1;fill-rule:nonzero;stroke:#090909;stroke-width:0.59144282;stroke-linecap:butt;stroke-linejoin:round;marker:none;marker-start:none;marker-mid:none;marker-end:none;stroke-miterlimit:4;stroke-dashoffset:0;stroke-opacity:1;visibility:visible;display:inline;overflow:visible" />
      <path
         transform="matrix(0.1115575,0,0,0.1130746,-24.067367,44.655958)"
         d="M -52.499999 17.5 A 6.7857141 6.4285712 0 1 1  -66.071427,17.5 A 6.7857141 6.4285712 0 1 1  -52.499999 17.5 z"
         sodipodi:ry="6.4285712"
         sodipodi:rx="6.7857141"
         sodipodi:cy="17.5"
         sodipodi:cx="-59.285713"
         id="path3223"
         style="opacity:1;color:#000000;fill:#e8e518;fill-opacity:1;fill-rule:nonzero;stroke:#050909;stroke-width:1.86600006;stroke-linecap:butt;stroke-linejoin:round;marker:none;marker-start:none;marker-mid:none;marker-end:none;stroke-miterlimit:4;stroke-dasharray:none;stroke-dashoffset:0;stroke-opacity:1;visibility:visible;display:inline;overflow:visible"
         sodipodi:type="arc" />
    </g>
    <g
       transform="matrix(0.808208,0,0,0.7644119,109.44773,15.073116)"
       id="g3225">
      <path
         style="color:#000000;fill:#ed1528;fill-opacity:1;fill-rule:nonzero;stroke:#090909;stroke-width:0.59144282;stroke-linecap:butt;stroke-linejoin:round;marker:none;marker-start:none;marker-mid:none;marker-end:none;stroke-miterlimit:4;stroke-dashoffset:0;stroke-opacity:1;visibility:visible;display:inline;overflow:visible"
         d="M -29.047612,49.663549 C -31.39551,50.99783 -29.975504,48.468071 -31.005165,48.369967 C -32.034826,48.271863 -31.782145,51.030974 -33.166256,49.271132 C -34.569871,47.48649 -32.331279,48.00723 -32.557411,46.984331 C -32.783543,45.961432 -34.833688,47.356789 -34.070784,45.179535 C -33.320432,43.038105 -32.626848,45.593878 -31.736944,45.059796 C -30.84704,44.525713 -32.978256,43.034537 -30.51117,43.043205 C -28.083925,43.051874 -30.453745,44.563186 -29.677622,45.256004 C -28.901499,45.948822 -27.63927,43.364606 -27.406678,45.814478 C -27.166812,48.340976 -28.815124,46.339534 -29.225358,47.301802 C -29.635591,48.26407 -26.730088,48.346528 -29.047612,49.663549 z "
         id="path3227"
         sodipodi:nodetypes="czzzzzzzzzz" />
      <path
         sodipodi:type="arc"
         style="opacity:1;color:#000000;fill:#e8e518;fill-opacity:1;fill-rule:nonzero;stroke:#050909;stroke-width:1.86600006;stroke-linecap:butt;stroke-linejoin:round;marker:none;marker-start:none;marker-mid:none;marker-end:none;stroke-miterlimit:4;stroke-dasharray:none;stroke-dashoffset:0;stroke-opacity:1;visibility:visible;display:inline;overflow:visible"
         id="path3229"
         sodipodi:cx="-59.285713"
         sodipodi:cy="17.5"
         sodipodi:rx="6.7857141"
         sodipodi:ry="6.4285712"
         d="M -52.499999 17.5 A 6.7857141 6.4285712 0 1 1  -66.071427,17.5 A 6.7857141 6.4285712 0 1 1  -52.499999 17.5 z"
         transform="matrix(0.1115575,0,0,0.1130746,-24.067367,44.655958)" />
    </g>
    <g
       id="g3231"
       transform="matrix(0.5513388,-0.8342814,0.8342814,0.5513388,93.771155,-15.892963)">
      <path
         sodipodi:nodetypes="czzzzzzzzzz"
         id="path3233"
         d="M -29.047612,49.663549 C -31.39551,50.99783 -29.975504,48.468071 -31.005165,48.369967 C -32.034826,48.271863 -31.782145,51.030974 -33.166256,49.271132 C -34.569871,47.48649 -32.331279,48.00723 -32.557411,46.984331 C -32.783543,45.961432 -34.833688,47.356789 -34.070784,45.179535 C -33.320432,43.038105 -32.626848,45.593878 -31.736944,45.059796 C -30.84704,44.525713 -32.978256,43.034537 -30.51117,43.043205 C -28.083925,43.051874 -30.453745,44.563186 -29.677622,45.256004 C -28.901499,45.948822 -27.63927,43.364606 -27.406678,45.814478 C -27.166812,48.340976 -28.815124,46.339534 -29.225358,47.301802 C -29.635591,48.26407 -26.730088,48.346528 -29.047612,49.663549 z "
         style="color:#000000;fill:#ed1528;fill-opacity:1;fill-rule:nonzero;stroke:#090909;stroke-width:0.59144282;stroke-linecap:butt;stroke-linejoin:round;marker:none;marker-start:none;marker-mid:none;marker-end:none;stroke-miterlimit:4;stroke-dashoffset:0;stroke-opacity:1;visibility:visible;display:inline;overflow:visible" />
      <path
         transform="matrix(0.1115575,0,0,0.1130746,-24.067367,44.655958)"
         d="M -52.499999 17.5 A 6.7857141 6.4285712 0 1 1  -66.071427,17.5 A 6.7857141 6.4285712 0 1 1  -52.499999 17.5 z"
         sodipodi:ry="6.4285712"
         sodipodi:rx="6.7857141"
         sodipodi:cy="17.5"
         sodipodi:cx="-59.285713"
         id="path3235"
         style="opacity:1;color:#000000;fill:#e8e518;fill-opacity:1;fill-rule:nonzero;stroke:#050909;stroke-width:1.86600006;stroke-linecap:butt;stroke-linejoin:round;marker:none;marker-start:none;marker-mid:none;marker-end:none;stroke-miterlimit:4;stroke-dasharray:none;stroke-dashoffset:0;stroke-opacity:1;visibility:visible;display:inline;overflow:visible"
         sodipodi:type="arc" />
    </g>
    <g
       transform="matrix(0.9689785,0.8480691,-0.7824023,0.8939496,196.24515,119.91437)"
       id="g3237">
      <path
         style="color:#000000;fill:#ed1528;fill-opacity:1;fill-rule:nonzero;stroke:#090909;stroke-width:0.59144282;stroke-linecap:butt;stroke-linejoin:round;marker:none;marker-start:none;marker-mid:none;marker-end:none;stroke-miterlimit:4;stroke-dashoffset:0;stroke-opacity:1;visibility:visible;display:inline;overflow:visible"
         d="M -29.047612,49.663549 C -31.39551,50.99783 -29.975504,48.468071 -31.005165,48.369967 C -32.034826,48.271863 -31.782145,51.030974 -33.166256,49.271132 C -34.569871,47.48649 -32.331279,48.00723 -32.557411,46.984331 C -32.783543,45.961432 -34.833688,47.356789 -34.070784,45.179535 C -33.320432,43.038105 -32.626848,45.593878 -31.736944,45.059796 C -30.84704,44.525713 -32.978256,43.034537 -30.51117,43.043205 C -28.083925,43.051874 -30.453745,44.563186 -29.677622,45.256004 C -28.901499,45.948822 -27.63927,43.364606 -27.406678,45.814478 C -27.166812,48.340976 -28.815124,46.339534 -29.225358,47.301802 C -29.635591,48.26407 -26.730088,48.346528 -29.047612,49.663549 z "
         id="path3239"
         sodipodi:nodetypes="czzzzzzzzzz" />
      <path
         sodipodi:type="arc"
         style="opacity:1;color:#000000;fill:#e8e518;fill-opacity:1;fill-rule:nonzero;stroke:#050909;stroke-width:1.86600006;stroke-linecap:butt;stroke-linejoin:round;marker:none;marker-start:none;marker-mid:none;marker-end:none;stroke-miterlimit:4;stroke-dasharray:none;stroke-dashoffset:0;stroke-opacity:1;visibility:visible;display:inline;overflow:visible"
         id="path3241"
         sodipodi:cx="-59.285713"
         sodipodi:cy="17.5"
         sodipodi:rx="6.7857141"
         sodipodi:ry="6.4285712"
         d="M -52.499999 17.5 A 6.7857141 6.4285712 0 1 1  -66.071427,17.5 A 6.7857141 6.4285712 0 1 1  -52.499999 17.5 z"
         transform="matrix(0.1115575,0,0,0.1130746,-24.067367,44.655958)" />
    </g>
    <g
       id="g3243"
       transform="translate(102.14285,62.5)">
      <path
         sodipodi:nodetypes="czzzzzzzzzz"
         id="path3245"
         d="M -29.047612,49.663549 C -31.39551,50.99783 -29.975504,48.468071 -31.005165,48.369967 C -32.034826,48.271863 -31.782145,51.030974 -33.166256,49.271132 C -34.569871,47.48649 -32.331279,48.00723 -32.557411,46.984331 C -32.783543,45.961432 -34.833688,47.356789 -34.070784,45.179535 C -33.320432,43.038105 -32.626848,45.593878 -31.736944,45.059796 C -30.84704,44.525713 -32.978256,43.034537 -30.51117,43.043205 C -28.083925,43.051874 -30.453745,44.563186 -29.677622,45.256004 C -28.901499,45.948822 -27.63927,43.364606 -27.406678,45.814478 C -27.166812,48.340976 -28.815124,46.339534 -29.225358,47.301802 C -29.635591,48.26407 -26.730088,48.346528 -29.047612,49.663549 z "
         style="color:#000000;fill:#ed1528;fill-opacity:1;fill-rule:nonzero;stroke:#090909;stroke-width:0.59144282;stroke-linecap:butt;stroke-linejoin:round;marker:none;marker-start:none;marker-mid:none;marker-end:none;stroke-miterlimit:4;stroke-dashoffset:0;stroke-opacity:1;visibility:visible;display:inline;overflow:visible" />
      <path
         transform="matrix(0.1115575,0,0,0.1130746,-24.067367,44.655958)"
         d="M -52.499999 17.5 A 6.7857141 6.4285712 0 1 1  -66.071427,17.5 A 6.7857141 6.4285712 0 1 1  -52.499999 17.5 z"
         sodipodi:ry="6.4285712"
         sodipodi:rx="6.7857141"
         sodipodi:cy="17.5"
         sodipodi:cx="-59.285713"
         id="path3247"
         style="opacity:1;color:#000000;fill:#e8e518;fill-opacity:1;fill-rule:nonzero;stroke:#050909;stroke-width:1.86600006;stroke-linecap:butt;stroke-linejoin:round;marker:none;marker-start:none;marker-mid:none;marker-end:none;stroke-miterlimit:4;stroke-dasharray:none;stroke-dashoffset:0;stroke-opacity:1;visibility:visible;display:inline;overflow:visible"
         sodipodi:type="arc" />
    </g>
    <g
       transform="matrix(1.2874701,0,0,1.1879811,49.928808,84.464288)"
       id="g3249">
      <path
         style="color:#000000;fill:#ed1528;fill-opacity:1;fill-rule:nonzero;stroke:#090909;stroke-width:0.59144282;stroke-linecap:butt;stroke-linejoin:round;marker:none;marker-start:none;marker-mid:none;marker-end:none;stroke-miterlimit:4;stroke-dashoffset:0;stroke-opacity:1;visibility:visible;display:inline;overflow:visible"
         d="M -29.047612,49.663549 C -31.39551,50.99783 -29.975504,48.468071 -31.005165,48.369967 C -32.034826,48.271863 -31.782145,51.030974 -33.166256,49.271132 C -34.569871,47.48649 -32.331279,48.00723 -32.557411,46.984331 C -32.783543,45.961432 -34.833688,47.356789 -34.070784,45.179535 C -33.320432,43.038105 -32.626848,45.593878 -31.736944,45.059796 C -30.84704,44.525713 -32.978256,43.034537 -30.51117,43.043205 C -28.083925,43.051874 -30.453745,44.563186 -29.677622,45.256004 C -28.901499,45.948822 -27.63927,43.364606 -27.406678,45.814478 C -27.166812,48.340976 -28.815124,46.339534 -29.225358,47.301802 C -29.635591,48.26407 -26.730088,48.346528 -29.047612,49.663549 z "
         id="path3251"
         sodipodi:nodetypes="czzzzzzzzzz" />
      <path
         sodipodi:type="arc"
         style="opacity:1;color:#000000;fill:#e8e518;fill-opacity:1;fill-rule:nonzero;stroke:#050909;stroke-width:1.86600006;stroke-linecap:butt;stroke-linejoin:round;marker:none;marker-start:none;marker-mid:none;marker-end:none;stroke-miterlimit:4;stroke-dasharray:none;stroke-dashoffset:0;stroke-opacity:1;visibility:visible;display:inline;overflow:visible"
         id="path3253"
         sodipodi:cx="-59.285713"
         sodipodi:cy="17.5"
         sodipodi:rx="6.7857141"
         sodipodi:ry="6.4285712"
         d="M -52.499999 17.5 A 6.7857141 6.4285712 0 1 1  -66.071427,17.5 A 6.7857141 6.4285712 0 1 1  -52.499999 17.5 z"
         transform="matrix(0.1115575,0,0,0.1130746,-24.067367,44.655958)" />
    </g>
    <g
       id="g3255"
       transform="translate(42.857136,11.428571)">
      <path
         sodipodi:nodetypes="czzzzzzzzzz"
         id="path3257"
         d="M -29.047612,49.663549 C -31.39551,50.99783 -29.975504,48.468071 -31.005165,48.369967 C -32.034826,48.271863 -31.782145,51.030974 -33.166256,49.271132 C -34.569871,47.48649 -32.331279,48.00723 -32.557411,46.984331 C -32.783543,45.961432 -34.833688,47.356789 -34.070784,45.179535 C -33.320432,43.038105 -32.626848,45.593878 -31.736944,45.059796 C -30.84704,44.525713 -32.978256,43.034537 -30.51117,43.043205 C -28.083925,43.051874 -30.453745,44.563186 -29.677622,45.256004 C -28.901499,45.948822 -27.63927,43.364606 -27.406678,45.814478 C -27.166812,48.340976 -28.815124,46.339534 -29.225358,47.301802 C -29.635591,48.26407 -26.730088,48.346528 -29.047612,49.663549 z "
         style="color:#000000;fill:#ed1528;fill-opacity:1;fill-rule:nonzero;stroke:#090909;stroke-width:0.59144282;stroke-linecap:butt;stroke-linejoin:round;marker:none;marker-start:none;marker-mid:none;marker-end:none;stroke-miterlimit:4;stroke-dashoffset:0;stroke-opacity:1;visibility:visible;display:inline;overflow:visible" />
      <path
         transform="matrix(0.1115575,0,0,0.1130746,-24.067367,44.655958)"
         d="M -52.499999 17.5 A 6.7857141 6.4285712 0 1 1  -66.071427,17.5 A 6.7857141 6.4285712 0 1 1  -52.499999 17.5 z"
         sodipodi:ry="6.4285712"
         sodipodi:rx="6.7857141"
         sodipodi:cy="17.5"
         sodipodi:cx="-59.285713"
         id="path3259"
         style="opacity:1;color:#000000;fill:#e8e518;fill-opacity:1;fill-rule:nonzero;stroke:#050909;stroke-width:1.86600006;stroke-linecap:butt;stroke-linejoin:round;marker:none;marker-start:none;marker-mid:none;marker-end:none;stroke-miterlimit:4;stroke-dasharray:none;stroke-dashoffset:0;stroke-opacity:1;visibility:visible;display:inline;overflow:visible"
         sodipodi:type="arc" />
    </g>
    <path
       style="fill:#076414;fill-opacity:1;fill-rule:evenodd;stroke:#000000;stroke-width:0.48679867;stroke-linecap:butt;stroke-linejoin:miter;stroke-opacity:1;stroke-miterlimit:4;stroke-dasharray:none;opacity:0.56730769"
       d="M 125.07559,82.136271 C 125.07559,82.136271 125.73387,85.237277 125.61219,87.889365 C 125.56506,88.916692 125.60439,89.816989 125.67181,90.548358 C 126.01724,89.898665 126.37517,89.245134 126.68538,88.76925 C 127.58579,87.387955 129.64944,85.568788 129.64944,85.568789 C 129.64944,85.568789 128.65777,88.462603 127.56268,90.258286 C 126.57675,91.874959 126.83018,92.74324 126.83018,92.74324 L 124.49641,92.85926 C 124.49641,92.85926 124.5721,92.70718 124.61565,92.61754 L 122.93773,92.85926 C 122.93773,92.85926 123.25339,91.857821 123.03142,90.093912 C 122.73939,87.773336 122.15412,85.781509 122.15412,85.781508 C 122.15412,85.781508 123.4001,86.474919 123.95981,88.933624 C 124.01946,89.195649 124.08382,89.452918 124.15571,89.707149 C 124.24482,89.153578 124.33263,88.546453 124.3942,87.889365 C 124.63756,85.29253 125.07559,82.136271 125.07559,82.136271 z "
       id="path4351" />
    <path
       id="path4359"
       d="M 64.361313,78.921985 C 64.361313,78.921985 65.019586,82.022991 64.897909,84.675079 C 64.850776,85.702406 64.890111,86.602703 64.957531,87.334072 C 65.30296,86.684379 65.660891,86.030848 65.971102,85.554964 C 66.871513,84.173669 68.93516,82.354502 68.935159,82.354503 C 68.935159,82.354503 67.943489,85.248317 66.848394,87.044 C 65.862469,88.660673 66.115898,89.528954 66.115898,89.528954 L 63.782129,89.644974 C 63.782129,89.644974 63.857818,89.492894 63.901373,89.403254 L 62.223445,89.644974 C 62.223445,89.644974 62.53911,88.643535 62.317136,86.879626 C 62.025111,84.55905 61.439843,82.567223 61.439843,82.567222 C 61.439843,82.567222 62.685817,83.260633 63.245533,85.719338 C 63.305182,85.981363 63.369536,86.238632 63.441433,86.492863 C 63.530537,85.939292 63.618344,85.332167 63.67992,84.675079 C 63.923275,82.078244 64.361313,78.921985 64.361313,78.921985 z "
       style="fill:#076414;fill-opacity:1;fill-rule:evenodd;stroke:#000000;stroke-width:0.48679867;stroke-linecap:butt;stroke-linejoin:miter;stroke-opacity:1;stroke-miterlimit:4;stroke-dasharray:none;opacity:0.56730769" />
    <path
       style="fill:#076414;fill-opacity:1;fill-rule:evenodd;stroke:#000000;stroke-width:0.37571871;stroke-linecap:butt;stroke-linejoin:miter;stroke-opacity:1;stroke-miterlimit:4;stroke-dasharray:none;opacity:0.56730769"
       d="M 70.086557,20.317424 C 70.086557,20.317424 70.59382,22.714612 70.500056,24.764771 C 70.463736,25.558931 70.494047,26.254893 70.546001,26.820268 C 70.812187,26.318032 71.088008,25.812829 71.327055,25.444953 C 72.020909,24.377163 73.611149,22.970882 73.611148,22.970883 C 73.611148,22.970883 72.84697,25.207904 72.003094,26.596032 C 71.243343,27.845778 71.438635,28.51699 71.438635,28.51699 L 69.64024,28.606677 C 69.64024,28.606677 69.698565,28.489114 69.732129,28.419819 L 68.439123,28.606677 C 68.439123,28.606677 68.682373,27.832529 68.511321,26.468965 C 68.286287,24.675076 67.835282,23.135323 67.835282,23.135322 C 67.835282,23.135322 68.795425,23.671354 69.226741,25.57202 C 69.272706,25.774575 69.322297,25.973453 69.3777,26.169983 C 69.446364,25.742053 69.514028,25.272723 69.561478,24.764771 C 69.749006,22.757325 70.086557,20.317424 70.086557,20.317424 z "
       id="path4361" />
    <path
       id="path4363"
       d="M 34.227975,44.63627 C 34.227975,44.63627 33.569702,47.737276 33.691379,50.389364 C 33.738512,51.416691 33.699177,52.316988 33.631757,53.048357 C 33.286328,52.398664 32.928397,51.745133 32.618186,51.269249 C 31.717775,49.887954 29.654128,48.068787 29.654129,48.068788 C 29.654129,48.068788 30.645799,50.962602 31.740894,52.758285 C 32.726819,54.374958 32.47339,55.243239 32.47339,55.243239 L 34.807159,55.359259 C 34.807159,55.359259 34.73147,55.207179 34.687915,55.117539 L 36.365843,55.359259 C 36.365843,55.359259 36.050178,54.35782 36.272152,52.593911 C 36.564177,50.273335 37.149445,48.281508 37.149445,48.281507 C 37.149445,48.281507 35.903471,48.974918 35.343755,51.433623 C 35.284106,51.695648 35.219752,51.952917 35.147855,52.207148 C 35.058751,51.653577 34.970944,51.046452 34.909368,50.389364 C 34.666013,47.792529 34.227975,44.63627 34.227975,44.63627 z "
       style="fill:#076414;fill-opacity:1;fill-rule:evenodd;stroke:#000000;stroke-width:0.48679867;stroke-linecap:butt;stroke-linejoin:miter;stroke-opacity:1;stroke-miterlimit:4;stroke-dasharray:none;opacity:0.56730769" />
    <path
       style="fill:#076414;fill-opacity:1;fill-rule:evenodd;stroke:#000000;stroke-width:0.48679867;stroke-linecap:butt;stroke-linejoin:miter;stroke-opacity:1;stroke-miterlimit:4;stroke-dasharray:none;opacity:0.56730769"
       d="M 102.44226,74.993413 C 102.44226,74.993413 101.78399,78.094419 101.90566,80.746507 C 101.9528,81.773834 101.91346,82.674131 101.84604,83.4055 C 101.50061,82.755807 101.14268,82.102276 100.83247,81.626392 C 99.932061,80.245097 97.868414,78.42593 97.868415,78.425931 C 97.868415,78.425931 98.860085,81.319745 99.95518,83.115428 C 100.9411,84.732101 100.68768,85.600382 100.68768,85.600382 L 103.02144,85.716402 C 103.02144,85.716402 102.94576,85.564322 102.9022,85.474682 L 104.58013,85.716402 C 104.58013,85.716402 104.26446,84.714963 104.48644,82.951054 C 104.77846,80.630478 105.36373,78.638651 105.36373,78.63865 C 105.36373,78.63865 104.11776,79.332061 103.55804,81.790766 C 103.49839,82.052791 103.43404,82.31006 103.36214,82.564291 C 103.27304,82.01072 103.18523,81.403595 103.12365,80.746507 C 102.8803,78.149672 102.44226,74.993413 102.44226,74.993413 z "
       id="path4365" />
    <path
       id="path4367"
       d="M 147.23758,32.516126 C 147.23758,32.516126 146.45783,36.017127 146.60195,39.011304 C 146.65779,40.171145 146.61119,41.18757 146.53133,42.013277 C 146.12216,41.279781 145.69818,40.541952 145.33072,40.004684 C 144.26416,38.445218 141.8197,36.391399 141.8197,36.3914 C 141.8197,36.3914 142.99437,39.658483 144.29154,41.685789 C 145.4594,43.510995 145.15921,44.491274 145.15921,44.491274 L 147.92363,44.62226 C 147.92363,44.62226 147.83399,44.450563 147.78239,44.349361 L 149.76996,44.62226 C 149.76996,44.62226 149.39603,43.491646 149.65898,41.500213 C 150.00489,38.880309 150.69816,36.631559 150.69816,36.631557 C 150.69816,36.631557 149.22226,37.414411 148.55926,40.190261 C 148.4886,40.486084 148.41237,40.776538 148.32721,41.063562 C 148.22166,40.438586 148.11765,39.753149 148.04471,39.011304 C 147.75645,36.079507 147.23758,32.516126 147.23758,32.516126 z "
       style="fill:#076414;fill-opacity:1;fill-rule:evenodd;stroke:#000000;stroke-width:0.56294775;stroke-linecap:butt;stroke-linejoin:miter;stroke-opacity:1;stroke-miterlimit:4;stroke-dasharray:none;opacity:0.56730769" />
    <path
       style="fill:#076414;fill-opacity:1;fill-rule:evenodd;stroke:#000000;stroke-width:0.48679867;stroke-linecap:butt;stroke-linejoin:miter;stroke-opacity:1;stroke-miterlimit:4;stroke-dasharray:none;opacity:0.56730769"
       d="M 112.44226,3.5648411 C 112.44226,3.5648411 111.78399,6.6658471 111.90566,9.3179351 C 111.9528,10.345262 111.91346,11.245559 111.84604,11.976928 C 111.50061,11.327235 111.14268,10.673704 110.83247,10.19782 C 109.93206,8.8165251 107.86842,6.9973581 107.86842,6.9973591 C 107.86842,6.9973591 108.86009,9.8911731 109.95518,11.686856 C 110.9411,13.303529 110.68768,14.17181 110.68768,14.17181 L 113.02144,14.28783 C 113.02144,14.28783 112.94576,14.13575 112.9022,14.04611 L 114.58013,14.28783 C 114.58013,14.28783 114.26446,13.286391 114.48644,11.522482 C 114.77846,9.2019061 115.36373,7.2100791 115.36373,7.2100781 C 115.36373,7.2100781 114.11776,7.9034891 113.55804,10.362194 C 113.49839,10.624219 113.43404,10.881488 113.36214,11.135719 C 113.27304,10.582148 113.18523,9.9750231 113.12365,9.3179351 C 112.8803,6.7211001 112.44226,3.5648411 112.44226,3.5648411 z "
       id="path4369" />
    <path
       id="path4371"
       d="M 26.861313,120.7077 C 26.861313,120.7077 27.519583,123.8087 27.397913,126.46079 C 27.350773,127.48812 27.390113,128.38842 27.457533,129.11979 C 27.802963,128.47009 28.160893,127.81656 28.471103,127.34068 C 29.371513,125.95938 31.435153,124.14022 31.435153,124.14022 C 31.435153,124.14022 30.443483,127.03403 29.348393,128.82971 C 28.362473,130.44639 28.615893,131.31467 28.615893,131.31467 L 26.282133,131.43069 C 26.282133,131.43069 26.357813,131.27861 26.401373,131.18897 L 24.723443,131.43069 C 24.723443,131.43069 25.039113,130.42925 24.817133,128.66534 C 24.525113,126.34476 23.939843,124.35294 23.939843,124.35294 C 23.939843,124.35294 25.185813,125.04635 25.745533,127.50505 C 25.805183,127.76708 25.869533,128.02435 25.941433,128.27858 C 26.030533,127.72501 26.118343,127.11788 26.179923,126.46079 C 26.423273,123.86396 26.861313,120.7077 26.861313,120.7077 z "
       style="fill:#076414;fill-opacity:1;fill-rule:evenodd;stroke:#000000;stroke-width:0.48679867;stroke-linecap:butt;stroke-linejoin:miter;stroke-opacity:1;stroke-miterlimit:4;stroke-dasharray:none;opacity:0.56730769" />
    <path
       style="fill:#076414;fill-opacity:1;fill-rule:evenodd;stroke:#000000;stroke-width:0.48679867;stroke-linecap:butt;stroke-linejoin:miter;stroke-opacity:1;stroke-miterlimit:4;stroke-dasharray:none;opacity:0.56730769"
       d="M 60.299403,132.49341 C 60.299403,132.49341 59.641133,135.59441 59.762803,138.2465 C 59.809943,139.27383 59.770603,140.17413 59.703183,140.9055 C 59.357753,140.2558 58.999823,139.60227 58.689613,139.12639 C 57.789203,137.74509 55.725563,135.92593 55.725563,135.92593 C 55.725563,135.92593 56.717233,138.81974 57.812323,140.61542 C 58.798243,142.2321 58.544823,143.10038 58.544823,143.10038 L 60.878583,143.2164 C 60.878583,143.2164 60.802903,143.06432 60.759343,142.97468 L 62.437273,143.2164 C 62.437273,143.2164 62.121603,142.21496 62.343583,140.45105 C 62.635603,138.13047 63.220873,136.13865 63.220873,136.13865 C 63.220873,136.13865 61.974903,136.83206 61.415183,139.29076 C 61.355533,139.55279 61.291183,139.81006 61.219283,140.06429 C 61.130183,139.51072 61.042373,138.90359 60.980793,138.2465 C 60.737443,135.64967 60.299403,132.49341 60.299403,132.49341 z "
       id="path4373" />
    <path
       id="path4375"
       d="M 42.009408,94.622545 C 42.009408,94.622545 41.41146,97.421633 41.52198,99.81552 C 41.564801,100.74283 41.529066,101.55548 41.467824,102.21564 C 41.154048,101.6292 40.828917,101.03929 40.547133,100.60974 C 39.729234,99.362924 37.854698,97.720877 37.854698,97.720877 C 37.854698,97.720877 38.755495,100.33295 39.750235,101.9538 C 40.645809,103.41308 40.415612,104.19683 40.415612,104.19683 L 42.535514,104.30155 C 42.535514,104.30155 42.466769,104.16428 42.427201,104.08337 L 43.951372,104.30155 C 43.951372,104.30155 43.664629,103.39761 43.866267,101.80544 C 44.131528,99.710787 44.663166,97.912887 44.663166,97.912887 C 44.663166,97.912887 43.531372,98.538787 43.022942,100.75811 C 42.968759,100.99463 42.910305,101.22685 42.844994,101.45633 C 42.764059,100.95666 42.684295,100.40864 42.628358,99.81552 C 42.407308,97.471513 42.009408,94.622545 42.009408,94.622545 z "
       style="fill:#076414;fill-opacity:1;fill-rule:evenodd;stroke:#000000;stroke-width:0.44079506;stroke-linecap:butt;stroke-linejoin:miter;stroke-opacity:1;stroke-miterlimit:4;stroke-dasharray:none;opacity:0.56730769" />
    <path
       style="fill:#076414;fill-opacity:1;fill-rule:evenodd;stroke:#000000;stroke-width:0.48679867;stroke-linecap:butt;stroke-linejoin:miter;stroke-opacity:1;stroke-miterlimit:4;stroke-dasharray:none;opacity:0.56730769"
       d="M 151.72797,79.99341 C 151.72797,79.99341 151.0697,83.09441 151.19137,85.746503 C 151.23851,86.773833 151.19917,87.674133 151.13175,88.405503 C 150.78632,87.755803 150.42839,87.102273 150.11818,86.626393 C 149.21777,85.24509 147.15413,83.42593 147.15413,83.42593 C 147.15413,83.42593 148.1458,86.319743 149.24089,88.115423 C 150.22681,89.732103 149.97339,90.600383 149.97339,90.600383 L 152.30715,90.716403 C 152.30715,90.716403 152.23147,90.564323 152.18791,90.474683 L 153.86584,90.716403 C 153.86584,90.716403 153.55017,89.714963 153.77215,87.951053 C 154.06417,85.630473 154.64944,83.63865 154.64944,83.63865 C 154.64944,83.63865 153.40347,84.33206 152.84375,86.790763 C 152.7841,87.052793 152.71975,87.310063 152.64785,87.564293 C 152.55875,87.010723 152.47094,86.403593 152.40936,85.746503 C 152.16601,83.14967 151.72797,79.99341 151.72797,79.99341 z "
       id="path4377" />
    <path
       id="path4379"
       d="M 10.656541,6.4219814 C 10.656541,6.4219814 9.9982714,9.5229814 10.119941,12.175074 C 10.167081,13.202404 10.127741,14.102704 10.060321,14.834074 C 9.7148914,14.184374 9.3569614,13.530844 9.0467514,13.054964 C 8.1463414,11.673661 6.0827014,9.8545014 6.0827014,9.8545014 C 6.0827014,9.8545014 7.0743714,12.748314 8.1694614,14.543994 C 9.1553814,16.160674 8.9019614,17.028954 8.9019614,17.028954 L 11.235721,17.144974 C 11.235721,17.144974 11.160041,16.992894 11.116481,16.903254 L 12.794411,17.144974 C 12.794411,17.144974 12.478741,16.143534 12.700721,14.379624 C 12.992741,12.059044 13.578011,10.067221 13.578011,10.067221 C 13.578011,10.067221 12.332041,10.760631 11.772321,13.219334 C 11.712671,13.481364 11.648321,13.738634 11.576421,13.992864 C 11.487321,13.439294 11.399511,12.832164 11.337931,12.175074 C 11.094581,9.5782414 10.656541,6.4219814 10.656541,6.4219814 z "
       style="fill:#076414;fill-opacity:1;fill-rule:evenodd;stroke:#000000;stroke-width:0.48679867;stroke-linecap:butt;stroke-linejoin:miter;stroke-opacity:1;stroke-miterlimit:4;stroke-dasharray:none;opacity:0.56730769" />
  </g>
</svg>
