<?xml version="1.0" encoding="UTF-8" standalone="no"?>
<!DOCTYPE svg PUBLIC "-//W3C//DTD SVG 1.0//EN"
"http://www.w3.org/TR/2001/REC-SVG-20010904/DTD/svg10.dtd">
<!-- Created with Sodipodi ("http://www.sodipodi.com/") -->
<svg
   id="svg602"
   sodipodi:version="0.34"
   xmlns="http://www.w3.org/2000/svg"
   xmlns:sodipodi="http://sodipodi.sourceforge.net/DTD/sodipodi-0.dtd"
   xmlns:xlink="http://www.w3.org/1999/xlink"
   width="210mm"
   height="297mm"
   xml:space="preserve"
   sodipodi:docbase="/home/ronald/Devel/Funky/doc"
   sodipodi:docname="/home/ronald/Devel/Funky/doc/logo.svg"><defs
   id="defs604"><linearGradient
   id="linearGradient630"><stop
   style="stop-color:#000;stop-opacity:1;"
   offset="0"
   id="stop631" /><stop
   style="stop-color:#fff;stop-opacity:1;"
   offset="1"
   id="stop632" /></linearGradient><linearGradient
   xlink:href="#linearGradient630"
   id="linearGradient633" /></defs><sodipodi:namedview
   id="base" /><path
   style="font-size:12;fill:#ff0000;stroke-width:1;"
   d="M 385.4797 630.522 C 390.1404 630.8883 394.8336 630.8744 399.5072 630.9533 C 408.6351 630.986 417.1738 630.8163 426.0619 628.8016 C 431.8242 626.27 435.5397 623.0998 439.7593 618.6042 C 442.6642 614.4679 443.606 611.5841 443.8871 606.6337 C 443.5525 600.9177 443.1692 595.6386 440.9058 590.3142 C 438.0775 586.597 434.9801 584.2094 430.9354 581.701 L 441.6623 561.5049 C 449.7255 566.6773 455.1708 571.6979 460.6427 579.3202 C 464.4069 588.5949 465.8108 596.9577 466.3555 606.8627 C 465.493 617.7501 462.916 625.0472 456.4185 634.0811 C 448.9611 641.8451 442.2291 646.8113 432.0215 650.9616 C 421.1139 653.2292 410.6669 653.795 399.5072 653.9516 C 394.8336 654.0306 390.1404 654.0166 385.4797 654.3829 L 385.4797 630.522 z "
   id="path625" /><path
   style="fill:#ff0000;fill-rule:nonzero;stroke:none;fill-opacity:1;stroke-opacity:1;stroke-width:1pt;stroke-linejoin:miter;stroke-linecap:butt;"
   id="path605"
   d="M 439.2064 404.77 C 439.5459 400.161 439.9227 395.6507 440.5932 391.0647 C 442.7835 380.8817 445.8431 371.1875 449.3192 361.3316 C 452.2187 352.1075 454.2354 343.4514 454.7667 333.8361 C 453.6645 326.2514 451.597 321.6574 446.4301 315.7668 C 439.7584 310.4261 433.2749 306.9569 425.1358 303.9504 C 418.6806 302.3564 413.0062 301.8789 406.3486 302.3046 C 399.7516 303.6618 395.4382 305.954 390.2414 310.0332 C 385.4968 315.2018 381.8586 320.3753 379.1034 326.7093 C 378.839 330.2771 382.3292 334.633 378.9809 331.9602 C 367.1698 333.2988 369.6004 338.4058 367.3842 326.1296 C 363.885 316.0859 359.1824 307.9152 352.7927 299.2414 C 346.0695 291.7352 339.0788 285.4019 330.8535 279.3805 C 324.514 275.4247 319.0411 272.7499 311.6628 271.0391 C 305.1974 270.3862 299.8498 270.456 293.6074 272.2137 C 288.6157 274.8069 286.2511 277.4734 283.3787 282.1186 C 280.3712 288.7766 279.3445 294.7055 278.9378 301.9332 C 279.1648 310.309 279.7534 318.609 280.7713 326.9314 C 283.1088 337.3968 284.4377 331.3699 279.1202 330.8435 C 282.6713 331.1951 271.4766 329.8477 268.4406 331.6242 C 272.1485 329.4546 266.7237 340.3589 263.4126 343.0414 C 260.916 339.295 254.2144 329.1471 249.663 323.5667 C 243.3562 316.7778 237.086 310.6489 229.4114 305.2526 C 223.9425 302.4422 218.7909 300.9431 212.7072 299.7092 C 204.8476 298.6555 197.3616 298.245 189.4345 298.6721 C 180.7928 300.0651 174.791 302.3131 167.7535 307.2735 C 162.441 313.1893 161.4321 317.6802 161.045 325.422 C 162.2475 334.6937 164.8371 342.7975 168.5362 351.4534 C 171.3814 356.9166 174.446 361.6934 178.5603 366.384 C 184.4724 371.7353 190.999 375.9239 197.8144 380.1992 C 206.3282 385.5777 214.3629 391.04 221.9491 397.5449 C 229.2052 405.1999 234.4487 412.4526 238.8341 421.8723 C 241.7586 431.6072 242.7687 440.2243 242.2577 450.3274 C 239.4845 461.7948 235.5478 467.9299 225.7601 475.2046 C 225.0976 475.5498 224.4352 475.8949 223.7728 476.2401 L 213.8975 455.412 C 214.1285 455.3064 214.3595 455.2008 214.5904 455.0953 C 217.9759 452.8528 218.9722 451.2552 219.9584 447.4584 C 220.3336 441.534 219.7584 436.3952 218.1114 430.674 C 215.2965 424.3729 211.7907 419.7624 206.946 414.6761 C 200.5341 409.0786 193.6831 404.4155 186.4362 399.822 C 177.9956 394.5818 170.0599 389.3913 162.7075 382.8382 C 156.6849 375.9595 152.2752 369.0885 148.2805 360.9915 C 143.4978 349.2724 140.4331 338.3301 138.9304 325.8441 C 139.9481 310.274 143.1981 301.0241 154.114 289.255 C 164.9448 281.8519 174.2864 277.9812 187.4557 275.7981 C 197.3263 275.2737 206.6413 275.68 216.4336 276.9542 C 225.6698 278.778 233.221 281.3003 241.413 285.7382 C 250.6992 292.5553 258.405 300.123 266.0653 308.5516 C 273.8399 318.0654 280.9517 327.161 285.8285 338.267 C 289.4331 335.0301 276.8319 354.2011 280.9713 351.598 C 265.0287 361.6236 260.5618 338.9921 258.7252 330.4374 C 257.5721 320.7664 256.8583 311.1598 256.6482 301.4293 C 257.353 290.2595 259.2706 281.0178 263.9151 270.7129 C 270.0857 261.0824 275.7552 255.5722 286.3277 250.3679 C 296.5598 247.6535 305.0758 247.1802 315.6249 248.3342 C 326.1967 250.9003 334.3413 254.6662 343.3625 260.4572 C 353.2765 267.8987 361.7435 275.713 369.8714 284.8896 C 378.224 296.3502 384.1763 307.2444 388.7771 320.4716 C 392.2032 340.0156 391.8256 349.0868 371.1926 353.9434 C 358.1882 343.6316 355.9474 335.0617 358.0189 319.1066 C 362.5904 308.8662 367.9446 300.7742 375.7919 292.489 C 384.8891 285.5373 392.6402 281.6292 404.0928 279.3115 C 414.0775 278.7319 422.4999 279.5767 432.1468 282.0918 C 443.5085 286.5265 452.5093 291.7245 461.8284 299.3093 C 471.3419 310.5389 475.1764 319.589 476.9747 333.8626 C 476.2051 346.1707 473.8182 357.2672 470.0871 369.0792 C 467.117 377.6576 464.5027 386.0594 462.7515 394.9347 C 462.3634 398.2633 462.0936 401.4275 462.3399 404.77 L 439.2064 404.77 z " /><path
   style="fill:black;fill-rule:nonzero;stroke:none;fill-opacity:1;stroke-opacity:1;stroke-width:1pt;stroke-linejoin:miter;stroke-linecap:butt;"
   id="path607"
   d="M 409.3874 499.1071 C 412.5434 501.6602 403.4077 496.5972 400.5636 495.6192 C 391.85 493.7458 384.3539 493.0927 375.5367 494.5683 C 370.0749 496.9189 367.7797 499.1387 364.751 504.0155 C 364.1595 505.169 363.5934 506.3253 363.0389 507.4953 L 342.8495 497.318 C 343.6384 495.6821 344.451 494.0689 345.2976 492.459 C 352.1486 482.0398 358.4219 476.9724 370.4058 472.2609 C 383.1107 470.3809 393.885 470.9269 406.4651 473.4472 C 413.1478 475.5471 419.3452 477.6906 425.009 481.5234 L 409.3874 499.1071 z " /><path
   style="fill:#ff0000;fill-rule:nonzero;stroke:none;fill-opacity:1;stroke-opacity:1;stroke-width:1pt;stroke-linejoin:miter;stroke-linecap:butt;"
   id="path608"
   d="M 238.118 434.8693 C 239.4685 427.9946 242.7573 422.7611 246.6231 416.7549 C 254.1455 407.5269 261.9628 400.2599 271.8657 393.3186 C 283.4838 387.423 294.4785 383.8503 307.3825 381.3189 C 317.2383 380.0125 326.9991 379.1771 336.9418 378.7621 C 346.7525 378.6019 356.5389 378.6984 366.3488 378.8833 C 376.3577 379.2237 386.3002 379.8441 396.2688 380.7566 C 405.1012 381.6299 413.8565 382.5109 422.6055 383.9604 C 430.3399 385.5853 438.0334 387.3349 445.7189 389.1551 C 447.4101 389.5726 449.0919 390.0074 450.7732 390.4597 L 444.9703 412.8099 C 443.5252 412.4085 442.0823 412.028 440.6258 411.6652 C 433.2838 409.9084 425.9305 408.2598 418.5381 406.703 C 410.4323 405.2947 402.3192 404.4211 394.1265 403.5832 C 384.7449 402.7264 375.3904 402.0738 365.9709 401.7653 C 356.5184 401.6247 347.0808 401.5236 337.6281 401.6656 C 328.6329 402.0831 319.7353 402.8061 310.8031 403.8919 C 300.8298 405.7292 292.3186 408.2696 283.3422 412.7823 C 276.0617 417.9008 270.3262 423.2934 264.8448 430.1307 C 263.0085 433.1495 260.2486 442.2428 261.2515 434.8693 L 238.118 434.8693 z " /><path
   style="fill:#ff0000;fill-rule:nonzero;stroke:none;fill-opacity:1;stroke-opacity:1;stroke-width:1pt;stroke-linejoin:miter;stroke-linecap:butt;"
   id="path609"
   d="M 259.8069 435.9443 C 256.6297 440.1503 252.6564 443.6052 248.8912 447.3674 C 247.4857 448.9671 246.2321 450.5575 245.0501 452.3106 L 226.4525 439.4425 C 228.4286 436.5645 230.4863 433.8829 232.7794 431.2233 C 234.0613 429.878 242.1972 420.4046 239.5024 424.517 L 259.8069 435.9443 z " /><path
   style="fill:black;fill-rule:nonzero;stroke:none;fill-opacity:1;stroke-opacity:1;stroke-width:1pt;stroke-linejoin:miter;stroke-linecap:butt;"
   id="path610"
   d="M 240.469 460.4856 C 242.0668 467.6597 242.5857 474.9545 243.213 482.2546 C 243.9903 495.8561 244.3778 509.4265 244.4885 523.0473 C 244.4296 534.2931 244.205 545.5313 243.9703 556.7749 C 243.3974 571.0159 242.0874 584.3865 238.6359 598.2637 C 233.313 612.0452 226.8897 624.4962 218.9728 637.1088 C 211.627 647.7258 203.984 657.6438 195.0192 667.085 C 187.2952 673.3688 179.9845 677.8868 170.6561 681.7395 C 169.2101 682.2891 167.7652 682.8394 166.3236 683.399 L 158.3612 661.7554 C 159.852 661.1772 161.3443 660.6028 162.8364 660.0272 C 169.3017 657.3903 174.5292 654.5009 180.0015 650.2966 C 187.8669 642.2153 194.4333 633.6079 200.8024 624.4278 C 207.6071 613.7126 213.2133 603.285 217.6982 591.5196 C 220.6116 579.8058 221.5981 568.5073 221.9797 556.4838 C 222.0731 545.3093 222.3048 534.1395 222.4972 522.9663 C 222.5216 510.0188 222.1848 497.172 221.2748 484.2525 C 220.9728 481.7102 219.5676 468.6224 218.7431 468.6371 L 240.469 460.4856 z " /><path
   style="fill:black;fill-rule:nonzero;stroke:none;fill-opacity:1;stroke-opacity:1;stroke-width:1pt;stroke-linejoin:miter;stroke-linecap:butt;"
   id="path611"
   d="M 386.9318 642.6009 C 386.7461 641.5587 388.5556 655.4709 388.9618 659.4292 C 389.8545 673.3522 389.9647 686.5184 388.0935 700.3631 C 383.8808 713.8763 378.344 723.2876 368.5396 733.8832 C 360.5462 741.274 352.415 748.4726 344.0016 755.4344 C 335.419 761.7615 327.5951 765.852 317.2433 769.0573 C 309.083 770.5846 301.2719 771.1698 292.9554 771.2668 L 292.9783 748.4941 C 299.4298 748.3747 305.5282 747.9681 311.8558 746.769 C 319.0843 744.5037 324.3736 741.6075 330.4313 737.2489 C 338.2837 730.8669 345.8506 724.2656 353.2393 717.4066 C 359.6696 710.5338 363.5899 704.6391 366.4991 695.8754 C 368.2117 684.3225 367.888 673.3929 366.9455 661.7677 C 366.1044 655.3264 364.773 648.9995 363.7983 642.6009 L 386.9318 642.6009 z " /><path
   style="fill:black;fill-rule:nonzero;stroke:none;fill-opacity:1;stroke-opacity:1;stroke-width:1pt;stroke-linejoin:miter;stroke-linecap:butt;"
   id="path612"
   d="M 373.8527 507.7411 C 375.1099 500.774 378.0657 496.6509 382.8659 491.2611 C 388.4275 486.6954 393.6522 483.7134 400.4301 480.9876 L 407.4741 502.8192 C 404.0644 504.1554 401.426 505.5454 398.6529 507.8476 C 396.1498 510.7486 396.4444 511.401 396.9862 507.7411 L 373.8527 507.7411 z " /><path
   style="fill:black;fill-rule:nonzero;stroke:none;fill-opacity:1;stroke-opacity:1;stroke-width:1pt;stroke-linejoin:miter;stroke-linecap:butt;"
   id="path619"
   d="M 447.4819 525.9667 C 451.9919 526.3204 456.5364 526.3038 461.0588 526.3876 C 472.1577 526.7954 482.9576 527.4453 493.9074 529.2093 C 501.9454 531.2528 509.4662 533.7206 517.0823 536.8927 L 507.7599 557.878 C 501.7866 555.2456 495.8361 553.2776 489.4903 551.5966 C 480.0214 550.005 470.6739 549.6022 461.0588 549.4069 C 456.5364 549.4907 451.9919 549.4741 447.4819 549.8277 L 447.4819 525.9667 z " /><path
   style="fill:black;fill-rule:nonzero;stroke:none;fill-opacity:1;stroke-opacity:1;stroke-width:1pt;stroke-linejoin:miter;stroke-linecap:butt;"
   id="path620"
   d="M 452.5091 552.8977 C 449.8831 553.1996 461.2001 552.1462 463.4148 552.0105 C 472.9062 551.6636 482.3847 551.5269 491.883 551.4973 C 498.4016 551.2806 504.0612 551.2177 509.9126 548.3922 L 520.6077 568.8252 C 510.8686 573.0626 502.5052 574.1556 491.8213 574.439 C 482.8038 574.4349 473.8376 574.5794 464.8361 575.0933 C 460.6821 575.5101 443.2209 576.2182 439.1032 576.7586 L 452.5091 552.8977 z "
   sodipodi:nodetypes="ccccccccc" /><path
   style="fill:black;fill-rule:nonzero;stroke:none;fill-opacity:1;stroke-opacity:1;stroke-width:1pt;stroke-linejoin:miter;stroke-linecap:butt;"
   id="path621"
   d="M 504.4569 533.8877 C 509.8301 534.3506 514.6037 535.5387 519.7369 537.0967 C 532.0543 543.1365 538.3818 548.9256 544.5432 560.6562 C 545.1118 563.9035 545.306 566.6066 545.232 569.8989 L 522.8557 567.6553 C 523.0601 567.8321 523.0061 567.829 523.1385 567.5935 C 521.2911 563.2096 516.8387 561.1347 512.5047 559.0433 C 509.805 558.2991 507.2845 557.5129 504.4569 557.7486 L 504.4569 533.8877 z " /><path
   style="fill:black;fill-rule:nonzero;stroke:none;fill-opacity:1;stroke-opacity:1;stroke-width:1pt;stroke-linejoin:miter;stroke-linecap:butt;"
   id="path622"
   d="M 361.1807 649.3805 C 363.4 645.0064 374.1424 626.3149 376.1673 621.695 C 380.0843 611.4535 384.4451 602.2953 390.5121 593.0166 C 397.4297 584.7338 404.3341 578.4526 413.6014 572.5682 C 420.96 568.4113 428.0133 564.489 435.9729 561.4592 C 437.9442 560.9459 456.6413 554.1675 458.6437 553.776 L 445.7772 582.9058 C 444.6605 583.1131 463.6848 572.2575 462.584 572.5302 C 456.2449 574.8918 430.5096 589.3721 424.6648 592.6788 C 418.0734 596.7262 413.2516 600.9173 408.295 606.694 C 403.2044 614.3547 399.9915 621.9626 396.8383 630.4907 C 395.6757 633.3316 383.274 646.2978 391.2852 643.2745 L 361.1807 649.3805 z "
   sodipodi:nodetypes="ccccccccccccc" /><path
   style="fill:black;fill-rule:nonzero;stroke:none;fill-opacity:1;stroke-opacity:1;stroke-width:1pt;stroke-linejoin:miter;stroke-linecap:butt;"
   id="path623"
   d="M 458.9884 415.9731 C 458.8652 416.2326 460.2528 423.339 460.845 426.0419 C 463.248 437.4952 464.9579 448.7949 465.9726 460.433 C 466.3518 470.2583 466.2289 479.9749 465.8238 489.7978 C 465.4905 497.9937 465.3185 506.1954 464.9286 514.387 C 464.4768 517.9462 467.2143 530.8746 466.3845 534.3723 L 441.429 518.7256 C 441.9354 516.702 445.6408 527.3798 445.9229 525.3167 C 446.2929 517.35 443.1621 496.7018 443.5244 488.7328 C 443.9123 479.7736 444.1287 470.8802 443.896 461.9155 C 443.0654 451.6266 441.534 441.7404 439.2049 431.6596 C 437.8305 426.4388 436.4416 421.3261 435.8549 415.9731 L 458.9884 415.9731 z "
   sodipodi:nodetypes="ccccccccccccc" /><path
   style="fill:black;fill-rule:nonzero;stroke:none;fill-opacity:1;stroke-opacity:1;stroke-width:1pt;stroke-linejoin:miter;stroke-linecap:butt;"
   id="path626"
   d="M 391.9944 619.5941 C 390.8064 616.8605 392.1946 619.7779 392.5948 620.3533 L 410.4654 605.4823 C 410.8109 605.9571 413.2804 610.5365 412.299 608.1669 L 391.9944 619.5941 z " /></svg>
