^C:\USERS\SCHEREZADE\DESKTOP\GITPROJECTS\VERNIY\DJINN AND TONIC - EROBEATS\DJINN AND TONIC - EROBEATS\IOAPI.C|C:\USERS\SCHEREZADE\DESKTOP\GITPROJECTS\VERNIY\DJINN AND TONIC - EROBEATS\DJINN AND TONIC - EROBEATS\IOWIN32.C|C:\USERS\SCHEREZADE\DESKTOP\GITPROJECTS\VERNIY\DJINN AND TONIC - EROBEATS\DJINN AND TONIC - EROBEATS\MZTOOLS.C|C:\USERS\SCHEREZADE\DESKTOP\GITPROJECTS\VERNIY\DJINN AND TONIC - EROBEATS\DJINN AND TONIC - EROBEATS\UNZIP.C|C:\USERS\SCHEREZADE\DESKTOP\GITPROJECTS\VERNIY\DJINN AND TONIC - EROBEATS\DJINN AND TONIC - EROBEATS\ZIP.C
C:\USERS\SCHEREZADE\DESKTOP\GITPROJECTS\VERNIY\DJINN AND TONIC - EROBEATS\DJINN AND TONIC - EROBEATS\RELEASE\VC140.PDB
C:\USERS\SCHEREZADE\DESKTOP\GITPROJECTS\VERNIY\DJINN AND TONIC - EROBEATS\DJINN AND TONIC - EROBEATS\RELEASE\ZIP.OBJ
C:\USERS\SCHEREZADE\DESKTOP\GITPROJECTS\VERNIY\DJINN AND TONIC - EROBEATS\DJINN AND TONIC - EROBEATS\RELEASE\UNZIP.OBJ
C:\USERS\SCHEREZADE\DESKTOP\GITPROJECTS\VERNIY\DJINN AND TONIC - EROBEATS\DJINN AND TONIC - EROBEATS\RELEASE\MZTOOLS.OBJ
C:\USERS\SCHEREZADE\DESKTOP\GITPROJECTS\VERNIY\DJINN AND TONIC - EROBEATS\DJINN AND TONIC - EROBEATS\RELEASE\IOWIN32.OBJ
C:\USERS\SCHEREZADE\DESKTOP\GITPROJECTS\VERNIY\DJINN AND TONIC - EROBEATS\DJINN AND TONIC - EROBEATS\RELEASE\IOAPI.OBJ
^C:\USERS\SCHEREZADE\DESKTOP\GITPROJECTS\VERNIY\DJINN AND TONIC - EROBEATS\DJINN AND TONIC - EROBEATS\IOAPI.C
C:\USERS\SCHEREZADE\DESKTOP\GITPROJECTS\VERNIY\DJINN AND TONIC - EROBEATS\DJINN AND TONIC - EROBEATS\RELEASE\VC140.PDB
^C:\USERS\SCHEREZADE\DESKTOP\GITPROJECTS\VERNIY\DJINN AND TONIC - EROBEATS\DJINN AND TONIC - EROBEATS\IOWIN32.C
C:\USERS\SCHEREZADE\DESKTOP\GITPROJECTS\VERNIY\DJINN AND TONIC - EROBEATS\DJINN AND TONIC - EROBEATS\RELEASE\VC140.PDB
^C:\USERS\SCHEREZADE\DESKTOP\GITPROJECTS\VERNIY\DJINN AND TONIC - EROBEATS\DJINN AND TONIC - EROBEATS\MZTOOLS.C
C:\USERS\SCHEREZADE\DESKTOP\GITPROJECTS\VERNIY\DJINN AND TONIC - EROBEATS\DJINN AND TONIC - EROBEATS\RELEASE\VC140.PDB
^C:\USERS\SCHEREZADE\DESKTOP\GITPROJECTS\VERNIY\DJINN AND TONIC - EROBEATS\DJINN AND TONIC - EROBEATS\UNZIP.C
C:\USERS\SCHEREZADE\DESKTOP\GITPROJECTS\VERNIY\DJINN AND TONIC - EROBEATS\DJINN AND TONIC - EROBEATS\RELEASE\VC140.PDB
^C:\USERS\SCHEREZADE\DESKTOP\GITPROJECTS\VERNIY\DJINN AND TONIC - EROBEATS\DJINN AND TONIC - EROBEATS\ZIP.C
C:\USERS\SCHEREZADE\DESKTOP\GITPROJECTS\VERNIY\DJINN AND TONIC - EROBEATS\DJINN AND TONIC - EROBEATS\RELEASE\VC140.PDB
^C:\USERS\SCHEREZADE\DESKTOP\GITPROJECTS\VERNIY\DJINN AND TONIC - EROBEATS\DJINN AND TONIC - EROBEATS\ANIMATION.CPP|C:\USERS\SCHEREZADE\DESKTOP\GITPROJECTS\VERNIY\DJINN AND TONIC - EROBEATS\DJINN AND TONIC - EROBEATS\BGM.CPP|C:\USERS\SCHEREZADE\DESKTOP\GITPROJECTS\VERNIY\DJINN AND TONIC - EROBEATS\DJINN AND TONIC - EROBEATS\ENDCARD.CPP|C:\USERS\SCHEREZADE\DESKTOP\GITPROJECTS\VERNIY\DJINN AND TONIC - EROBEATS\DJINN AND TONIC - EROBEATS\FILEIO.CPP|C:\USERS\SCHEREZADE\DESKTOP\GITPROJECTS\VERNIY\DJINN AND TONIC - EROBEATS\DJINN AND TONIC - EROBEATS\FONTS.CPP|C:\USERS\SCHEREZADE\DESKTOP\GITPROJECTS\VERNIY\DJINN AND TONIC - EROBEATS\DJINN AND TONIC - EROBEATS\LANGUAGE.CPP|C:\USERS\SCHEREZADE\DESKTOP\GITPROJECTS\VERNIY\DJINN AND TONIC - EROBEATS\DJINN AND TONIC - EROBEATS\LEVEL1.CPP|C:\USERS\SCHEREZADE\DESKTOP\GITPROJECTS\VERNIY\DJINN AND TONIC - EROBEATS\DJINN AND TONIC - EROBEATS\LEVEL2.CPP|C:\USERS\SCHEREZADE\DESKTOP\GITPROJECTS\VERNIY\DJINN AND TONIC - EROBEATS\DJINN AND TONIC - EROBEATS\LEVEL3.CPP|C:\USERS\SCHEREZADE\DESKTOP\GITPROJECTS\VERNIY\DJINN AND TONIC - EROBEATS\DJINN AND TONIC - EROBEATS\LEVEL4.CPP|C:\USERS\SCHEREZADE\DESKTOP\GITPROJECTS\VERNIY\DJINN AND TONIC - EROBEATS\DJINN AND TONIC - EROBEATS\LEVEL5.CPP|C:\USERS\SCHEREZADE\DESKTOP\GITPROJECTS\VERNIY\DJINN AND TONIC - EROBEATS\DJINN AND TONIC - EROBEATS\LEVELSELECT.CPP|C:\USERS\SCHEREZADE\DESKTOP\GITPROJECTS\VERNIY\DJINN AND TONIC - EROBEATS\DJINN AND TONIC - EROBEATS\LEVELTEMPLATE.CPP|C:\USERS\SCHEREZADE\DESKTOP\GITPROJECTS\VERNIY\DJINN AND TONIC - EROBEATS\DJINN AND TONIC - EROBEATS\MAIN.CPP|C:\USERS\SCHEREZADE\DESKTOP\GITPROJECTS\VERNIY\DJINN AND TONIC - EROBEATS\DJINN AND TONIC - EROBEATS\MENU.CPP|C:\USERS\SCHEREZADE\DESKTOP\GITPROJECTS\VERNIY\DJINN AND TONIC - EROBEATS\DJINN AND TONIC - EROBEATS\MESSAGEBOX.CPP|C:\USERS\SCHEREZADE\DESKTOP\GITPROJECTS\VERNIY\DJINN AND TONIC - EROBEATS\DJINN AND TONIC - EROBEATS\MODESELECT.CPP|C:\USERS\SCHEREZADE\DESKTOP\GITPROJECTS\VERNIY\DJINN AND TONIC - EROBEATS\DJINN AND TONIC - EROBEATS\MUSICROOM.CPP|C:\USERS\SCHEREZADE\DESKTOP\GITPROJECTS\VERNIY\DJINN AND TONIC - EROBEATS\DJINN AND TONIC - EROBEATS\RESOURCEMASTER.CPP|C:\USERS\SCHEREZADE\DESKTOP\GITPROJECTS\VERNIY\DJINN AND TONIC - EROBEATS\DJINN AND TONIC - EROBEATS\RHYTHMIO.CPP|C:\USERS\SCHEREZADE\DESKTOP\GITPROJECTS\VERNIY\DJINN AND TONIC - EROBEATS\DJINN AND TONIC - EROBEATS\SCREENTEMPLATE.CPP|C:\USERS\SCHEREZADE\DESKTOP\GITPROJECTS\VERNIY\DJINN AND TONIC - EROBEATS\DJINN AND TONIC - EROBEATS\SDLGRAPHICS.CPP|C:\USERS\SCHEREZADE\DESKTOP\GITPROJECTS\VERNIY\DJINN AND TONIC - EROBEATS\DJINN AND TONIC - EROBEATS\SETTINGS.CPP|C:\USERS\SCHEREZADE\DESKTOP\GITPROJECTS\VERNIY\DJINN AND TONIC - EROBEATS\DJINN AND TONIC - EROBEATS\SETTINGSINIT.CPP|C:\USERS\SCHEREZADE\DESKTOP\GITPROJECTS\VERNIY\DJINN AND TONIC - EROBEATS\DJINN AND TONIC - EROBEATS\SFX.CPP|C:\USERS\SCHEREZADE\DESKTOP\GITPROJECTS\VERNIY\DJINN AND TONIC - EROBEATS\DJINN AND TONIC - EROBEATS\SPLASHSCREEN.CPP|C:\USERS\SCHEREZADE\DESKTOP\GITPROJECTS\VERNIY\DJINN AND TONIC - EROBEATS\DJINN AND TONIC - EROBEATS\TEMPOTOOLS.CPP|C:\USERS\SCHEREZADE\DESKTOP\GITPROJECTS\VERNIY\DJINN AND TONIC - EROBEATS\DJINN AND TONIC - EROBEATS\TRAINER.CPP
C:\USERS\SCHEREZADE\DESKTOP\GITPROJECTS\VERNIY\DJINN AND TONIC - EROBEATS\DJINN AND TONIC - EROBEATS\RELEASE\VC140.PDB
C:\USERS\SCHEREZADE\DESKTOP\GITPROJECTS\VERNIY\DJINN AND TONIC - EROBEATS\DJINN AND TONIC - EROBEATS\RELEASE\SETTINGSINIT.OBJ
C:\USERS\SCHEREZADE\DESKTOP\GITPROJECTS\VERNIY\DJINN AND TONIC - EROBEATS\DJINN AND TONIC - EROBEATS\RELEASE\SCREENTEMPLATE.OBJ
C:\USERS\SCHEREZADE\DESKTOP\GITPROJECTS\VERNIY\DJINN AND TONIC - EROBEATS\DJINN AND TONIC - EROBEATS\RELEASE\RHYTHMIO.OBJ
C:\USERS\SCHEREZADE\DESKTOP\GITPROJECTS\VERNIY\DJINN AND TONIC - EROBEATS\DJINN AND TONIC - EROBEATS\RELEASE\MODESELECT.OBJ
C:\USERS\SCHEREZADE\DESKTOP\GITPROJECTS\VERNIY\DJINN AND TONIC - EROBEATS\DJINN AND TONIC - EROBEATS\RELEASE\MESSAGEBOX.OBJ
C:\USERS\SCHEREZADE\DESKTOP\GITPROJECTS\VERNIY\DJINN AND TONIC - EROBEATS\DJINN AND TONIC - EROBEATS\RELEASE\MENU.OBJ
C:\USERS\SCHEREZADE\DESKTOP\GITPROJECTS\VERNIY\DJINN AND TONIC - EROBEATS\DJINN AND TONIC - EROBEATS\RELEASE\MAIN.OBJ
C:\USERS\SCHEREZADE\DESKTOP\GITPROJECTS\VERNIY\DJINN AND TONIC - EROBEATS\DJINN AND TONIC - EROBEATS\RELEASE\LEVELTEMPLATE.OBJ
C:\USERS\SCHEREZADE\DESKTOP\GITPROJECTS\VERNIY\DJINN AND TONIC - EROBEATS\DJINN AND TONIC - EROBEATS\RELEASE\BGM.OBJ
C:\USERS\SCHEREZADE\DESKTOP\GITPROJECTS\VERNIY\DJINN AND TONIC - EROBEATS\DJINN AND TONIC - EROBEATS\RELEASE\LEVELSELECT.OBJ
C:\USERS\SCHEREZADE\DESKTOP\GITPROJECTS\VERNIY\DJINN AND TONIC - EROBEATS\DJINN AND TONIC - EROBEATS\RELEASE\LEVEL5.OBJ
C:\USERS\SCHEREZADE\DESKTOP\GITPROJECTS\VERNIY\DJINN AND TONIC - EROBEATS\DJINN AND TONIC - EROBEATS\RELEASE\LEVEL4.OBJ
C:\USERS\SCHEREZADE\DESKTOP\GITPROJECTS\VERNIY\DJINN AND TONIC - EROBEATS\DJINN AND TONIC - EROBEATS\RELEASE\LEVEL3.OBJ
C:\USERS\SCHEREZADE\DESKTOP\GITPROJECTS\VERNIY\DJINN AND TONIC - EROBEATS\DJINN AND TONIC - EROBEATS\RELEASE\LEVEL2.OBJ
C:\USERS\SCHEREZADE\DESKTOP\GITPROJECTS\VERNIY\DJINN AND TONIC - EROBEATS\DJINN AND TONIC - EROBEATS\RELEASE\LEVEL1.OBJ
C:\USERS\SCHEREZADE\DESKTOP\GITPROJECTS\VERNIY\DJINN AND TONIC - EROBEATS\DJINN AND TONIC - EROBEATS\RELEASE\LANGUAGE.OBJ
C:\USERS\SCHEREZADE\DESKTOP\GITPROJECTS\VERNIY\DJINN AND TONIC - EROBEATS\DJINN AND TONIC - EROBEATS\RELEASE\FONTS.OBJ
C:\USERS\SCHEREZADE\DESKTOP\GITPROJECTS\VERNIY\DJINN AND TONIC - EROBEATS\DJINN AND TONIC - EROBEATS\RELEASE\FILEIO.OBJ
C:\USERS\SCHEREZADE\DESKTOP\GITPROJECTS\VERNIY\DJINN AND TONIC - EROBEATS\DJINN AND TONIC - EROBEATS\RELEASE\ANIMATION.OBJ
C:\USERS\SCHEREZADE\DESKTOP\GITPROJECTS\VERNIY\DJINN AND TONIC - EROBEATS\DJINN AND TONIC - EROBEATS\RELEASE\TRAINER.OBJ
C:\USERS\SCHEREZADE\DESKTOP\GITPROJECTS\VERNIY\DJINN AND TONIC - EROBEATS\DJINN AND TONIC - EROBEATS\RELEASE\TEMPOTOOLS.OBJ
C:\USERS\SCHEREZADE\DESKTOP\GITPROJECTS\VERNIY\DJINN AND TONIC - EROBEATS\DJINN AND TONIC - EROBEATS\RELEASE\SPLASHSCREEN.OBJ
C:\USERS\SCHEREZADE\DESKTOP\GITPROJECTS\VERNIY\DJINN AND TONIC - EROBEATS\DJINN AND TONIC - EROBEATS\RELEASE\SDLGRAPHICS.OBJ
C:\USERS\SCHEREZADE\DESKTOP\GITPROJECTS\VERNIY\DJINN AND TONIC - EROBEATS\DJINN AND TONIC - EROBEATS\RELEASE\SETTINGS.OBJ
C:\USERS\SCHEREZADE\DESKTOP\GITPROJECTS\VERNIY\DJINN AND TONIC - EROBEATS\DJINN AND TONIC - EROBEATS\RELEASE\RESOURCEMASTER.OBJ
C:\USERS\SCHEREZADE\DESKTOP\GITPROJECTS\VERNIY\DJINN AND TONIC - EROBEATS\DJINN AND TONIC - EROBEATS\RELEASE\MUSICROOM.OBJ
C:\USERS\SCHEREZADE\DESKTOP\GITPROJECTS\VERNIY\DJINN AND TONIC - EROBEATS\DJINN AND TONIC - EROBEATS\RELEASE\SFX.OBJ
^C:\USERS\SCHEREZADE\DESKTOP\GITPROJECTS\VERNIY\DJINN AND TONIC - EROBEATS\DJINN AND TONIC - EROBEATS\FONTS.CPP
C:\USERS\SCHEREZADE\DESKTOP\GITPROJECTS\VERNIY\DJINN AND TONIC - EROBEATS\DJINN AND TONIC - EROBEATS\RELEASE\FONTS.OBJ
^C:\USERS\SCHEREZADE\DESKTOP\GITPROJECTS\VERNIY\DJINN AND TONIC - EROBEATS\DJINN AND TONIC - EROBEATS\LANGUAGE.CPP
C:\USERS\SCHEREZADE\DESKTOP\GITPROJECTS\VERNIY\DJINN AND TONIC - EROBEATS\DJINN AND TONIC - EROBEATS\RELEASE\LANGUAGE.OBJ
^C:\USERS\SCHEREZADE\DESKTOP\GITPROJECTS\VERNIY\DJINN AND TONIC - EROBEATS\DJINN AND TONIC - EROBEATS\LEVEL1.CPP
C:\USERS\SCHEREZADE\DESKTOP\GITPROJECTS\VERNIY\DJINN AND TONIC - EROBEATS\DJINN AND TONIC - EROBEATS\RELEASE\LEVEL1.OBJ
^C:\USERS\SCHEREZADE\DESKTOP\GITPROJECTS\VERNIY\DJINN AND TONIC - EROBEATS\DJINN AND TONIC - EROBEATS\LEVEL2.CPP
C:\USERS\SCHEREZADE\DESKTOP\GITPROJECTS\VERNIY\DJINN AND TONIC - EROBEATS\DJINN AND TONIC - EROBEATS\RELEASE\LEVEL2.OBJ
^C:\USERS\SCHEREZADE\DESKTOP\GITPROJECTS\VERNIY\DJINN AND TONIC - EROBEATS\DJINN AND TONIC - EROBEATS\LEVEL3.CPP
C:\USERS\SCHEREZADE\DESKTOP\GITPROJECTS\VERNIY\DJINN AND TONIC - EROBEATS\DJINN AND TONIC - EROBEATS\RELEASE\LEVEL3.OBJ
^C:\USERS\SCHEREZADE\DESKTOP\GITPROJECTS\VERNIY\DJINN AND TONIC - EROBEATS\DJINN AND TONIC - EROBEATS\LEVEL4.CPP
C:\USERS\SCHEREZADE\DESKTOP\GITPROJECTS\VERNIY\DJINN AND TONIC - EROBEATS\DJINN AND TONIC - EROBEATS\RELEASE\LEVEL4.OBJ
^C:\USERS\SCHEREZADE\DESKTOP\GITPROJECTS\VERNIY\DJINN AND TONIC - EROBEATS\DJINN AND TONIC - EROBEATS\LEVEL5.CPP
C:\USERS\SCHEREZADE\DESKTOP\GITPROJECTS\VERNIY\DJINN AND TONIC - EROBEATS\DJINN AND TONIC - EROBEATS\RELEASE\LEVEL5.OBJ
^C:\USERS\SCHEREZADE\DESKTOP\GITPROJECTS\VERNIY\DJINN AND TONIC - EROBEATS\DJINN AND TONIC - EROBEATS\LEVELSELECT.CPP
C:\USERS\SCHEREZADE\DESKTOP\GITPROJECTS\VERNIY\DJINN AND TONIC - EROBEATS\DJINN AND TONIC - EROBEATS\RELEASE\LEVELSELECT.OBJ
^C:\USERS\SCHEREZADE\DESKTOP\GITPROJECTS\VERNIY\DJINN AND TONIC - EROBEATS\DJINN AND TONIC - EROBEATS\BGM.CPP
C:\USERS\SCHEREZADE\DESKTOP\GITPROJECTS\VERNIY\DJINN AND TONIC - EROBEATS\DJINN AND TONIC - EROBEATS\RELEASE\BGM.OBJ
^C:\USERS\SCHEREZADE\DESKTOP\GITPROJECTS\VERNIY\DJINN AND TONIC - EROBEATS\DJINN AND TONIC - EROBEATS\LEVELTEMPLATE.CPP
C:\USERS\SCHEREZADE\DESKTOP\GITPROJECTS\VERNIY\DJINN AND TONIC - EROBEATS\DJINN AND TONIC - EROBEATS\RELEASE\LEVELTEMPLATE.OBJ
^C:\USERS\SCHEREZADE\DESKTOP\GITPROJECTS\VERNIY\DJINN AND TONIC - EROBEATS\DJINN AND TONIC - EROBEATS\MENU.CPP
C:\USERS\SCHEREZADE\DESKTOP\GITPROJECTS\VERNIY\DJINN AND TONIC - EROBEATS\DJINN AND TONIC - EROBEATS\RELEASE\MENU.OBJ
^C:\USERS\SCHEREZADE\DESKTOP\GITPROJECTS\VERNIY\DJINN AND TONIC - EROBEATS\DJINN AND TONIC - EROBEATS\MESSAGEBOX.CPP
C:\USERS\SCHEREZADE\DESKTOP\GITPROJECTS\VERNIY\DJINN AND TONIC - EROBEATS\DJINN AND TONIC - EROBEATS\RELEASE\MESSAGEBOX.OBJ
^C:\USERS\SCHEREZADE\DESKTOP\GITPROJECTS\VERNIY\DJINN AND TONIC - EROBEATS\DJINN AND TONIC - EROBEATS\MODESELECT.CPP
C:\USERS\SCHEREZADE\DESKTOP\GITPROJECTS\VERNIY\DJINN AND TONIC - EROBEATS\DJINN AND TONIC - EROBEATS\RELEASE\MODESELECT.OBJ
^C:\USERS\SCHEREZADE\DESKTOP\GITPROJECTS\VERNIY\DJINN AND TONIC - EROBEATS\DJINN AND TONIC - EROBEATS\RHYTHMIO.CPP
C:\USERS\SCHEREZADE\DESKTOP\GITPROJECTS\VERNIY\DJINN AND TONIC - EROBEATS\DJINN AND TONIC - EROBEATS\RELEASE\RHYTHMIO.OBJ
^C:\USERS\SCHEREZADE\DESKTOP\GITPROJECTS\VERNIY\DJINN AND TONIC - EROBEATS\DJINN AND TONIC - EROBEATS\SCREENTEMPLATE.CPP
C:\USERS\SCHEREZADE\DESKTOP\GITPROJECTS\VERNIY\DJINN AND TONIC - EROBEATS\DJINN AND TONIC - EROBEATS\RELEASE\SCREENTEMPLATE.OBJ
^C:\USERS\SCHEREZADE\DESKTOP\GITPROJECTS\VERNIY\DJINN AND TONIC - EROBEATS\DJINN AND TONIC - EROBEATS\SETTINGSINIT.CPP
C:\USERS\SCHEREZADE\DESKTOP\GITPROJECTS\VERNIY\DJINN AND TONIC - EROBEATS\DJINN AND TONIC - EROBEATS\RELEASE\SETTINGSINIT.OBJ
^C:\USERS\SCHEREZADE\DESKTOP\GITPROJECTS\VERNIY\DJINN AND TONIC - EROBEATS\DJINN AND TONIC - EROBEATS\SFX.CPP
C:\USERS\SCHEREZADE\DESKTOP\GITPROJECTS\VERNIY\DJINN AND TONIC - EROBEATS\DJINN AND TONIC - EROBEATS\RELEASE\SFX.OBJ
^C:\USERS\SCHEREZADE\DESKTOP\GITPROJECTS\VERNIY\DJINN AND TONIC - EROBEATS\DJINN AND TONIC - EROBEATS\MUSICROOM.CPP
C:\USERS\SCHEREZADE\DESKTOP\GITPROJECTS\VERNIY\DJINN AND TONIC - EROBEATS\DJINN AND TONIC - EROBEATS\RELEASE\MUSICROOM.OBJ
^C:\USERS\SCHEREZADE\DESKTOP\GITPROJECTS\VERNIY\DJINN AND TONIC - EROBEATS\DJINN AND TONIC - EROBEATS\RESOURCEMASTER.CPP
C:\USERS\SCHEREZADE\DESKTOP\GITPROJECTS\VERNIY\DJINN AND TONIC - EROBEATS\DJINN AND TONIC - EROBEATS\RELEASE\RESOURCEMASTER.OBJ
^C:\USERS\SCHEREZADE\DESKTOP\GITPROJECTS\VERNIY\DJINN AND TONIC - EROBEATS\DJINN AND TONIC - EROBEATS\SETTINGS.CPP
C:\USERS\SCHEREZADE\DESKTOP\GITPROJECTS\VERNIY\DJINN AND TONIC - EROBEATS\DJINN AND TONIC - EROBEATS\RELEASE\SETTINGS.OBJ
^C:\USERS\SCHEREZADE\DESKTOP\GITPROJECTS\VERNIY\DJINN AND TONIC - EROBEATS\DJINN AND TONIC - EROBEATS\SDLGRAPHICS.CPP
C:\USERS\SCHEREZADE\DESKTOP\GITPROJECTS\VERNIY\DJINN AND TONIC - EROBEATS\DJINN AND TONIC - EROBEATS\RELEASE\SDLGRAPHICS.OBJ
^C:\USERS\SCHEREZADE\DESKTOP\GITPROJECTS\VERNIY\DJINN AND TONIC - EROBEATS\DJINN AND TONIC - EROBEATS\SPLASHSCREEN.CPP
C:\USERS\SCHEREZADE\DESKTOP\GITPROJECTS\VERNIY\DJINN AND TONIC - EROBEATS\DJINN AND TONIC - EROBEATS\RELEASE\SPLASHSCREEN.OBJ
^C:\USERS\SCHEREZADE\DESKTOP\GITPROJECTS\VERNIY\DJINN AND TONIC - EROBEATS\DJINN AND TONIC - EROBEATS\TEMPOTOOLS.CPP
C:\USERS\SCHEREZADE\DESKTOP\GITPROJECTS\VERNIY\DJINN AND TONIC - EROBEATS\DJINN AND TONIC - EROBEATS\RELEASE\TEMPOTOOLS.OBJ
^C:\USERS\SCHEREZADE\DESKTOP\GITPROJECTS\VERNIY\DJINN AND TONIC - EROBEATS\DJINN AND TONIC - EROBEATS\TRAINER.CPP
C:\USERS\SCHEREZADE\DESKTOP\GITPROJECTS\VERNIY\DJINN AND TONIC - EROBEATS\DJINN AND TONIC - EROBEATS\RELEASE\TRAINER.OBJ
^C:\USERS\SCHEREZADE\DESKTOP\GITPROJECTS\VERNIY\DJINN AND TONIC - EROBEATS\DJINN AND TONIC - EROBEATS\ANIMATION.CPP|C:\USERS\SCHEREZADE\DESKTOP\GITPROJECTS\VERNIY\DJINN AND TONIC - EROBEATS\DJINN AND TONIC - EROBEATS\ENDCARD.CPP|C:\USERS\SCHEREZADE\DESKTOP\GITPROJECTS\VERNIY\DJINN AND TONIC - EROBEATS\DJINN AND TONIC - EROBEATS\FILEIO.CPP
C:\USERS\SCHEREZADE\DESKTOP\GITPROJECTS\VERNIY\DJINN AND TONIC - EROBEATS\DJINN AND TONIC - EROBEATS\RELEASE\VC140.PDB
C:\USERS\SCHEREZADE\DESKTOP\GITPROJECTS\VERNIY\DJINN AND TONIC - EROBEATS\DJINN AND TONIC - EROBEATS\RELEASE\FILEIO.OBJ
C:\USERS\SCHEREZADE\DESKTOP\GITPROJECTS\VERNIY\DJINN AND TONIC - EROBEATS\DJINN AND TONIC - EROBEATS\RELEASE\ENDCARD.OBJ
C:\USERS\SCHEREZADE\DESKTOP\GITPROJECTS\VERNIY\DJINN AND TONIC - EROBEATS\DJINN AND TONIC - EROBEATS\RELEASE\ANIMATION.OBJ
^C:\USERS\SCHEREZADE\DESKTOP\GITPROJECTS\VERNIY\DJINN AND TONIC - EROBEATS\DJINN AND TONIC - EROBEATS\ANIMATION.CPP
C:\USERS\SCHEREZADE\DESKTOP\GITPROJECTS\VERNIY\DJINN AND TONIC - EROBEATS\DJINN AND TONIC - EROBEATS\RELEASE\VC140.PDB
^C:\USERS\SCHEREZADE\DESKTOP\GITPROJECTS\VERNIY\DJINN AND TONIC - EROBEATS\DJINN AND TONIC - EROBEATS\ENDCARD.CPP
C:\USERS\SCHEREZADE\DESKTOP\GITPROJECTS\VERNIY\DJINN AND TONIC - EROBEATS\DJINN AND TONIC - EROBEATS\RELEASE\VC140.PDB
^C:\USERS\SCHEREZADE\DESKTOP\GITPROJECTS\VERNIY\DJINN AND TONIC - EROBEATS\DJINN AND TONIC - EROBEATS\FILEIO.CPP
C:\USERS\SCHEREZADE\DESKTOP\GITPROJECTS\VERNIY\DJINN AND TONIC - EROBEATS\DJINN AND TONIC - EROBEATS\RELEASE\VC140.PDB
C:\USERS\SCHEREZADE\DESKTOP\GITPROJECTS\VERNIY\DJINN AND TONIC - EROBEATS\DJINN AND TONIC - EROBEATS\RELEASE\FILEIO.OBJ
^C:\USERS\SCHEREZADE\DESKTOP\GITPROJECTS\VERNIY\DJINN AND TONIC - EROBEATS\DJINN AND TONIC - EROBEATS\MAIN.CPP
C:\USERS\SCHEREZADE\DESKTOP\GITPROJECTS\VERNIY\DJINN AND TONIC - EROBEATS\DJINN AND TONIC - EROBEATS\RELEASE\VC140.PDB
C:\USERS\SCHEREZADE\DESKTOP\GITPROJECTS\VERNIY\DJINN AND TONIC - EROBEATS\DJINN AND TONIC - EROBEATS\RELEASE\MAIN.OBJ
