{
  "name": "ZSAdSDK",
  "version": "1.0.2",
  "summary": "我的广告SDK",
  "homepage": "https://github.com/GYCocoa/GYSDK",
  "license": "MIT",
  "authors": {
    "GYZ": "401812221@qq.com"
  },
  "platforms": {
    "ios": "11.0"
  },
  "source": {
    "git": "https://github.com/GYCocoa/GYSDK.git",
    "tag": "1.0.2"
  },
  "source_files": [
    "GYSDK",
    "ZSAdSDK/ZSAdSDK/Base/*.{h,m}"
  ],
  "frameworks": "UIKit",
  "vendored_frameworks": [
    "ZSAdSDK/ZSAdSDK/Base/Framework_01.framework",
    "ZSAdSDK/ZSAdSDK/Base/GDTFramework/GDTMobSDK.xcframework",
    "ZSAdSDK/ZSAdSDK/Base/GDTFramework/Tquic.xcframework",
    "ZSAdSDK/ZSAdSDK/Base/KSAdSDK/KSAdSDK.xcframework",
    "ZSAdSDK/ZSAdSDK/Base/BaiduMobAdSDK/BaiduMobAdSDK.framework",
    "ZSAdSDK/ZSAdSDK/Base/SigmobSDK/WindFoundation.xcframework",
    "ZSAdSDK/ZSAdSDK/Base/SigmobSDK/WindSDK.xcframework"
  ],
  "resources": "ZSAdSDK/ZSAdSDK/Base",
  "requires_arc": true,
  "pod_target_xcconfig": {
    "VALID_ARCHS": "x86_64 armv7 arm64"
  },
  "dependencies": {
    "SensorsAnalyticsSDK": [

    ]
  }
}
