{
  "name": "mobileid-wallet-core-sdk",
  "version": "1.0.0-beta.1",
  "summary": "Amadeus MobileId WalletSDK",
  "description": "MobileID Wallet SDK providing an API for the MobileID wallet services .",
  "homepage": "https://www.amadeus.com",
  "license": {
    "type": "Amadeus MobileId Wallet SDK License Agreement",
    "file": "WalletSDKCore/LICENSE.md"
  },
  "authors": {
    "Amadeus IT Group, S.A": "mobile.apps@vision-box.com"
  },
  "source": {
    "http": "https://vbmobileidstorage.blob.core.windows.net/ios/MobileIdSDKiOS/WalletSDKCore/WalletSDKCore-1.0.0-beta.1.zip"
  },
  "ios": {
    "vendored_frameworks": "WalletSDKCore/WalletSDKCore.xcframework"
  },
  "platforms": {
    "ios": "15.0"
  },
  "swift_versions": [
    "5"
  ],
  "dependencies": {
    "mobileid-wallet-common-sdk": [
      "1.0.0-beta.1"
    ],
    "WalletLibrary": [
      "1.0.1"
    ]
  },
  "swift_version": "5"
}
