{
  "name": "FaceSDKNightly",
  "version": "6.4.2340",
  "summary": "Framework for face matching, face recognition, and liveness detection",
  "license": {
    "type": "commercial",
    "text": "    © 2025 RegulaForensics. All rights reserved.\n"
  },
  "homepage": "https://mobile.regulaforensics.com",
  "authors": {
    "RegulaForensics": "support@regulaforensics.com"
  },
  "source": {
    "http": "https://pods.regulaforensics.com/Nightly/FaceSDKNightly/6.4.2340/FaceSDKNightly-6.4.2340.zip"
  },
  "platforms": {
    "ios": "12.0.0"
  },
  "ios": {
    "vendored_frameworks": "FaceSDK.xcframework"
  },
  "dependencies": {
    "RegulaCommonNightly": [
      "7.6.971"
    ]
  }
}
