{
	"name": "Beagle skin",
	"version": "1.25.0",
	"author": [
		"Garret LaSage (original)",
		"[http://saper.info Marcin Cieślak] (rewrite)"
	],
	"url": "http://repo.or.cz/BeagleSkin.git",
	"descriptionmsg": "beagle-desc",
	"type": "skin",
	"ValidSkinNames": {
		"beagle": "Beagle"
	},
	"AutoloadClasses": {
		"SkinBeagle": "Beagle.php"
	},
	"ResourceModules": {
		"skins.beagle.css": {
			"position": "top",
			"styles": {
				"main.css": {
					"media": "screen"
				}
			}
		}
	},
	"ResourceFileModulePaths": {
		"localBasePath": "",
		"remoteBasePath": "skins/beagle"
	},
	"MessagesDirs": {
		"SkinBeagle" : "i18n"
	},
	"manifest_version": 1
}
