# mkinitcpio preset file for kernel26

########################################
# DO NEVER EDIT THIS LINE:
source /etc/mkinitcpio.d/kernel26.kver
########################################

PRESETS=('default' 'fallback')

default_config="/etc/mkinitcpio.conf"
default_image="/boot/kernel26.img"

fallback_config="/etc/mkinitcpio.d/kernel26-fallback.conf"
fallback_image="/boot/kernel26-fallback.img" 
