{
	"on":	{
		"16":	"images/AKS_on_16.png",
		"32":	"images/AKS_on_32.png",
		"48":	"images/AKS_on_48.png",
		"128":	"images/AKS_on_128.png"
	},
	"off":	{
		"16":	"images/AKS_off_16.png",
		"32":	"images/AKS_off_32.png",
		"48":	"images/AKS_off_48.png",
		"128":	"images/AKS_off_128.png"
	}
}
