\relax 
\catcode`"\active
\select@language{brazil}
\@writefile{toc}{\select@language{brazil}}
\@writefile{lof}{\select@language{brazil}}
\@writefile{lot}{\select@language{brazil}}
\citation{GO}
\citation{CSP}
\@writefile{toc}{\contentsline {chapter}{\numberline {1}Introdu\IeC {\c c}\IeC {\~a}o}{3}}
\@writefile{toc}{\contentsline {chapter}{\numberline {2}Primeiros Passos}{4}}
\@writefile{toc}{\contentsline {section}{\numberline {2.1}Instala\IeC {\c c}\IeC {\~a}o}{4}}
\@writefile{toc}{\contentsline {section}{\numberline {2.2}Utiliza\IeC {\c c}\IeC {\~a}o}{4}}
\@writefile{toc}{\contentsline {chapter}{\numberline {3}Mecanismos de Programa\IeC {\c c}\IeC {\~a}o Concorrente}{5}}
\@writefile{toc}{\contentsline {section}{\numberline {3.1}Gorotinas}{5}}
\@writefile{toc}{\contentsline {section}{\numberline {3.2}Channel}{5}}
\@writefile{toc}{\contentsline {section}{\numberline {3.3}go}{6}}
\@writefile{toc}{\contentsline {section}{\numberline {3.4}select}{6}}
\@writefile{toc}{\contentsline {chapter}{\numberline {4}Pr\IeC {\'a}tica}{8}}
\@writefile{toc}{\contentsline {section}{\numberline {4.1}Compilando e executando os exemplos}{8}}
\@writefile{toc}{\contentsline {section}{\numberline {4.2}Hello, World!}{8}}
\@writefile{lol}{\contentsline {lstlisting}{../hello.go}{8}}
\@writefile{toc}{\contentsline {section}{\numberline {4.3}Fun\IeC {\c c}\IeC {\~o}es Auxiliares}{8}}
\@writefile{lol}{\contentsline {lstlisting}{../pc\textunderscore channel.go}{8}}
\@writefile{lol}{\contentsline {lstlisting}{../pc\textunderscore channel.go}{9}}
\@writefile{lol}{\contentsline {lstlisting}{../pc\textunderscore channel.go}{9}}
\@writefile{lol}{\contentsline {lstlisting}{../pc\textunderscore channel.go}{9}}
\@writefile{lol}{\contentsline {lstlisting}{../pc\textunderscore channel.go}{9}}
\@writefile{lol}{\contentsline {lstlisting}{../pc\textunderscore channel.go}{9}}
\@writefile{lol}{\contentsline {lstlisting}{../pc\textunderscore monitor\textunderscore cond.go}{9}}
\@writefile{lol}{\contentsline {lstlisting}{../pc\textunderscore monitor\textunderscore cond.go}{9}}
\@writefile{toc}{\contentsline {section}{\numberline {4.4}Constantes}{10}}
\@writefile{lol}{\contentsline {lstlisting}{../pc\textunderscore mutex.go}{10}}
\@writefile{toc}{\contentsline {section}{\numberline {4.5}Destrui\IeC {\c c}\IeC {\~a}o (de vari\IeC {\'a}veis)}{10}}
\@writefile{toc}{\contentsline {section}{\numberline {4.6}Mutex}{10}}
\@writefile{lol}{\contentsline {lstlisting}{../pc\textunderscore mutex.go}{10}}
\@writefile{toc}{\contentsline {section}{\numberline {4.7}Sem\IeC {\'a}foro}{11}}
\@writefile{lol}{\contentsline {lstlisting}{../pc\textunderscore sem.go}{12}}
\@writefile{toc}{\contentsline {section}{\numberline {4.8}Monitor}{13}}
\@writefile{lol}{\contentsline {lstlisting}{../pc\textunderscore monitor.go}{13}}
\newlabel{Monitor}{{4.8}{15}}
\@writefile{toc}{\contentsline {section}{\numberline {4.9}Vari\IeC {\'a}vel de Condi\IeC {\c c}\IeC {\~a}o}{15}}
\@writefile{lol}{\contentsline {lstlisting}{../pc\textunderscore monitor\textunderscore cond.go}{15}}
\@writefile{toc}{\contentsline {section}{\numberline {4.10}The Go Way}{17}}
\@writefile{lol}{\contentsline {lstlisting}{../pc\textunderscore channel.go}{17}}
\@writefile{toc}{\contentsline {section}{\numberline {4.11}M\IeC {\'u}ltiplos Produtores e Consumidores}{18}}
\@writefile{lol}{\contentsline {lstlisting}{../pc\textunderscore channel\textunderscore multi.go}{18}}
\@writefile{toc}{\contentsline {chapter}{\numberline {5}Conclus\IeC {\~a}o}{20}}
\bibcite{GO}{1}
\bibcite{CSP}{2}
\@writefile{toc}{\contentsline {chapter}{Refer\^encias Bibliogr\'aficas}{21}}
